{
    "coord":{
       "lon":-74.006,
       "lat":40.7143
    },
    "weather":[
       {
          "id":502,
          "main":"Rain",
          "description":"heavy intensity rain",
          "icon":"10n"
       }
    ],
    "base":"stations",
    "main":{
       "temp":279.82,
       "feels_like":275.58,
       "temp_min":276.77,
       "temp_max":281.13,
       "pressure":1016,
       "humidity":75
    },
    "visibility":10000,
    "wind":{
       "speed":7.72,
       "deg":40,
       "gust":10.8
    },
    "rain":{
       "1h":5.79
    },
    "clouds":{
       "all":100
    },
    "dt":1650333831,
    "sys":{
       "type":2,
       "id":2039034,
       "country":"US",
       "sunrise":1650276751,
       "sunset":1650325065
    },
    "timezone":-14400,
    "id":5128581,
    "name":"New York",
    "cod":200
 }