/home/zaid/java-induction/new task/induction-reconciliation-task/Reconciliation-system/Recnociliation-app/src/main/java/com/progressoft/implment/ParserFactory.java
/home/zaid/java-induction/new task/induction-reconciliation-task/Reconciliation-system/Recnociliation-app/src/main/java/com/progressoft/interfaces/ResourceReader.java
/home/zaid/java-induction/new task/induction-reconciliation-task/Reconciliation-system/Recnociliation-app/src/main/java/com/progressoft/implment/FileOrigin.java
/home/zaid/java-induction/new task/induction-reconciliation-task/Reconciliation-system/Recnociliation-app/src/main/java/com/progressoft/implment/CsvDataParserImpl.java
/home/zaid/java-induction/new task/induction-reconciliation-task/Reconciliation-system/Recnociliation-app/src/main/java/com/progressoft/implment/Main.java
/home/zaid/java-induction/new task/induction-reconciliation-task/Reconciliation-system/Recnociliation-app/src/main/java/com/progressoft/implment/JsonDataParserImpl.java
/home/zaid/java-induction/new task/induction-reconciliation-task/Reconciliation-system/Recnociliation-app/src/main/java/com/progressoft/implment/DefaultResourceReader.java
/home/zaid/java-induction/new task/induction-reconciliation-task/Reconciliation-system/Recnociliation-app/src/main/java/com/progressoft/implment/DataWriter.java
/home/zaid/java-induction/new task/induction-reconciliation-task/Reconciliation-system/Recnociliation-app/src/main/java/com/progressoft/interfaces/DataParser.java
/home/zaid/java-induction/new task/induction-reconciliation-task/Reconciliation-system/Recnociliation-app/src/main/java/com/progressoft/implment/TransactionImpl.java
/home/zaid/java-induction/new task/induction-reconciliation-task/Reconciliation-system/Recnociliation-app/src/main/java/com/progressoft/interfaces/Transaction.java
/home/zaid/java-induction/new task/induction-reconciliation-task/Reconciliation-system/Recnociliation-app/src/main/java/com/progressoft/implment/DataMatcher.java
