/home/zaid/java-induction/new task/induction-reconciliation-task/Reconciliation-system/reconciliation-war/src/main/java/com/progressoft/util/FilesUtils.java
/home/zaid/java-induction/new task/induction-reconciliation-task/Reconciliation-system/reconciliation-war/src/main/java/com/progressoft/util/Main.java
/home/zaid/java-induction/new task/induction-reconciliation-task/Reconciliation-system/reconciliation-war/src/main/java/com/progressoft/database/ActivityDao.java
/home/zaid/java-induction/new task/induction-reconciliation-task/Reconciliation-system/reconciliation-war/src/main/java/com/progressoft/reconciliation/UserRegistrationServlet.java
/home/zaid/java-induction/new task/induction-reconciliation-task/Reconciliation-system/reconciliation-war/src/main/java/com/progressoft/reconciliation/FileUploaderTargetServlet.java
/home/zaid/java-induction/new task/induction-reconciliation-task/Reconciliation-system/reconciliation-war/src/main/java/com/progressoft/database/UserDao.java
/home/zaid/java-induction/new task/induction-reconciliation-task/Reconciliation-system/reconciliation-war/src/main/java/com/progressoft/reconciliation/ActivityServlet.java
/home/zaid/java-induction/new task/induction-reconciliation-task/Reconciliation-system/reconciliation-war/src/main/java/com/progressoft/reconciliation/CompareServlet.java
/home/zaid/java-induction/new task/induction-reconciliation-task/Reconciliation-system/reconciliation-war/src/main/java/com/progressoft/reconciliation/DownloadServlet.java
/home/zaid/java-induction/new task/induction-reconciliation-task/Reconciliation-system/reconciliation-war/src/main/java/com/progressoft/reconciliation/FileUploaderServlet.java
/home/zaid/java-induction/new task/induction-reconciliation-task/Reconciliation-system/reconciliation-war/src/main/java/com/progressoft/filters/SessionFilter.java
/home/zaid/java-induction/new task/induction-reconciliation-task/Reconciliation-system/reconciliation-war/src/main/java/com/progressoft/database/ActivityBean.java
/home/zaid/java-induction/new task/induction-reconciliation-task/Reconciliation-system/reconciliation-war/src/main/java/com/progressoft/database/IUserDao.java
/home/zaid/java-induction/new task/induction-reconciliation-task/Reconciliation-system/reconciliation-war/src/main/java/com/progressoft/reconciliation/ServletInitializer.java
/home/zaid/java-induction/new task/induction-reconciliation-task/Reconciliation-system/reconciliation-war/src/main/java/com/progressoft/util/DataBaseUsersLoader.java
/home/zaid/java-induction/new task/induction-reconciliation-task/Reconciliation-system/reconciliation-war/src/main/java/com/progressoft/database/UserBean.java
/home/zaid/java-induction/new task/induction-reconciliation-task/Reconciliation-system/reconciliation-war/src/main/java/com/progressoft/reconciliation/UserLogOutServlet.java
