-------------------------------------------------------------------------------
Test set: com.progressoft.jip9.compares.TransactionComparerTest
-------------------------------------------------------------------------------
Tests run: 1, Failures: 0, Errors: 0, Skipped: 0, Time elapsed: 0.094 s - in com.progressoft.jip9.compares.TransactionComparerTest
