/home/user/Desktop/ps/induction-reconciliation-task/reconciliation-system/reconciliation-webfragments/authentication-system/src/main/java/com/progressoft/jip9/UserRepo.java
/home/user/Desktop/ps/induction-reconciliation-task/reconciliation-system/reconciliation-webfragments/authentication-system/src/main/java/com/progressoft/jip9/Authenticator.java
/home/user/Desktop/ps/induction-reconciliation-task/reconciliation-system/reconciliation-webfragments/authentication-system/src/main/java/com/progressoft/jip9/User.java
/home/user/Desktop/ps/induction-reconciliation-task/reconciliation-system/reconciliation-webfragments/authentication-system/src/main/java/com/progressoft/jip9/MockUPAuthenticator.java
/home/user/Desktop/ps/induction-reconciliation-task/reconciliation-system/reconciliation-webfragments/authentication-system/src/main/java/com/progressoft/jip9/LogoutServlet.java
/home/user/Desktop/ps/induction-reconciliation-task/reconciliation-system/reconciliation-webfragments/authentication-system/src/main/java/com/progressoft/jip9/DatabaseConnection.java
/home/user/Desktop/ps/induction-reconciliation-task/reconciliation-system/reconciliation-webfragments/authentication-system/src/main/java/com/progressoft/jip9/SessionExpiredServlet.java
/home/user/Desktop/ps/induction-reconciliation-task/reconciliation-system/reconciliation-webfragments/authentication-system/src/main/java/com/progressoft/jip9/UserDetails.java
/home/user/Desktop/ps/induction-reconciliation-task/reconciliation-system/reconciliation-webfragments/authentication-system/src/main/java/com/progressoft/jip9/CanNotAccessDBExeption.java
