/home/user/Desktop/ps/induction-reconciliation-task/reconciliation-system/transaction-file-reader/src/test/java/FileValidatorTest.java
/home/user/Desktop/ps/induction-reconciliation-task/reconciliation-system/transaction-file-reader/src/test/java/SimpleFileTest.java
/home/user/Desktop/ps/induction-reconciliation-task/reconciliation-system/transaction-file-reader/src/test/java/DateValidatorTest.java
/home/user/Desktop/ps/induction-reconciliation-task/reconciliation-system/transaction-file-reader/src/test/java/TransactionDataModelTest.java
/home/user/Desktop/ps/induction-reconciliation-task/reconciliation-system/transaction-file-reader/src/test/java/JsonReaderTest.java
/home/user/Desktop/ps/induction-reconciliation-task/reconciliation-system/transaction-file-reader/src/test/java/CsvReaderTest.java
