-------------------------------------------------------------------------------
Test set: com.progressoft.jip9.MockUPAuthenticatorTest
-------------------------------------------------------------------------------
Tests run: 5, Failures: 0, Errors: 0, Skipped: 0, Time elapsed: 0.049 s - in com.progressoft.jip9.MockUPAuthenticatorTest
