-------------------------------------------------------------------------------
Test set: com.progressoft.jip9.compares.TransactionsSourceFactoryTest
-------------------------------------------------------------------------------
Tests run: 3, Failures: 0, Errors: 0, Skipped: 0, Time elapsed: 0.019 s - in com.progressoft.jip9.compares.TransactionsSourceFactoryTest
