-------------------------------------------------------------------------------
Test set: com.progressoft.jip9.AuthenticationFilterTest
-------------------------------------------------------------------------------
Tests run: 1, Failures: 0, Errors: 0, Skipped: 0, Time elapsed: 0.176 s - in com.progressoft.jip9.AuthenticationFilterTest
