/home/user/Desktop/ps/induction-reconciliation-task/reconciliation-system/transaction-file-comparer/src/main/java/com/progressoft/jip9/compares/FileParsingException.java
/home/user/Desktop/ps/induction-reconciliation-task/reconciliation-system/transaction-file-comparer/src/main/java/com/progressoft/jip9/compares/TransactionsListFactory.java
/home/user/Desktop/ps/induction-reconciliation-task/reconciliation-system/transaction-file-comparer/src/main/java/com/progressoft/jip9/compares/TransactionsComparer.java
/home/user/Desktop/ps/induction-reconciliation-task/reconciliation-system/transaction-file-comparer/src/main/java/com/progressoft/jip9/compares/WriterException.java
/home/user/Desktop/ps/induction-reconciliation-task/reconciliation-system/transaction-file-comparer/src/main/java/com/progressoft/jip9/compares/CsvFilesReportGenerator.java
/home/user/Desktop/ps/induction-reconciliation-task/reconciliation-system/transaction-file-comparer/src/main/java/com/progressoft/jip9/compares/FileDetails.java
/home/user/Desktop/ps/induction-reconciliation-task/reconciliation-system/transaction-file-comparer/src/main/java/com/progressoft/jip9/compares/JsonFilesReportGenerator.java
/home/user/Desktop/ps/induction-reconciliation-task/reconciliation-system/transaction-file-comparer/src/main/java/com/progressoft/jip9/compares/ReportGenerator.java
