-------------------------------------------------------------------------------
Test set: com.progressoft.jip9.finance.CSVfileReaderTest
-------------------------------------------------------------------------------
Tests run: 4, Failures: 0, Errors: 0, Skipped: 0, Time elapsed: 0.009 s - in com.progressoft.jip9.finance.CSVfileReaderTest
