/home/yazan/IdeaProjects/CurrencyConversion-TDD/src/main/java/com/progressoft/currencyconversion_tdd/CurrencyValidator.java
/home/yazan/IdeaProjects/CurrencyConversion-TDD/src/main/java/com/progressoft/currencyconversion_tdd/ConvertRequest.java
/home/yazan/IdeaProjects/CurrencyConversion-TDD/src/main/java/com/progressoft/currencyconversion_tdd/CurrencyConverter.java
/home/yazan/IdeaProjects/CurrencyConversion-TDD/src/main/java/com/progressoft/currencyconversion_tdd/RateSupplier.java
/home/yazan/IdeaProjects/CurrencyConversion-TDD/src/main/java/com/progressoft/currencyconversion_tdd/DummyRateSupplier.java
