com/progressoft/jip9/compare/DefaultCSVPrinter$1.class
com/progressoft/jip9/compare/DefaultComparator$CompareRequest.class
com/progressoft/jip9/compare/DefaultCSVReader.class
com/progressoft/jip9/compare/DefaultCSVPrinter.class
com/progressoft/jip9/compare/DefaultPrinter$1.class
com/progressoft/jip9/compare/DefaultPrinter.class
com/progressoft/jip9/compare/DefaultComparator$1.class
com/progressoft/jip9/compare/DefaultJSONReader.class
com/progressoft/jip9/compare/DefaultReader$1.class
com/progressoft/jip9/compare/DefaultReader.class
com/progressoft/jip9/compare/DefaultComparator.class
com/progressoft/jip9/compare/DefaultJSONPrinter.class
