<?xml version="1.0" encoding="UTF-8"?>
<testsuite xmlns:xsi="http://www.w3.org/2001/XMLSchema-instance" xsi:noNamespaceSchemaLocation="https://maven.apache.org/surefire/maven-surefire-plugin/xsd/surefire-test-report-3.0.xsd" version="3.0" name="com.progressoft.ji9.compare.ResultApiServletTest" time="0.73" tests="2" errors="0" skipped="0" failures="0">
  <properties>
    <property name="sun.desktop" value="gnome"/>
    <property name="awt.toolkit" value="sun.awt.X11.XToolkit"/>
    <property name="file.encoding.pkg" value="sun.io"/>
    <property name="java.specification.version" value="1.8"/>
    <property name="sun.cpu.isalist" value=""/>
    <property name="sun.jnu.encoding" value="UTF-8"/>
    <property name="java.class.path" value="/home/user/IdeaProjects/induction-reconciliation-task/induction-reconciliation-webapp/target/test-classes:/home/user/IdeaProjects/induction-reconciliation-task/induction-reconciliation-webapp/target/classes:/home/user/.m2/repository/javax/servlet/javax.servlet-api/4.0.1/javax.servlet-api-4.0.1.jar:/home/user/.m2/repository/javax/servlet/jstl/1.2/jstl-1.2.jar:/home/user/IdeaProjects/induction-reconciliation-task/induction-reconciliation-impl/target/induction-reconciliation-impl-1.0-SNAPSHOT.jar:/home/user/IdeaProjects/induction-reconciliation-task/induction-reconciliation-usecases/target/induction-reconciliation-usecases-1.0-SNAPSHOT.jar:/home/user/.m2/repository/com/fasterxml/jackson/core/jackson-databind/2.9.8/jackson-databind-2.9.8.jar:/home/user/.m2/repository/com/fasterxml/jackson/core/jackson-annotations/2.9.0/jackson-annotations-2.9.0.jar:/home/user/.m2/repository/com/fasterxml/jackson/core/jackson-core/2.9.8/jackson-core-2.9.8.jar:/home/user/.m2/repository/com/google/code/gson/gson/2.8.6/gson-2.8.6.jar:/home/user/IdeaProjects/induction-reconciliation-task/induction-reconciliation-model/target/induction-reconciliation-model-1.0-SNAPSHOT.jar:/home/user/.m2/repository/mysql/mysql-connector-java/8.0.19/mysql-connector-java-8.0.19.jar:/home/user/.m2/repository/com/google/protobuf/protobuf-java/3.6.1/protobuf-java-3.6.1.jar:/home/user/.m2/repository/at/favre/lib/bcrypt/0.9.0/bcrypt-0.9.0.jar:/home/user/.m2/repository/at/favre/lib/bytes/1.3.0/bytes-1.3.0.jar:/home/user/.m2/repository/org/apache/commons/commons-dbcp2/2.7.0/commons-dbcp2-2.7.0.jar:/home/user/.m2/repository/org/apache/commons/commons-pool2/2.7.0/commons-pool2-2.7.0.jar:/home/user/.m2/repository/commons-logging/commons-logging/1.2/commons-logging-1.2.jar:/home/user/.m2/repository/com/h2database/h2/1.4.200/h2-1.4.200.jar:/home/user/.m2/repository/org/mockito/mockito-core/3.5.10/mockito-core-3.5.10.jar:/home/user/.m2/repository/net/bytebuddy/byte-buddy/1.10.13/byte-buddy-1.10.13.jar:/home/user/.m2/repository/net/bytebuddy/byte-buddy-agent/1.10.13/byte-buddy-agent-1.10.13.jar:/home/user/.m2/repository/org/objenesis/objenesis/3.1/objenesis-3.1.jar:/home/user/.m2/repository/org/junit/jupiter/junit-jupiter-engine/5.6.2/junit-jupiter-engine-5.6.2.jar:/home/user/.m2/repository/org/apiguardian/apiguardian-api/1.1.0/apiguardian-api-1.1.0.jar:/home/user/.m2/repository/org/junit/platform/junit-platform-engine/1.6.2/junit-platform-engine-1.6.2.jar:/home/user/.m2/repository/org/opentest4j/opentest4j/1.2.0/opentest4j-1.2.0.jar:/home/user/.m2/repository/org/junit/platform/junit-platform-commons/1.6.2/junit-platform-commons-1.6.2.jar:/home/user/.m2/repository/org/junit/jupiter/junit-jupiter-api/5.6.2/junit-jupiter-api-5.6.2.jar:"/>
    <property name="java.vm.vendor" value="Oracle Corporation"/>
    <property name="sun.arch.data.model" value="64"/>
    <property name="java.vendor.url" value="http://java.oracle.com/"/>
    <property name="user.timezone" value=""/>
    <property name="java.vm.specification.version" value="1.8"/>
    <property name="os.name" value="Linux"/>
    <property name="user.country" value="US"/>
    <property name="sun.java.launcher" value="SUN_STANDARD"/>
    <property name="sun.boot.library.path" value="/usr/local/java/jdk1.8.0_251/jre/lib/amd64"/>
    <property name="sun.java.command" value="/home/user/IdeaProjects/induction-reconciliation-task/induction-reconciliation-webapp/target/surefire/surefirebooter5944860842348436329.jar /home/user/IdeaProjects/induction-reconciliation-task/induction-reconciliation-webapp/target/surefire 2020-09-14T12-17-53_540-jvmRun1 surefire2513537929747119180tmp surefire_33612481409209849255tmp"/>
    <property name="surefire.test.class.path" value="/home/user/IdeaProjects/induction-reconciliation-task/induction-reconciliation-webapp/target/test-classes:/home/user/IdeaProjects/induction-reconciliation-task/induction-reconciliation-webapp/target/classes:/home/user/.m2/repository/javax/servlet/javax.servlet-api/4.0.1/javax.servlet-api-4.0.1.jar:/home/user/.m2/repository/javax/servlet/jstl/1.2/jstl-1.2.jar:/home/user/IdeaProjects/induction-reconciliation-task/induction-reconciliation-impl/target/induction-reconciliation-impl-1.0-SNAPSHOT.jar:/home/user/IdeaProjects/induction-reconciliation-task/induction-reconciliation-usecases/target/induction-reconciliation-usecases-1.0-SNAPSHOT.jar:/home/user/.m2/repository/com/fasterxml/jackson/core/jackson-databind/2.9.8/jackson-databind-2.9.8.jar:/home/user/.m2/repository/com/fasterxml/jackson/core/jackson-annotations/2.9.0/jackson-annotations-2.9.0.jar:/home/user/.m2/repository/com/fasterxml/jackson/core/jackson-core/2.9.8/jackson-core-2.9.8.jar:/home/user/.m2/repository/com/google/code/gson/gson/2.8.6/gson-2.8.6.jar:/home/user/IdeaProjects/induction-reconciliation-task/induction-reconciliation-model/target/induction-reconciliation-model-1.0-SNAPSHOT.jar:/home/user/.m2/repository/mysql/mysql-connector-java/8.0.19/mysql-connector-java-8.0.19.jar:/home/user/.m2/repository/com/google/protobuf/protobuf-java/3.6.1/protobuf-java-3.6.1.jar:/home/user/.m2/repository/at/favre/lib/bcrypt/0.9.0/bcrypt-0.9.0.jar:/home/user/.m2/repository/at/favre/lib/bytes/1.3.0/bytes-1.3.0.jar:/home/user/.m2/repository/org/apache/commons/commons-dbcp2/2.7.0/commons-dbcp2-2.7.0.jar:/home/user/.m2/repository/org/apache/commons/commons-pool2/2.7.0/commons-pool2-2.7.0.jar:/home/user/.m2/repository/commons-logging/commons-logging/1.2/commons-logging-1.2.jar:/home/user/.m2/repository/com/h2database/h2/1.4.200/h2-1.4.200.jar:/home/user/.m2/repository/org/mockito/mockito-core/3.5.10/mockito-core-3.5.10.jar:/home/user/.m2/repository/net/bytebuddy/byte-buddy/1.10.13/byte-buddy-1.10.13.jar:/home/user/.m2/repository/net/bytebuddy/byte-buddy-agent/1.10.13/byte-buddy-agent-1.10.13.jar:/home/user/.m2/repository/org/objenesis/objenesis/3.1/objenesis-3.1.jar:/home/user/.m2/repository/org/junit/jupiter/junit-jupiter-engine/5.6.2/junit-jupiter-engine-5.6.2.jar:/home/user/.m2/repository/org/apiguardian/apiguardian-api/1.1.0/apiguardian-api-1.1.0.jar:/home/user/.m2/repository/org/junit/platform/junit-platform-engine/1.6.2/junit-platform-engine-1.6.2.jar:/home/user/.m2/repository/org/opentest4j/opentest4j/1.2.0/opentest4j-1.2.0.jar:/home/user/.m2/repository/org/junit/platform/junit-platform-commons/1.6.2/junit-platform-commons-1.6.2.jar:/home/user/.m2/repository/org/junit/jupiter/junit-jupiter-api/5.6.2/junit-jupiter-api-5.6.2.jar:"/>
    <property name="sun.cpu.endian" value="little"/>
    <property name="user.home" value="/home/user"/>
    <property name="user.language" value="en"/>
    <property name="java.specification.vendor" value="Oracle Corporation"/>
    <property name="java.home" value="/usr/local/java/jdk1.8.0_251/jre"/>
    <property name="basedir" value="/home/user/IdeaProjects/induction-reconciliation-task/induction-reconciliation-webapp"/>
    <property name="file.separator" value="/"/>
    <property name="line.separator" value="&#10;"/>
    <property name="java.vm.specification.vendor" value="Oracle Corporation"/>
    <property name="java.specification.name" value="Java Platform API Specification"/>
    <property name="java.awt.graphicsenv" value="sun.awt.X11GraphicsEnvironment"/>
    <property name="surefire.real.class.path" value="/home/user/IdeaProjects/induction-reconciliation-task/induction-reconciliation-webapp/target/surefire/surefirebooter5944860842348436329.jar"/>
    <property name="sun.boot.class.path" value="/usr/local/java/jdk1.8.0_251/jre/lib/resources.jar:/usr/local/java/jdk1.8.0_251/jre/lib/rt.jar:/usr/local/java/jdk1.8.0_251/jre/lib/sunrsasign.jar:/usr/local/java/jdk1.8.0_251/jre/lib/jsse.jar:/usr/local/java/jdk1.8.0_251/jre/lib/jce.jar:/usr/local/java/jdk1.8.0_251/jre/lib/charsets.jar:/usr/local/java/jdk1.8.0_251/jre/lib/jfr.jar:/usr/local/java/jdk1.8.0_251/jre/classes"/>
    <property name="sun.management.compiler" value="HotSpot 64-Bit Tiered Compilers"/>
    <property name="java.runtime.version" value="1.8.0_251-b08"/>
    <property name="user.name" value="user"/>
    <property name="path.separator" value=":"/>
    <property name="os.version" value="5.4.0-47-generic"/>
    <property name="java.endorsed.dirs" value="/usr/local/java/jdk1.8.0_251/jre/lib/endorsed"/>
    <property name="java.runtime.name" value="Java(TM) SE Runtime Environment"/>
    <property name="file.encoding" value="UTF-8"/>
    <property name="java.vm.name" value="Java HotSpot(TM) 64-Bit Server VM"/>
    <property name="localRepository" value="/home/user/.m2/repository"/>
    <property name="java.vendor.url.bug" value="http://bugreport.sun.com/bugreport/"/>
    <property name="java.io.tmpdir" value="/tmp"/>
    <property name="java.version" value="1.8.0_251"/>
    <property name="user.dir" value="/home/user/IdeaProjects/induction-reconciliation-task/induction-reconciliation-webapp"/>
    <property name="os.arch" value="amd64"/>
    <property name="java.vm.specification.name" value="Java Virtual Machine Specification"/>
    <property name="java.awt.printerjob" value="sun.print.PSPrinterJob"/>
    <property name="sun.os.patch.level" value="unknown"/>
    <property name="java.library.path" value="/usr/java/packages/lib/amd64:/usr/lib64:/lib64:/lib:/usr/lib"/>
    <property name="java.vm.info" value="mixed mode"/>
    <property name="java.vendor" value="Oracle Corporation"/>
    <property name="java.vm.version" value="25.251-b08"/>
    <property name="java.ext.dirs" value="/usr/local/java/jdk1.8.0_251/jre/lib/ext:/usr/java/packages/lib/ext"/>
    <property name="sun.io.unicode.encoding" value="UnicodeLittle"/>
    <property name="java.class.version" value="52.0"/>
  </properties>
  <testcase name="givenResultApiServlet_whenDoPost_thenSuccess" classname="com.progressoft.ji9.compare.ResultApiServletTest" time="0.674"/>
  <testcase name="givenResultApiServlet_whenDoGET_thenSuccess" classname="com.progressoft.ji9.compare.ResultApiServletTest" time="0.023"/>
</testsuite>