/home/user/IdeaProjects/induction-reconciliation-task/induction-reconciliation-model/src/main/java/com/progressoft/jip9/compare/implement/DBUsersProcessRepository.java
/home/user/IdeaProjects/induction-reconciliation-task/induction-reconciliation-model/src/main/java/com/progressoft/jip9/compare/interfaces/ReconciliationsProcess.java
/home/user/IdeaProjects/induction-reconciliation-task/induction-reconciliation-model/src/main/java/com/progressoft/jip9/compare/interfaces/UsersProcess.java
/home/user/IdeaProjects/induction-reconciliation-task/induction-reconciliation-model/src/main/java/com/progressoft/jip9/compare/modul/User.java
/home/user/IdeaProjects/induction-reconciliation-task/induction-reconciliation-model/src/main/java/com/progressoft/jip9/compare/implement/DBReconciliationsProcessRepository.java
/home/user/IdeaProjects/induction-reconciliation-task/induction-reconciliation-model/src/main/java/com/progressoft/jip9/compare/initialize/DatabaseInitializer.java
/home/user/IdeaProjects/induction-reconciliation-task/induction-reconciliation-model/src/main/java/com/progressoft/jip9/compare/modul/Reconciliation.java
