-------------------------------------------------------------------------------
Test set: com.progressoft.jip9.compare.DefaultCSVPrinterTest
-------------------------------------------------------------------------------
Tests run: 7, Failures: 0, Errors: 0, Skipped: 0, Time elapsed: 0.018 s - in com.progressoft.jip9.compare.DefaultCSVPrinterTest
