\relax 
\providecommand\hyper@newdestlabel[2]{}
\providecommand\babel@aux[2]{}
\@nameuse{bbl@beforestart}
\providecommand\HyperFirstAtBeginDocument{\AtBeginDocument}
\HyperFirstAtBeginDocument{\ifx\hyper@anchor\@undefined
\global\let\oldcontentsline\contentsline
\gdef\contentsline#1#2#3#4{\oldcontentsline{#1}{#2}{#3}}
\global\let\oldnewlabel\newlabel
\gdef\newlabel#1#2{\newlabelxx{#1}#2}
\gdef\newlabelxx#1#2#3#4#5#6{\oldnewlabel{#1}{{#2}{#3}}}
\AtEndDocument{\ifx\hyper@anchor\@undefined
\let\contentsline\oldcontentsline
\let\newlabel\oldnewlabel
\fi}
\fi}
\global\let\hyper@last\relax 
\gdef\HyperFirstAtBeginDocument#1{#1}
\providecommand\HyField@AuxAddToFields[1]{}
\providecommand\HyField@AuxAddToCoFields[2]{}
\citation{densenet}
\babel@aux{english}{}
\@writefile{toc}{\contentsline {section}{\numberline {1}Proposed Method}{1}{section.1}\protected@file@percent }
\newlabel{sec:proposed-method}{{1}{1}{Proposed Method}{section.1}{}}
\@writefile{toc}{\contentsline {subsection}{\numberline {1.1}Description}{1}{subsection.1.1}\protected@file@percent }
\newlabel{subsec:description}{{1.1}{1}{Description}{subsection.1.1}{}}
\@writefile{toc}{\contentsline {subsection}{\numberline {1.2}Dataset}{1}{subsection.1.2}\protected@file@percent }
\newlabel{subsec:dataset}{{1.2}{1}{Dataset}{subsection.1.2}{}}
\@writefile{toc}{\contentsline {subsection}{\numberline {1.3}Data Augmentation}{2}{subsection.1.3}\protected@file@percent }
\newlabel{subsec:data-augmentation}{{1.3}{2}{Data Augmentation}{subsection.1.3}{}}
\citation{densenet}
\@writefile{toc}{\contentsline {subsection}{\numberline {1.4}Generating Embeddings}{3}{subsection.1.4}\protected@file@percent }
\newlabel{subsec:generating-embeddings}{{1.4}{3}{Generating Embeddings}{subsection.1.4}{}}
\citation{siamese2014}
\citation{sabourin2020}
\citation{dichotomizer2000}
\@writefile{toc}{\contentsline {subsection}{\numberline {1.5}Siamese Model Architecture}{4}{subsection.1.5}\protected@file@percent }
\newlabel{subsec:siamese-model-architecture}{{1.5}{4}{Siamese Model Architecture}{subsection.1.5}{}}
\newlabel{eqn:absolute-diff}{{1}{4}{Siamese Model Architecture}{equation.1.1}{}}
\@writefile{lof}{\contentsline {figure}{\numberline {1}{\ignorespaces Embeddings\relax }}{5}{figure.caption.1}\protected@file@percent }
\providecommand*\caption@xref[2]{\@setref\relax\@undefined{#1}}
\newlabel{fig:embeddings}{{1}{5}{Embeddings\relax }{figure.caption.1}{}}
\@writefile{lof}{\contentsline {figure}{\numberline {2}{\ignorespaces Result of applying the dichotomy transform\relax }}{6}{figure.caption.2}\protected@file@percent }
\newlabel{fig:transformed-classes}{{2}{6}{Result of applying the dichotomy transform\relax }{figure.caption.2}{}}
\newlabel{eq:rbf}{{4}{6}{Siamese Model Architecture}{equation.1.4}{}}
\@writefile{lof}{\contentsline {figure}{\numberline {3}{\ignorespaces Result of applying $\phi (x)$ with $\gamma = 1$ to the transformed classes\relax }}{7}{figure.caption.3}\protected@file@percent }
\newlabel{fig:transformed-classes-rbf}{{3}{7}{Result of applying $\phi (x)$ with $\gamma = 1$ to the transformed classes\relax }{figure.caption.3}{}}
\@writefile{lot}{\contentsline {table}{\numberline {1}{\ignorespaces \textbf  {\footnotesize  {Siamese Embedding Network}}\relax }}{7}{table.1}\protected@file@percent }
\newlabel{table:siamese-embedding-network}{{1}{7}{\textbf {\footnotesize {Siamese Embedding Network}}\relax }{table.1}{}}
\citation{triplet2015}
\@writefile{lot}{\contentsline {table}{\numberline {2}{\ignorespaces \textbf  {\footnotesize  {Siamese Network}}\relax }}{8}{table.2}\protected@file@percent }
\newlabel{table:siamese-network}{{2}{8}{\textbf {\footnotesize {Siamese Network}}\relax }{table.2}{}}
\newlabel{siamese-mapping}{{5}{8}{Siamese Model Architecture}{equation.1.5}{}}
\@writefile{toc}{\contentsline {subsection}{\numberline {1.6}Triplet Model Architecture}{8}{subsection.1.6}\protected@file@percent }
\newlabel{subsec:triplet-model-architecture}{{1.6}{8}{Triplet Model Architecture}{subsection.1.6}{}}
\@writefile{lot}{\contentsline {table}{\numberline {3}{\ignorespaces \textbf  {\footnotesize  {Triplet Network}}\relax }}{9}{table.3}\protected@file@percent }
\newlabel{table:triplet-network}{{3}{9}{\textbf {\footnotesize {Triplet Network}}\relax }{table.3}{}}
\newlabel{triplet-mapping}{{10}{10}{Triplet Model Architecture}{equation.1.10}{}}
\@writefile{toc}{\contentsline {subsection}{\numberline {1.7}Siamese Training}{10}{subsection.1.7}\protected@file@percent }
\newlabel{subsec:siamese-training}{{1.7}{10}{Siamese Training}{subsection.1.7}{}}
\citation{triplet2017}
\@writefile{lot}{\contentsline {table}{\numberline {4}{\ignorespaces \textbf  {\footnotesize  {Siamese Model FAR and FRR}}\relax }}{12}{table.4}\protected@file@percent }
\newlabel{table:siamese-far-frr}{{4}{12}{\textbf {\footnotesize {Siamese Model FAR and FRR}}\relax }{table.4}{}}
\@writefile{toc}{\contentsline {subsection}{\numberline {1.8}Triplet Training}{12}{subsection.1.8}\protected@file@percent }
\newlabel{subsec:triplet-training}{{1.8}{12}{Triplet Training}{subsection.1.8}{}}
\@writefile{lot}{\contentsline {table}{\numberline {5}{\ignorespaces \textbf  {\footnotesize  {Triplet Model FAR and FRR}}\relax }}{13}{table.5}\protected@file@percent }
\bibcite{sabourin2020}{1}
\newlabel{table:triplet-far-frr}{{5}{14}{\textbf {\footnotesize {Triplet Model FAR and FRR}}\relax }{table.5}{}}
\@writefile{toc}{\contentsline {subsection}{\numberline {1.9}Combination of Siamese and Triplet}{14}{subsection.1.9}\protected@file@percent }
\newlabel{subsec:combination-siamese-triplet}{{1.9}{14}{Combination of Siamese and Triplet}{subsection.1.9}{}}
\newlabel{combination}{{11}{14}{Combination of Siamese and Triplet}{equation.1.11}{}}
\@writefile{lot}{\contentsline {table}{\numberline {6}{\ignorespaces \textbf  {\footnotesize  {Combination Model FAR and FRR}}\relax }}{14}{table.6}\protected@file@percent }
\newlabel{table:combination-far-frr}{{6}{14}{\textbf {\footnotesize {Combination Model FAR and FRR}}\relax }{table.6}{}}
\bibcite{triplet2017}{2}
\bibcite{densenet}{3}
\bibcite{triplet2015}{4}
\bibcite{siamese2014}{5}
\bibcite{dichotomizer2000}{6}
\gdef \@abspage@last{15}
