{
  "documents": {
    "id_card": {
      "citizen": {
        "front": {
          "pre_processor": "id_card_pre_processor",
          "pre_processor_args": {
            "id_card_width_height_ratio": 1.575,
            "label_info": {
              "label_path": "countries/oma/civil_number_label.bmp",
              "approximate_location": [
                240,
                255
              ],
              "neighborhood_search_deltas": [
                30,
                30
              ]
            }
          },
          "fields": [
            {
              "id": "id_number",
              "extractor": "default_id_card_field_extractor",
              "extractor_args": {
                "field_relative_location": [
                  [
                    25,
                    "+w"
                  ],
                  [
                    -13
                  ]
                ],
                "field_relative_size": [
                  [
                    250,
                    "+w"
                  ],
                  [
                    9,
                    "+h"
                  ]
                ]
              },
              "tesseract_config": "-l eng --oem 1 --psm 13",
              "tesseract_vars_file": "countries/oma/civil_number_tesseract_vars",
              "pre_processor": "identity",
              "post_processor": "remove_white_spaces"
            }
          ],
          "labels": [
            {
              "approximate_location": [
                235,
                255
              ],
              "neighborhood_search_deltas": [
                35,
                35
              ],
              "label_path": "countries/oma/citizen_labels/front/civil_label.bmp"
            },
            {
              "approximate_location": [
                235,
                315
              ],
              "neighborhood_search_deltas": [
                35,
                35
              ],
              "label_path": "countries/oma/citizen_labels/front/date_label.bmp"
            },
            {
              "approximate_location": [
                684,
                256
              ],
              "neighborhood_search_deltas": [
                35,
                35
              ],
              "label_path": "countries/oma/citizen_labels/front/number_arabic_label.bmp"
            },
            {
              "approximate_location": [
                676,
                343
              ],
              "neighborhood_search_deltas": [
                35,
                35
              ],
              "label_path": "countries/oma/citizen_labels/front/place_arabic_label.bmp"
            }
          ]
        },
        "back": {
          "pre_processor": "id_card_pre_processor",
          "pre_processor_args": {
            "id_card_width_height_ratio": 1.575,
            "label_info": {
              "label_path": "countries/oma/name_label.bmp",
              "approximate_location": [
                215,
                200
              ],
              "neighborhood_search_deltas": [
                30,
                30
              ]
            }
          },
          "fields": [
            {
              "id": "mrz",
              "extractor": "default_id_card_field_extractor",
              "extractor_args": {
                "field_relative_location": [
                  [
                    -200
                  ],
                  [
                    70,
                    "+h"
                  ]
                ],
                "field_relative_size": [
                  [
                    480,
                    "+w"
                  ],
                  [
                    260,
                    "+h"
                  ]
                ]
              },
              "tesseract_config": "-l ocrb --oem 1 --psm 1",
              "tesseract_vars_file": "countries/oma/mrz_tesseract_vars",
              "pre_processor": "identity",
              "post_processor": "remove_white_spaces"
            }
          ],
          "labels": [
            {
              "approximate_location": [
                205,
                84
              ],
              "neighborhood_search_deltas": [
                35,
                35
              ],
              "label_path": "countries/oma/citizen_labels/back/class_label.bmp"
            },
            {
              "approximate_location": [
                659,
                60
              ],
              "neighborhood_search_deltas": [
                35,
                35
              ],
              "label_path": "countries/oma/citizen_labels/back/license_arabic_label.bmp"
            },
            {
              "approximate_location": [
                205,
                132
              ],
              "neighborhood_search_deltas": [
                35,
                35
              ],
              "label_path": "countries/oma/citizen_labels/back/note_label.bmp"
            },
            {
              "approximate_location": [
                669,
                105
              ],
              "neighborhood_search_deltas": [
                35,
                35
              ],
              "label_path": "countries/oma/citizen_labels/back/notes_arabic_label.bmp"
            }
          ]
        }
      },
      "resident": {
        "front": {
          "pre_processor": "id_card_pre_processor",
          "pre_processor_args": {
            "id_card_width_height_ratio": 1.575,
            "label_info": {
              "label_path": "countries/oma/civil_number_label.bmp",
              "approximate_location": [
                240,
                255
              ],
              "neighborhood_search_deltas": [
                30,
                30
              ]
            }
          },
          "fields": [
            {
              "id": "id_number",
              "extractor": "default_id_card_field_extractor",
              "extractor_args": {
                "field_relative_location": [
                  [
                    25,
                    "+w"
                  ],
                  [
                    -13
                  ]
                ],
                "field_relative_size": [
                  [
                    250,
                    "+w"
                  ],
                  [
                    9,
                    "+h"
                  ]
                ]
              },
              "tesseract_config": "-l eng --oem 1 --psm 13",
              "tesseract_vars_file": "countries/oma/civil_number_tesseract_vars",
              "pre_processor": "identity",
              "post_processor": "remove_white_spaces"
            }
          ],
          "labels": [
            {
              "approximate_location": [
                232,
                258
              ],
              "neighborhood_search_deltas": [
                35,
                35
              ],
              "label_path": "countries/oma/resident_labels/front/civil_label.bmp"
            },
            {
              "approximate_location": [
                232,
                317
              ],
              "neighborhood_search_deltas": [
                35,
                35
              ],
              "label_path": "countries/oma/resident_labels/front/date_label.bmp"
            },
            {
              "approximate_location": [
                679,
                259
              ],
              "neighborhood_search_deltas": [
                35,
                35
              ],
              "label_path": "countries/oma/resident_labels/front/number_arabic_label.bmp"
            },
            {
              "approximate_location": [
                672,
                344
              ],
              "neighborhood_search_deltas": [
                35,
                35
              ],
              "label_path": "countries/oma/resident_labels/front/place_arabic_label.bmp"
            }
          ]
        },
        "back": {
          "pre_processor": "id_card_pre_processor",
          "pre_processor_args": {
            "id_card_width_height_ratio": 1.575,
            "label_info": {
              "label_path": "countries/oma/name_label.bmp",
              "approximate_location": [
                215,
                150
              ],
              "neighborhood_search_deltas": [
                30,
                30
              ]
            }
          },
          "fields": [
            {
              "id": "mrz",
              "extractor": "default_id_card_field_extractor",
              "extractor_args": {
                "field_relative_location": [
                  [
                    -200
                  ],
                  [
                    120,
                    "+h"
                  ]
                ],
                "field_relative_size": [
                  [
                    480,
                    "+w"
                  ],
                  [
                    300,
                    "+h"
                  ]
                ]
              },
              "tesseract_config": "-l ocrb --oem 1 --psm 1",
              "tesseract_vars_file": "countries/oma/mrz_tesseract_vars",
              "pre_processor": "identity",
              "post_processor": "remove_white_spaces"
            }
          ],
          "labels": [
            {
              "approximate_location": [
                212,
                77
              ],
              "neighborhood_search_deltas": [
                35,
                35
              ],
              "label_path": "countries/oma/resident_labels/back/class_label.bmp"
            },
            {
              "approximate_location": [
                666,
                64
              ],
              "neighborhood_search_deltas": [
                35,
                35
              ],
              "label_path": "countries/oma/resident_labels/back/license_arabic_label.bmp"
            },
            {
              "approximate_location": [
                213,
                127
              ],
              "neighborhood_search_deltas": [
                35,
                35
              ],
              "label_path": "countries/oma/resident_labels/back/note_label.bmp"
            },
            {
              "approximate_location": [
                676,
                103
              ],
              "neighborhood_search_deltas": [
                35,
                35
              ],
              "label_path": "countries/oma/resident_labels/back/notes_arabic_label.bmp"
            }
          ]
        }
      }
    }
  }
}