{
  "support_db_url": "postgresql://sys:sys@localhost:5432/supportdb20210805",
  "elastic_search_host": "http://localhost:9200",
  "search_max_number_of_issues_to_display": 10,
  "clustering_top_number_of_issues_to_display": 10
}