{
  "Logging": {
    "LogLevel": {
      "Default": "Information",
      "Microsoft": "Warning",
      "Microsoft.Hosting.Lifetime": "Information"
    }
  },

  "AllowedHosts": "*",

  "SwaggerConfig": {
    "ApiContactName": "Progressoft Corporation",
    "ApiContactUri": "https://www.progressoft.com/products/signature-verification-recognition",
    "ApiContactEmail": "info@progressoft.com",
    "ApiLicenseName": "Proprietary"
  },

  "SignatureSystemConfig": {
    "URI": "http://localhost:44350/asv/api/SignatureSystem",
    "CacheTimeIntervalInSeconds": 300,
    "RequestTimeoutMS": -1
  },

  "SignedDocumentSystemConfig": {
    "URI": "http://localhost:44351/asv/api/SignedDocument",
    "CacheTimeIntervalInSeconds": 300,
    "RequestTimeoutMS": -1
  },

  "AsvControlOptionsConfig": {
    "SignatureExtractionAvailabilityThreshold": 10,
    "SignatureExtractionDespecklingSize": 5,
    "DefaultAmountVerificationCodeId": "2",
    "TemplateImageReportingWidth": 620,
    "AsvSystemTrackingTag": "PS-ASV-SYSTEM",
    "Currencies": [
      {
        "Code": "JOD",
        "DecimalPlaces": 2
      },
      {
        "Code": "USD",
        "DecimalPlaces": 2
      }
    ],
    "MinimumWidthOrHeightForTemplateSignatureAreas": 25,
    "MaximumNumberOfSignatureAreasPerDocument": 10
  },
  "VerificationRulesConfig": {
    "Rule": [
      {
        "Currency": "JOD",
        "IsDefault": true,
        "InclusiveMinimumAmount": 0,
        "ExclusiveMaximumAmount": 9223372036854775807,
        "AcceptanceThreshold": 94
      }
    ]
  },
  "LoggingSettings": {
    "EnableFileLogging": true,
    "EnableConsoleLogging": true,
    "LoggingFilename": "EventsLog.log",
    "LoggingMaxSizeRollBackups": 5,
    "MaximumFileSizeMB": "1024",
    "LoggingLevel": "All"
  },

  "MLInferenceEnginesConfig": {
    "DenoisingEngine": "Tensorflow",
    "DenoisingBinarizationMethod": "OtsuMethod",
    "FeatureExtractionEngine": "Tensorflow",
    "FeatureVerificationEngine": "Tensorflow"
  },

  "AsvConnectionStringConfig": {
    "Schema": "asv_schema",
    "DbConnection": "Server=localhost;port=5432;Database=asvdb;User Id=asv ;Password=asv;",
    "DbEngine": "PostgreSQL",
    "EnableRetryOnFailure": false
  },

  "AuditedImagesPreprocessingConfig": {
    "ScaleFactor": "0.5",
    "BinarizationMethod": "OtsuMethod"
  },
  "SignatureCardsPreprocessingConfig": {
    "BinarizationMethod": "OtsuMethod"
  },
  "SignatureImagePreprocessingConfig": {
    "BinarizationMethod": "OtsuMethod"
  },
  "SecurityConfig": {
    "RemoveStackTraceFromResponse": false
  },
  "ObjectStoreConfig": {
    "BaseDirectory": "/home/u764/Downloads/talal"
  }
}
