{
  "lar_input_image_width": 960,
  "lar_input_image_height": 40,
  "lar_pooling_dropout_rate": 0.5,
  "lar_embedding_dropout_rate": 0.5,
  "lar_batch_size": 64,
  "lar_generator_max_workers": 4,
  "lar_generator_queue_size": 32,
  "lar_epoch_learning_rate_mappings": {
    "0": 0.1,
    "15": 0.01,
    "30": 0.001,
    "40": 0.0001
  },
  "lar_leaky_ReLU_alpha": 0.05,
  "lar_target_rnn_time_steps": 30,
  "lar_sub_sampling_enabled": false,
  "lar_filters_reduction_factor": 4,
  "lar_train_data_count": 900,
  "lar_validation_data_count": 180,
  "lar_test_data_count": 450,
  "lar_train_data_path": "./data/train/lar",
  "lar_validation_data_path": "./data/validation/lar",
  "lar_test_data_path": "./data/test/lar",
  "lar_min_banknotes": 0,
  "lar_max_banknotes": 999999,
  "lar_min_coins": 0,
  "lar_max_coins": 99,
  "lar_classes": [
    "zero",
    "one",
    "two",
    "three",
    "four",
    "five",
    "six",
    "seven",
    "eight",
    "nine",
    "ten",
    "eleven",
    "twelve",
    "thirteen",
    "fourteen",
    "fifteen",
    "sixteen",
    "seventeen",
    "eighteen",
    "nineteen",
    "twenty",
    "thirty",
    "forty",
    "fifty",
    "sixty",
    "seventy",
    "eighty",
    "ninety",
    "hundred",
    "thousand",
    "million",
    "and",
    "only",
    "rial",
    "dirham"
  ],
  "lar_stop_words": [
    "only",
    "only."
  ],
  "lar_currency_banknotes": [
    "rial",
    "rials",
    "rial.",
    "rials."
  ],
  "lar_currency_coins": [
    "dirham",
    "dirhams",
    "dirham.",
    "dirhams.",
    "darahem",
    "darahem."
  ],
  "data_path": "./data",
  "emnist_dataset_url": "http://www.itl.nist.gov/iaui/vip/cs_links/EMNIST/gzip.zip",
  "lar_handwritten_fonts_path": "./data/lar_handwritten_fonts",
  "lar_char_min_shift_up": 0,
  "lar_char_max_shift_up": 4,
  "lar_char_min_shift_x": 0,
  "lar_char_max_shift_x": 6,
  "lar_space_min_shift_x": 12,
  "lar_space_max_shift_x": 32,
  "lar_min_shrink_percentage": 0.4,
  "lar_max_shrink_percentage": 1,
  "lar_min_enlarge_percentage": 1,
  "lar_max_enlarge_percentage": 1,
  "lar_printed_min_font_size": 14,
  "lar_printed_max_font_size": 50,
  "lar_baseline_y": 30,
  "lar_baseline_deviation_y": 4,
  "lar_details_min_font_size": 10,
  "lar_details_max_font_size": 14,
  "lar_left_amount_details_top": [
    "Rials",
    "Amount",
    "The sum of QAR.",
    "The sum of QR.",
    "The sum of Qatari Riyals"
  ],
  "lar_left_amount_details_bottom": [
    "in words"
  ],
  "lar_right_amount_details_top": [
    "المبلغ بالكلمات",
    "المبلغ",
    "المبلغ بالكلمات",
    "المبلغ بالحروف",
    "مبلغ وقدره",
    "مبلغ وقدره ريال قطري"
  ],
  "lar_right_amount_details_bottom": [
    "بالكلمات"
  ],
  "lar_amount_details_min_deviation_x": 0,
  "lar_amount_details_max_deviation_x": 40,
  "lar_amount_details_min_horizontal_spacing": 8,
  "lar_amount_details_max_horizontal_spacing": 12,
  "lar_amount_details_min_baseline_gap": 1,
  "lar_amount_details_max_baseline_gap": 10,
  "lar_stamp_min_label_length": 5,
  "lar_stamp_max_label_length": 10,
  "lar_stamp_min_color": 128,
  "lar_stamp_max_color": 164,
  "lar_stamp_min_rotation": 60,
  "lar_stamp_max_rotation": 90,
  "lar_stamp_min_deviation_y": 0,
  "lar_stamp_max_deviation_y": 10,
  "lar_stamp_min_deviation_x": 0,
  "lar_stamp_max_deviation_x": 5
}