student_id,class_no,mark
202008001,A,78
202008002,C,62
202008003,C,31
202008004,A,56
202008005,B,58
202008006,B,45
202008007,B,81
202008008,A,95
202008009,C,60
202008010,A,40
202008011,C,94
202008012,B,75
202008013,A,51
202008014,B,92
202008015,C,24
202008016,B,57
202008017,C,55
202008018,B,84
202008019,A,62
202008020,A,46
202008021,B,75
202008022,A,81
202008023,C,38
202008024,A,57
202008025,B,75
202008026,A,49
202008027,A,98
202008028,C,54
202008029,C,29
202008030,B,42
202008031,A,29
202008032,B,23
202008033,C,66
202008034,A,61
202008035,B,77
202008036,A,42
202008037,B,35
202008038,C,85
202008039,B,96
202008040,A,39
202008041,B,69
202008042,B,39
202008043,C,49
202008044,C,49
202008045,A,87
202008046,A,50
202008047,B,65
202008048,C,50
202008049,A,65
202008050,C,30
202008051,B,64
202008052,B,97
202008053,A,21
202008054,A,78
202008055,B,51
202008056,B,77
202008057,B,31
202008058,B,63
202008059,A,93
202008060,B,32
202008061,A,54
202008062,C,89
202008063,A,72
202008064,A,30
202008065,A,26
202008066,B,26
202008067,B,90
202008068,A,21
202008069,A,86
202008070,C,48
202008071,C,51
202008072,C,93
202008073,C,77
202008074,A,61
202008075,A,59
202008076,A,55
202008077,C,94
202008078,B,34
202008079,C,70
202008080,B,48
202008081,C,81
202008082,C,55
202008083,B,81
202008084,A,92
202008085,C,89
202008086,C,94
202008087,B,36
202008088,C,61
202008089,B,65
202008090,B,69
202008091,A,63
202008092,C,91
202008093,A,33
202008094,C,98
202008095,B,79
202008096,C,58
202008097,A,25
202008098,A,38
202008099,A,56
202008100,C,73
202008101,A,82
202008102,C,29
202008103,A,41
202008104,A,79
202008105,C,98
202008106,B,58
202008107,C,61
202008108,A,78
202008109,B,54
202008110,A,93
202008111,C,38
202008112,A,82
202008113,A,38
202008114,C,46
202008115,C,50
202008116,B,80
202008117,B,86
202008118,B,96
202008119,C,56
202008120,B,57
202008121,C,33
202008122,A,97
202008123,C,25
202008124,A,22
202008125,B,94
202008126,C,54
202008127,C,65
202008128,A,91
202008129,B,29
202008130,B,65
202008131,A,36
202008132,A,38
202008133,B,40
202008134,B,29
202008135,C,35
202008136,C,94
202008137,A,68
202008138,A,29
202008139,B,23
202008140,B,22
202008141,B,31
202008142,A,34
202008143,B,98
202008144,A,57
202008145,C,33
202008146,A,36
202008147,B,67
202008148,B,45
202008149,A,93
202008150,A,38
202008151,C,48
202008152,A,98
202008153,A,46
202008154,B,100
202008155,B,58
202008156,A,82
202008157,A,60
202008158,B,21
202008159,A,46