/home/talal/IdeaProjects/Professor-Assistance/students-mark-file-generator/src/main/java/Model/Student.java
/home/talal/IdeaProjects/Professor-Assistance/students-mark-file-generator/src/main/java/Main.java
/home/talal/IdeaProjects/Professor-Assistance/students-mark-file-generator/src/main/java/FileUtility/FileGenerator.java
/home/talal/IdeaProjects/Professor-Assistance/students-mark-file-generator/src/main/java/FileUtility/CSVFile.java
