com\sujan\mydominotestproject\client\ui\application\content\screen04\Screen04ControllerCreatorImpl.class
com\sujan\mydominotestproject\client\MyDominoTestProjectApplication.class
com\sujan\mydominotestproject\client\ui\application\shell\content\navigation\INavigationComponent$Controller.class
com\sujan\mydominotestproject\client\ui\application\shell\ApplicationShellCreatorImpl.class
com\sujan\mydominotestproject\client\MyDominoTestProjectLoader.class
com\sujan\mydominotestproject\client\ui\application\content\screen04\IScreen04Component$Controller.class
com\sujan\mydominotestproject\client\ui\application\content\screen04\IScreen04Component.class
com\sujan\mydominotestproject\client\ui\application\content\screen03\Screen03Controller.class
com\sujan\mydominotestproject\client\ui\application\content\screen05\Screen05Component.class
com\sujan\mydominotestproject\client\ui\application\popup\error\IErrorComponent.class
com\sujan\mydominotestproject\client\ui\application\shell\content\statusbar\StatusbarController.class
com\sujan\mydominotestproject\client\MyDominoTestProjectContext.class
com\sujan\mydominotestproject\client\ui\application\shell\content\navigation\NavigationControllerCreatorImpl.class
com\sujan\mydominotestproject\client\ui\application\popup\error\ErrorComponent.class
com\sujan\mydominotestproject\client\ui\application\content\screen05\Screen05ControllerCreatorImpl.class
com\sujan\mydominotestproject\client\ui\application\content\screen03\IScreen03Component$Controller.class
com\sujan\mydominotestproject\client\ui\application\shell\content\statusbar\StatusbarControllerCreatorImpl.class
com\sujan\mydominotestproject\client\ui\application\shell\content\statusbar\IStatusbarComponent.class
com\sujan\mydominotestproject\client\MyDominoTestProjectApplicationImpl.class
com\sujan\mydominotestproject\client\ui\application\shell\content\navigation\INavigationComponent.class
com\sujan\mydominotestproject\client\MyDominoTestProject.class
com\sujan\mydominotestproject\client\ui\application\shell\content\navigation\NavigationComponent.class
com\sujan\mydominotestproject\client\ui\application\content\screen01\IScreen01Component$Controller.class
com\sujan\mydominotestproject\client\ui\application\content\screen02\Screen02Controller.class
com\sujan\mydominotestproject\client\ui\application\content\screen05\IScreen05Component.class
com\sujan\mydominotestproject\client\ui\application\content\screen02\Screen02Component.class
com\sujan\mydominotestproject\client\ui\application\content\screen01\IScreen01Component.class
com\sujan\mydominotestproject\client\ui\application\content\screen05\Screen05Controller.class
com\sujan\mydominotestproject\client\ui\application\content\screen01\Screen01ControllerCreatorImpl.class
com\sujan\mydominotestproject\client\ui\application\shell\content\navigation\NavigationController.class
com\sujan\mydominotestproject\client\ui\application\popup\error\IErrorComponent$Controller.class
com\sujan\mydominotestproject\client\ui\application\content\screen02\Screen02ControllerCreatorImpl.class
com\sujan\mydominotestproject\client\ui\application\content\screen01\Screen01Controller.class
com\sujan\mydominotestproject\client\ui\application\shell\content\statusbar\StatusbarComponent.class
com\sujan\mydominotestproject\client\ui\application\content\screen05\IScreen05Component$Controller.class
com\sujan\mydominotestproject\client\ui\application\content\screen03\Screen03Component.class
com\sujan\mydominotestproject\client\ui\application\shell\content\statusbar\IStatusbarComponent$Controller.class
com\sujan\mydominotestproject\client\ui\application\content\screen01\Screen01Component.class
com\sujan\mydominotestproject\client\ui\application\shell\ApplicationShell.class
com\sujan\mydominotestproject\client\event\StatusChangeEvent$StatusChangeEventHandler.class
com\sujan\mydominotestproject\client\ui\application\content\screen02\IScreen02Component$Controller.class
com\sujan\mydominotestproject\client\ui\application\content\screen03\IScreen03Component.class
com\sujan\mydominotestproject\client\ui\application\content\screen02\IScreen02Component.class
com\sujan\mydominotestproject\client\event\StatusChangeEvent.class
com\sujan\mydominotestproject\client\ui\application\content\screen04\Screen04Component.class
com\sujan\mydominotestproject\client\ui\application\content\screen03\Screen03ControllerCreatorImpl.class
com\sujan\mydominotestproject\client\ui\application\popup\error\ErrorController.class
META-INF\nalu-route\nalu.properties
com\sujan\mydominotestproject\client\ui\application\content\screen04\Screen04Controller.class
