C:\Users\Sara\for_indection\assement_09Agust2020\webInterface-war\src\main\java\com\progressoft\jip9\servlets\UploadSourceServlet.java
C:\Users\Sara\for_indection\assement_09Agust2020\webInterface-war\src\main\java\com\progressoft\jip9\filter\UserFilter.java
C:\Users\Sara\for_indection\assement_09Agust2020\webInterface-war\src\main\java\com\progressoft\jip9\initializer\Initializer.java
C:\Users\Sara\for_indection\assement_09Agust2020\webInterface-war\src\main\java\com\progressoft\jip9\listener\HttpListener.java
C:\Users\Sara\for_indection\assement_09Agust2020\webInterface-war\src\main\java\com\progressoft\jip9\servlets\ValidationServlet.java
C:\Users\Sara\for_indection\assement_09Agust2020\webInterface-war\src\main\java\com\progressoft\jip9\bean\UploadDetail.java
C:\Users\Sara\for_indection\assement_09Agust2020\webInterface-war\src\main\java\com\progressoft\jip9\DBHandler\CheckAccess.java
C:\Users\Sara\for_indection\assement_09Agust2020\webInterface-war\src\main\java\com\progressoft\jip9\initializer\FilterInitializer.java
