-------------------------------------------------------------------------------
Test set: com.progressoft.JsonReaderTest
-------------------------------------------------------------------------------
Tests run: 8, Failures: 0, Errors: 0, Skipped: 0, Time elapsed: 0.024 s - in com.progressoft.JsonReaderTest
