-------------------------------------------------------------------------------
Test set: file.FileReconciliationUseCaseTest
-------------------------------------------------------------------------------
Tests run: 2, Failures: 0, Errors: 0, Skipped: 0, Time elapsed: 0.062 s - in file.FileReconciliationUseCaseTest
