/home/user/induction-reconciliation-task/reconciliation-system/entities/src/main/java/com/progressoft/entities/NotMatchingRecord.java
/home/user/induction-reconciliation-task/reconciliation-system/entities/src/main/java/com/progressoft/entities/CsvRecord.java
/home/user/induction-reconciliation-task/reconciliation-system/entities/src/main/java/com/progressoft/entities/JsonRecord.java
/home/user/induction-reconciliation-task/reconciliation-system/entities/src/main/java/com/progressoft/entities/MatchingRecord.java
