-------------------------------------------------------------------------------
Test set: com.progressoft.validator.RequestValidatorTest
-------------------------------------------------------------------------------
Tests run: 7, Failures: 0, Errors: 0, Skipped: 0, Time elapsed: 0.046 s - in com.progressoft.validator.RequestValidatorTest
