200413-26fd9d7f
200413-26fd9d7f
200413-9a60f0dc
200413-1e31ad18
200413-6031ad2f
200413-6031ad2f
200413-ef2f0bc4
200413-ef2f0bc4
200413-ef2f0bc4
200413-2140bdcd
200413-2140bdcd
200413-2140bdcd
200413-a521f341
200413-509a3079
200413-b3fb5cd5
200413-c4d4f715
200413-c4d4f715
200413-c4d4f715
200413-027ab014
200413-c0473e74
200413-44a08978
200413-44a08978
200419-b0bc4c1f
200419-73cc6f80
200419-73cc6f80
200419-73cc6f80
