/home/nourhan/Downloads/devops_sample/src/main/java/com/progressoft/devops/assignment/controller/PersonMapper.java
/home/nourhan/Downloads/devops_sample/src/main/java/com/progressoft/devops/assignment/controller/Person.java
/home/nourhan/Downloads/devops_sample/src/main/java/com/progressoft/devops/assignment/controller/PersonController.java
/home/nourhan/Downloads/devops_sample/src/main/java/com/progressoft/devops/assignment/repository/PersonRepository.java
/home/nourhan/Downloads/devops_sample/src/main/java/com/progressoft/devops/assignment/repository/PersonEntity.java
/home/nourhan/Downloads/devops_sample/src/main/java/com/progressoft/devops/assignment/Application.java
