<?xml version="1.0" encoding="UTF-8"?>
<testsuite xmlns:xsi="http://www.w3.org/2001/XMLSchema-instance" xsi:noNamespaceSchemaLocation="https://maven.apache.org/surefire/maven-surefire-plugin/xsd/surefire-test-report.xsd" name="ConversionTest" time="0.026" tests="4" errors="0" skipped="0" failures="2">
  <properties>
    <property name="sun.desktop" value="gnome"/>
    <property name="awt.toolkit" value="sun.awt.X11.XToolkit"/>
    <property name="java.specification.version" value="11"/>
    <property name="sun.cpu.isalist" value=""/>
    <property name="sun.jnu.encoding" value="UTF-8"/>
    <property name="java.class.path" value="/home/laith/IdeaProjects/currencyconverter/CurrencyConverter/target/test-classes:/home/laith/IdeaProjects/currencyconverter/CurrencyConverter/target/classes:/home/laith/.m2/repository/org/junit/jupiter/junit-jupiter/5.8.2/junit-jupiter-5.8.2.jar:/home/laith/.m2/repository/org/junit/jupiter/junit-jupiter-api/5.8.2/junit-jupiter-api-5.8.2.jar:/home/laith/.m2/repository/org/opentest4j/opentest4j/1.2.0/opentest4j-1.2.0.jar:/home/laith/.m2/repository/org/junit/platform/junit-platform-commons/1.8.2/junit-platform-commons-1.8.2.jar:/home/laith/.m2/repository/org/apiguardian/apiguardian-api/1.1.2/apiguardian-api-1.1.2.jar:/home/laith/.m2/repository/org/junit/jupiter/junit-jupiter-params/5.8.2/junit-jupiter-params-5.8.2.jar:/home/laith/.m2/repository/org/junit/jupiter/junit-jupiter-engine/5.8.2/junit-jupiter-engine-5.8.2.jar:/home/laith/.m2/repository/org/junit/platform/junit-platform-engine/1.8.2/junit-platform-engine-1.8.2.jar:/home/laith/.m2/repository/io/github/devlibx/easy/helper/0.0.81/helper-0.0.81.jar:/home/laith/.m2/repository/io/github/resilience4j/resilience4j-all/1.6.1/resilience4j-all-1.6.1.jar:/home/laith/.m2/repository/io/vavr/vavr/0.10.2/vavr-0.10.2.jar:/home/laith/.m2/repository/io/vavr/vavr-match/0.10.2/vavr-match-0.10.2.jar:/home/laith/.m2/repository/io/github/resilience4j/resilience4j-ratelimiter/1.6.1/resilience4j-ratelimiter-1.6.1.jar:/home/laith/.m2/repository/io/github/resilience4j/resilience4j-core/1.6.1/resilience4j-core-1.6.1.jar:/home/laith/.m2/repository/io/github/resilience4j/resilience4j-circuitbreaker/1.6.1/resilience4j-circuitbreaker-1.6.1.jar:/home/laith/.m2/repository/io/github/resilience4j/resilience4j-bulkhead/1.6.1/resilience4j-bulkhead-1.6.1.jar:/home/laith/.m2/repository/io/github/resilience4j/resilience4j-retry/1.6.1/resilience4j-retry-1.6.1.jar:/home/laith/.m2/repository/io/github/resilience4j/resilience4j-cache/1.6.1/resilience4j-cache-1.6.1.jar:/home/laith/.m2/repository/javax/cache/cache-api/1.1.0/cache-api-1.1.0.jar:/home/laith/.m2/repository/io/github/resilience4j/resilience4j-timelimiter/1.6.1/resilience4j-timelimiter-1.6.1.jar:/home/laith/.m2/repository/com/fasterxml/jackson/core/jackson-core/2.13.3/jackson-core-2.13.3.jar:/home/laith/.m2/repository/com/fasterxml/jackson/core/jackson-databind/2.13.3/jackson-databind-2.13.3.jar:/home/laith/.m2/repository/com/fasterxml/jackson/core/jackson-annotations/2.13.3/jackson-annotations-2.13.3.jar:/home/laith/.m2/repository/commons-io/commons-io/2.8.0/commons-io-2.8.0.jar:/home/laith/.m2/repository/org/projectlombok/lombok/1.18.16/lombok-1.18.16.jar:/home/laith/.m2/repository/com/google/inject/guice/5.1.0/guice-5.1.0.jar:/home/laith/.m2/repository/javax/inject/javax.inject/1/javax.inject-1.jar:/home/laith/.m2/repository/aopalliance/aopalliance/1.0/aopalliance-1.0.jar:/home/laith/.m2/repository/com/google/guava/guava/30.1-jre/guava-30.1-jre.jar:/home/laith/.m2/repository/com/google/guava/failureaccess/1.0.1/failureaccess-1.0.1.jar:/home/laith/.m2/repository/com/google/guava/listenablefuture/9999.0-empty-to-avoid-conflict-with-guava/listenablefuture-9999.0-empty-to-avoid-conflict-with-guava.jar:/home/laith/.m2/repository/com/google/code/findbugs/jsr305/3.0.2/jsr305-3.0.2.jar:/home/laith/.m2/repository/org/checkerframework/checker-qual/3.5.0/checker-qual-3.5.0.jar:/home/laith/.m2/repository/com/google/errorprone/error_prone_annotations/2.3.4/error_prone_annotations-2.3.4.jar:/home/laith/.m2/repository/com/google/j2objc/j2objc-annotations/1.3/j2objc-annotations-1.3.jar:/home/laith/.m2/repository/joda-time/joda-time/2.10.4/joda-time-2.10.4.jar:/home/laith/.m2/repository/org/slf4j/slf4j-api/1.7.5/slf4j-api-1.7.5.jar:/home/laith/.m2/repository/ch/qos/logback/logback-classic/1.2.11/logback-classic-1.2.11.jar:/home/laith/.m2/repository/ch/qos/logback/logback-core/1.2.11/logback-core-1.2.11.jar:/home/laith/.m2/repository/org/yaml/snakeyaml/1.21/snakeyaml-1.21.jar:"/>
    <property name="java.vm.vendor" value="Ubuntu"/>
    <property name="sun.arch.data.model" value="64"/>
    <property name="java.vendor.url" value="https://ubuntu.com/"/>
    <property name="user.timezone" value=""/>
    <property name="java.vm.specification.version" value="11"/>
    <property name="os.name" value="Linux"/>
    <property name="sun.java.launcher" value="SUN_STANDARD"/>
    <property name="user.country" value="US"/>
    <property name="sun.boot.library.path" value="/usr/lib/jvm/java-11-openjdk-amd64/lib"/>
    <property name="sun.java.command" value="/home/laith/IdeaProjects/currencyconverter/CurrencyConverter/target/surefire/surefirebooter15905814242008055858.jar /home/laith/IdeaProjects/currencyconverter/CurrencyConverter/target/surefire 2022-08-30T16-44-18_813-jvmRun1 surefire18203304646193774538tmp surefire_0599018225141952618tmp"/>
    <property name="jdk.debug" value="release"/>
    <property name="surefire.test.class.path" value="/home/laith/IdeaProjects/currencyconverter/CurrencyConverter/target/test-classes:/home/laith/IdeaProjects/currencyconverter/CurrencyConverter/target/classes:/home/laith/.m2/repository/org/junit/jupiter/junit-jupiter/5.8.2/junit-jupiter-5.8.2.jar:/home/laith/.m2/repository/org/junit/jupiter/junit-jupiter-api/5.8.2/junit-jupiter-api-5.8.2.jar:/home/laith/.m2/repository/org/opentest4j/opentest4j/1.2.0/opentest4j-1.2.0.jar:/home/laith/.m2/repository/org/junit/platform/junit-platform-commons/1.8.2/junit-platform-commons-1.8.2.jar:/home/laith/.m2/repository/org/apiguardian/apiguardian-api/1.1.2/apiguardian-api-1.1.2.jar:/home/laith/.m2/repository/org/junit/jupiter/junit-jupiter-params/5.8.2/junit-jupiter-params-5.8.2.jar:/home/laith/.m2/repository/org/junit/jupiter/junit-jupiter-engine/5.8.2/junit-jupiter-engine-5.8.2.jar:/home/laith/.m2/repository/org/junit/platform/junit-platform-engine/1.8.2/junit-platform-engine-1.8.2.jar:/home/laith/.m2/repository/io/github/devlibx/easy/helper/0.0.81/helper-0.0.81.jar:/home/laith/.m2/repository/io/github/resilience4j/resilience4j-all/1.6.1/resilience4j-all-1.6.1.jar:/home/laith/.m2/repository/io/vavr/vavr/0.10.2/vavr-0.10.2.jar:/home/laith/.m2/repository/io/vavr/vavr-match/0.10.2/vavr-match-0.10.2.jar:/home/laith/.m2/repository/io/github/resilience4j/resilience4j-ratelimiter/1.6.1/resilience4j-ratelimiter-1.6.1.jar:/home/laith/.m2/repository/io/github/resilience4j/resilience4j-core/1.6.1/resilience4j-core-1.6.1.jar:/home/laith/.m2/repository/io/github/resilience4j/resilience4j-circuitbreaker/1.6.1/resilience4j-circuitbreaker-1.6.1.jar:/home/laith/.m2/repository/io/github/resilience4j/resilience4j-bulkhead/1.6.1/resilience4j-bulkhead-1.6.1.jar:/home/laith/.m2/repository/io/github/resilience4j/resilience4j-retry/1.6.1/resilience4j-retry-1.6.1.jar:/home/laith/.m2/repository/io/github/resilience4j/resilience4j-cache/1.6.1/resilience4j-cache-1.6.1.jar:/home/laith/.m2/repository/javax/cache/cache-api/1.1.0/cache-api-1.1.0.jar:/home/laith/.m2/repository/io/github/resilience4j/resilience4j-timelimiter/1.6.1/resilience4j-timelimiter-1.6.1.jar:/home/laith/.m2/repository/com/fasterxml/jackson/core/jackson-core/2.13.3/jackson-core-2.13.3.jar:/home/laith/.m2/repository/com/fasterxml/jackson/core/jackson-databind/2.13.3/jackson-databind-2.13.3.jar:/home/laith/.m2/repository/com/fasterxml/jackson/core/jackson-annotations/2.13.3/jackson-annotations-2.13.3.jar:/home/laith/.m2/repository/commons-io/commons-io/2.8.0/commons-io-2.8.0.jar:/home/laith/.m2/repository/org/projectlombok/lombok/1.18.16/lombok-1.18.16.jar:/home/laith/.m2/repository/com/google/inject/guice/5.1.0/guice-5.1.0.jar:/home/laith/.m2/repository/javax/inject/javax.inject/1/javax.inject-1.jar:/home/laith/.m2/repository/aopalliance/aopalliance/1.0/aopalliance-1.0.jar:/home/laith/.m2/repository/com/google/guava/guava/30.1-jre/guava-30.1-jre.jar:/home/laith/.m2/repository/com/google/guava/failureaccess/1.0.1/failureaccess-1.0.1.jar:/home/laith/.m2/repository/com/google/guava/listenablefuture/9999.0-empty-to-avoid-conflict-with-guava/listenablefuture-9999.0-empty-to-avoid-conflict-with-guava.jar:/home/laith/.m2/repository/com/google/code/findbugs/jsr305/3.0.2/jsr305-3.0.2.jar:/home/laith/.m2/repository/org/checkerframework/checker-qual/3.5.0/checker-qual-3.5.0.jar:/home/laith/.m2/repository/com/google/errorprone/error_prone_annotations/2.3.4/error_prone_annotations-2.3.4.jar:/home/laith/.m2/repository/com/google/j2objc/j2objc-annotations/1.3/j2objc-annotations-1.3.jar:/home/laith/.m2/repository/joda-time/joda-time/2.10.4/joda-time-2.10.4.jar:/home/laith/.m2/repository/org/slf4j/slf4j-api/1.7.5/slf4j-api-1.7.5.jar:/home/laith/.m2/repository/ch/qos/logback/logback-classic/1.2.11/logback-classic-1.2.11.jar:/home/laith/.m2/repository/ch/qos/logback/logback-core/1.2.11/logback-core-1.2.11.jar:/home/laith/.m2/repository/org/yaml/snakeyaml/1.21/snakeyaml-1.21.jar:"/>
    <property name="sun.cpu.endian" value="little"/>
    <property name="user.home" value="/home/laith"/>
    <property name="user.language" value="en"/>
    <property name="java.specification.vendor" value="Oracle Corporation"/>
    <property name="java.version.date" value="2022-07-19"/>
    <property name="java.home" value="/usr/lib/jvm/java-11-openjdk-amd64"/>
    <property name="file.separator" value="/"/>
    <property name="basedir" value="/home/laith/IdeaProjects/currencyconverter/CurrencyConverter"/>
    <property name="java.vm.compressedOopsMode" value="Zero based"/>
    <property name="line.separator" value="&#10;"/>
    <property name="java.specification.name" value="Java Platform API Specification"/>
    <property name="java.vm.specification.vendor" value="Oracle Corporation"/>
    <property name="java.awt.graphicsenv" value="sun.awt.X11GraphicsEnvironment"/>
    <property name="surefire.real.class.path" value="/home/laith/IdeaProjects/currencyconverter/CurrencyConverter/target/surefire/surefirebooter15905814242008055858.jar"/>
    <property name="sun.management.compiler" value="HotSpot 64-Bit Tiered Compilers"/>
    <property name="java.runtime.version" value="11.0.16+8-post-Ubuntu-0ubuntu122.04"/>
    <property name="user.name" value="laith"/>
    <property name="path.separator" value=":"/>
    <property name="os.version" value="5.15.0-46-generic"/>
    <property name="java.runtime.name" value="OpenJDK Runtime Environment"/>
    <property name="file.encoding" value="UTF-8"/>
    <property name="java.vm.name" value="OpenJDK 64-Bit Server VM"/>
    <property name="localRepository" value="/home/laith/.m2/repository"/>
    <property name="java.vendor.url.bug" value="https://bugs.launchpad.net/ubuntu/+source/openjdk-lts"/>
    <property name="java.io.tmpdir" value="/tmp"/>
    <property name="idea.version" value="2022.2.1"/>
    <property name="java.version" value="11.0.16"/>
    <property name="user.dir" value="/home/laith/IdeaProjects/currencyconverter/CurrencyConverter"/>
    <property name="os.arch" value="amd64"/>
    <property name="java.vm.specification.name" value="Java Virtual Machine Specification"/>
    <property name="java.awt.printerjob" value="sun.print.PSPrinterJob"/>
    <property name="sun.os.patch.level" value="unknown"/>
    <property name="java.library.path" value="/usr/java/packages/lib:/usr/lib/x86_64-linux-gnu/jni:/lib/x86_64-linux-gnu:/usr/lib/x86_64-linux-gnu:/usr/lib/jni:/lib:/usr/lib"/>
    <property name="java.vm.info" value="mixed mode, sharing"/>
    <property name="java.vendor" value="Ubuntu"/>
    <property name="java.vm.version" value="11.0.16+8-post-Ubuntu-0ubuntu122.04"/>
    <property name="sun.io.unicode.encoding" value="UnicodeLittle"/>
    <property name="java.class.version" value="55.0"/>
  </properties>
  <testcase name="givenUnexpectedResult_whenConvert_throwInvalidTypeException" classname="ConversionTest" time="0.011"/>
  <testcase name="givenInvalidCurrency_whenConvert_throwInvalidException" classname="ConversionTest" time="0.006">
    <failure message="Currency doesn&apos;t exist ==&gt; Unexpected exception type thrown ==&gt; expected: &lt;java.io.InvalidClassException&gt; but was: &lt;java.lang.NullPointerException&gt;" type="org.opentest4j.AssertionFailedError"><![CDATA[org.opentest4j.AssertionFailedError: Currency doesn't exist ==> Unexpected exception type thrown ==> expected: <java.io.InvalidClassException> but was: <java.lang.NullPointerException>
	at ConversionTest.givenInvalidCurrency_whenConvert_throwInvalidException(ConversionTest.java:27)
Caused by: java.lang.NullPointerException
	at ConversionTest.lambda$givenInvalidCurrency_whenConvert_throwInvalidException$0(ConversionTest.java:27)
	at ConversionTest.givenInvalidCurrency_whenConvert_throwInvalidException(ConversionTest.java:27)
]]></failure>
    <system-out><![CDATA[from BHD
]]></system-out>
  </testcase>
  <testcase name="givenInvalidInput_whenConvert_throwNullException" classname="ConversionTest" time="0.001">
    <failure message="Longer than 3 chars ==&gt; Unexpected exception type thrown ==&gt; expected: &lt;java.io.InvalidClassException&gt; but was: &lt;java.lang.NullPointerException&gt;" type="org.opentest4j.AssertionFailedError"><![CDATA[org.opentest4j.AssertionFailedError: Longer than 3 chars ==> Unexpected exception type thrown ==> expected: <java.io.InvalidClassException> but was: <java.lang.NullPointerException>
	at ConversionTest.givenInvalidInput_whenConvert_throwNullException(ConversionTest.java:37)
Caused by: java.lang.NullPointerException
	at ConversionTest.lambda$givenInvalidInput_whenConvert_throwNullException$2(ConversionTest.java:37)
	at ConversionTest.givenInvalidInput_whenConvert_throwNullException(ConversionTest.java:37)
]]></failure>
  </testcase>
  <testcase name="testing" classname="ConversionTest" time="0"/>
</testsuite>