/home/laith/IdeaProjects/currencyconverter/CurrencyConverter/src/main/java/org/Data/Currencies.java
/home/laith/IdeaProjects/currencyconverter/CurrencyConverter/src/main/java/org/example/CurrencyConversion.java
/home/laith/IdeaProjects/currencyconverter/CurrencyConverter/src/main/java/org/Data/EUR.java
/home/laith/IdeaProjects/currencyconverter/CurrencyConverter/src/main/java/org/Data/Currency.java
/home/laith/IdeaProjects/currencyconverter/CurrencyConverter/src/main/java/org/example/Main.java
/home/laith/IdeaProjects/currencyconverter/CurrencyConverter/src/main/java/org/Data/USD.java
/home/laith/IdeaProjects/currencyconverter/CurrencyConverter/src/main/java/org/Data/JOD.java
/home/laith/IdeaProjects/currencyconverter/CurrencyConverter/src/main/java/org/Data/BHD.java
