com/progressoft/devops/assignment/controller/PersonMapper.class
com/progressoft/devops/assignment/Application.class
com/progressoft/devops/assignment/controller/PersonController.class
com/progressoft/devops/assignment/repository/PersonEntity.class
com/progressoft/devops/assignment/repository/PersonRepository.class
com/progressoft/devops/assignment/controller/Person.class
