/home/u822/jip8/gitlab/hamza/reconciliation-system/managment-phase/src/main/java/com/progressoft/reconciliationSystem/managment/MemoryFileException.java
/home/u822/jip8/gitlab/hamza/reconciliation-system/managment-phase/src/main/java/com/progressoft/reconciliationSystem/managment/WebReconciliationGenerator.java
/home/u822/jip8/gitlab/hamza/reconciliation-system/managment-phase/src/main/java/com/progressoft/reconciliationSystem/managment/FileReconciliationGenerator.java
/home/u822/jip8/gitlab/hamza/reconciliation-system/managment-phase/src/main/java/com/progressoft/reconciliationSystem/managment/ReconciliationGenerator.java
/home/u822/jip8/gitlab/hamza/reconciliation-system/managment-phase/src/main/java/com/progressoft/reconciliationSystem/managment/FileDetails.java
