com/progressoft/reconciliationSystem/managment/FileReconciliationGenerator.class
com/progressoft/reconciliationSystem/managment/WebReconciliationGenerator.class
com/progressoft/reconciliationSystem/managment/MemoryFileException.class
com/progressoft/reconciliationSystem/managment/ReconciliationGenerator.class
com/progressoft/reconciliationSystem/managment/FileDetails.class
