/home/u822/jip8/gitlab/hamza/reconciliation-system/read-files/src/test/java/com/progressoft/reconciliationSystem/readFiles/FileReaderTest.java
/home/u822/jip8/gitlab/hamza/reconciliation-system/read-files/src/test/java/com/progressoft/reconciliationSystem/readFiles/CSVReaderTest.java
/home/u822/jip8/gitlab/hamza/reconciliation-system/read-files/src/test/java/com/progressoft/reconciliationSystem/readFiles/JSONReaderTest.java
