-------------------------------------------------------------------------------
Test set: com.progressoft.reconciliationSystem.web.LoginServletTest
-------------------------------------------------------------------------------
Tests run: 1, Failures: 0, Errors: 0, Skipped: 0, Time elapsed: 0.428 s - in com.progressoft.reconciliationSystem.web.LoginServletTest
