com\progressoft\jip9\reconciliation\servlet\FileUploadServlet.class
com\progressoft\jip9\reconciliation\login\LoginHelper.class
com\progressoft\jip9\reconciliation\servlet\WelcomeServlet.class
com\progressoft\jip9\reconciliation\servlet\SourceUploadServlet.class
com\progressoft\jip9\reconciliation\login\LoginDB.class
com\progressoft\jip9\reconciliation\uploadFile\FileUploadDao.class
com\progressoft\jip9\reconciliation\servlet\LoginServlet.class
com\progressoft\jip9\reconciliation\login\SQLerrors.class
com\progressoft\jip9\reconciliation\servlet\LogoutServlet.class
com\progressoft\jip9\reconciliation\initializer\reconciliationInitializer.class
com\progressoft\jip9\reconciliation\servlet\TargetUploadServlet.class
com\progressoft\jip9\reconciliation\DataStoring\FilesData.class
com\progressoft\jip9\reconciliation\servlet\CompareServlet.class
com\progressoft\jip9\reconciliation\uploadFile\fileType.class
