<?xml version="1.0" encoding="UTF-8" standalone="no"?><svg xmlns="http://www.w3.org/2000/svg" xmlns:xlink="http://www.w3.org/1999/xlink" height="381.5" initialHeight="381.5" initialWidth="763.0" onload="resizeSVG(evt)" onresize="resizeSVG(evt)" width="763.0"><g id="outerG" style="fill:none;stroke:none"><defs><clipPath id="clip1754786894"><path d=" M42.333332 58.0 L42.333332 345.83334 L659.5 345.83334 L659.5 58.0 Z"/></clipPath></defs><script><![CDATA[/*******************************************************************************
 * Copyright (c) 2009 Actuate Corporation.
 * All rights reserved. This program and the accompanying materials
 * are made available under the terms of the Eclipse Public License v1.0
 * which accompanies this distribution, and is available at
 * http://www.eclipse.org/legal/epl-v10.html
 *
 * Contributors:
 *  Actuate Corporation  - initial API and implementation
 *******************************************************************************/
/**
 * This JavaScript library defines classes and methods to handle interactivity
 * actions on Chart, it is valid for SVG format.
 * 
 * @since 2.5.1
 */
BuildHelper = function (tag, attrList, text) {
	this.tag = tag;
	this.attrList = attrList;
	this.text = text;
	this.element = null;
	this.textNode = null;
};

BuildHelper.prototype.addToParent = function(parent) {
	if (!parent)
		return;
	var svgDocument = parent.ownerDocument;
	this.element = svgDocument.createElementNS("http://www.w3.org/2000/svg",
			this.tag);

	for ( var attribute in this.attrList) {
		if (attribute == 'classType')
			this.element
					.setAttributeNS(null, 'class', this.attrList[attribute]);
		else
			this.element.setAttributeNS(null, attribute,
					this.attrList[attribute]);
	}

	if (this.text) {
		this.textNode = svgDocument.createTextNode(this.text);
		this.element.appendChild(this.textNode);
	}

	parent.appendChild(this.element);
};

BuildHelper.prototype.insertBefore = function(parent, before) {
	if (typeof parent == 'undefined')
		return;
	var svgDocument = parent.ownerDocument;
	this.element = svgDocument.createElementNS("http://www.w3.org/2000/svg",
			this.tag);

	for ( var attribute in this.attrList) {
		if (attribute == 'classType')
			this.element
					.setAttributeNS(null, 'class', this.attrList[attribute]);
		else
			this.element.setAttributeNS(null, attribute,
					this.attrList[attribute]);
	}

	if (this.text) {
		this.textNode = svgDocument.createTextNode(this.text);
		this.element.appendChild(this.textNode);
	}

	parent.insertBefore(this.element, before);
};

BuildHelper.prototype.removeNode = function() {
	if (this.element)
		this.element.parentNode.removeChild(this.element);
	this.tag = "";
	this.attrList = null;
	this.text = null;
	this.element = null;
	this.textNode = null;
};

TM = function () { };
TM.prototype = new Object();

TM.setParent = function (parent, mainSvg) {
	this.parent = parent;
	this.mainSvg = mainSvg;
};

TM.getTitleElement = function (evt) {
	var elem = evt.currentTarget;
	if (elem == null)
		return null;
	var childs = elem.childNodes;
	for ( var x = 0; x < childs.length; x++) {
		if (childs.item(x).nodeType == 1 && childs.item(x).nodeName == "title")
			return childs.item(x);
	}
	return null;
};

TM.getText = function (elem) {
	var childs = elem ? elem.childNodes : null;
	for ( var x = 0; childs && x < childs.length; x++)
		if (childs.item(x).nodeType == 3)
			return childs.item(x).nodeValue;
	return "";
};

TM.hideTimer = undefined;
TM.registerHideTimer = function(time) {
	if (this.hideTimer != undefined)
		this.unregisterHideTimer();
	this.hideTimer = setTimeout('TM.remove();',
			time);
};
TM.unregisterHideTimer = function() {
	try {
		if (this.hideTimer != undefined)
			clearTimeout(TM.hideTimer);
	} catch (e) { }
};

TM.remove = function () {
	if (typeof this.group != 'undefined') {
		this.group.removeNode();
		this.group = undefined;
	}
};

function detectBrowser() {
    var userAgent = navigator.userAgent;
    var browserName = navigator.appName;
    var fullVersion = '' + parseFloat(navigator.appVersion);
    var majorVersion = parseInt(navigator.appVersion, 10);
    var versionOffset;

    // UserAgent property is null in some cases. such as Adobe SVG Viewer etc.
    // browserName and fullVersion will remain as navigator.appName and navigator.appVersion by default
	if(userAgent != undefined){
		// The true version is after the browser name in userAgent
		// For Safari, it may be after "Safari" or "Version" 
		if ((versionOffset = userAgent.indexOf("MSIE")) != -1) {
	        browserName = "Microsoft Internet Explorer";
	        fullVersion = userAgent.substring(versionOffset + 5);
	    }
	    else if ((versionOffset = userAgent.indexOf("Chrome")) != -1) {
	        browserName = "Chrome";
	        fullVersion = userAgent.substring(versionOffset + 7);
	    }
	    
	    else if ((versionOffset = userAgent.indexOf("Safari")) != -1) {
	        browserName = "Safari";
	        fullVersion = userAgent.substring(versionOffset + 7);
	        if ((versionOffset = userAgent.indexOf("Version")) != -1) fullVersion = userAgent.substring(versionOffset + 8);
	    }
	    else if ((versionOffset = userAgent.indexOf("Firefox")) != -1) {
	        browserName = "Firefox";
	        fullVersion = userAgent.substring(versionOffset + 8);
	    }
	}

    // Trim the semicolon or space
	var index;
    if ((index = fullVersion.indexOf(";")) != -1) fullVersion = fullVersion.substring(0, index);
    if ((index = fullVersion.indexOf(" ")) != -1) fullVersion = fullVersion.substring(0, index);

    majorVersion = parseInt('' + fullVersion, 10);
    if (isNaN(majorVersion)) {
        majorVersion = parseInt(navigator.appVersion, 10);
    }
    
    return {"browserName" : browserName, "majorVersion" : majorVersion};
};

function isSvgTitleToolTipSupported() {
	var browserInfo = detectBrowser();
	var isSupported = false;
	
	if(((browserInfo.browserName === "Chrome") && (browserInfo.majorVersion >= 3)) ||
		((browserInfo.browserName === "Firefox") && (browserInfo.majorVersion >= 4)) ||
		((browserInfo.browserName === "Safari") && (browserInfo.majorVersion >= 4)) ||
		((browserInfo.browserName === "Microsoft Internet Explorer") && (browserInfo.majorVersion >= 9))) {
		
		isSupported = true;
	}

	return isSupported;
};

TM.show = function (evt, id, title, tooltipText) {
	// If the browser has native tooltip for title element, do not show
	// it twice.
	if (evt.type == 'mousemove') {
		if (isSvgTitleToolTipSupported()) {
			return;
		}
	}
	
	if (id != null && typeof id != 'undefined') {
		var mainSvg = evt.target.ownerDocument;
		var comp = mainSvg.getElementById(id);
		var styleStr = comp.getAttribute("style");
		rHiddenExp = /visibility:[ ]*hidden/g;
		results = styleStr.search(rHiddenExp);
		if (results != -1)
			return;
	}
	var text = TM.getText(TM.getTitleElement(evt));
	if ( tooltipText ) text = tooltipText;
	if (title)
		text = TM.getText(title);
	var x = evt.clientX;
	var y = evt.clientY;
	update = true;
	if (this.oldX != 'undefined') {
		diffX = (x - this.oldX);
		if (diffX < 0)
			diffX = diffX * (-1);
		diffY = (y - this.oldY);
		if (diffY < 0)
			diffY = diffY * (-1);
		if ((diffY > 5) || (diffX > 5))
			update = true;
	}
	if (update)
		TM.remove();
	if (typeof this.group == 'undefined') {
		this.oldX = x;
		this.oldY = y;
		this.height = 15;
		this.xPadding = 5;
		this.yPadding = 20;
		var mainSvg = evt.target.ownerDocument.documentElement;
		var off = mainSvg.currentTranslate;
		var scl = mainSvg.currentScale;
		var adjustedX = (x - off.x) / scl;
		var adjustedY = (y - off.y) / scl;
		this.group = new BuildHelper("g", {
			opacity : 0.8,
			display : "inline",
			transform : "translate(" + (adjustedX + (10 / scl)) + ","
					+ (adjustedY + (10 / scl)) + ")"
		});
		this.group.addToParent(mainSvg);
		this.rectangle = new BuildHelper("rect", {
			id : "test",
			x : 0,
			y : 5,
			transform : "scale(" + (1 / scl) + "," + (1 / scl) + ")",
			rx : 2,
			ry : 2,
			stroke : "black",
			height : this.height,
			classType : "tooltip"
		});
		this.rectangle.addToParent(this.group.element);
		var textObj = new BuildHelper("text", {
			id : "tooltip",
			x : this.xPadding,
			y : (this.yPadding),
			transform : "scale(" + (1 / scl) + "," + (1 / scl) + ")",
			classType : "tooltip text"
		});
		textObj.addToParent(this.group.element);
		TM.setContent(textObj, text);
		var outline = textObj.element.getBBox();
		var tooltipHeight = outline.height + 6;
		if (tooltipHeight < 17)
			tooltipHeight = 17;
		var tooltipWidth = outline.width + 2 * this.xPadding;
		var root = evt.target.ownerDocument.documentElement;
		var rootWidth = root.getAttribute('width');
		var rootHeight = root.getAttribute('height');
		if (((y + tooltipHeight) > rootHeight)
				|| ((x + tooltipWidth) > rootWidth)) {
			var transformX = x + this.xPadding;
			var transformY = y + this.yPadding;
			if ((y + tooltipHeight) > rootHeight)
				transformY = (rootHeight - tooltipHeight) - this.yPadding;
			if ((x + tooltipWidth) > rootWidth)
				transformX = (rootWidth - tooltipWidth) - this.xPadding;
			this.group.element.setAttributeNS(null, "transform", "translate("
					+ (transformX * xScale) + ", " + (transformY * yScale)
					+ ")");
		}
		this.rectangle.element.setAttributeNS(null, "width", tooltipWidth);
		this.rectangle.element.setAttributeNS(null, "height", tooltipHeight);
	}
	SVGChartUtil.stopBubble(evt);
	SVGChartUtil.stopDefault(evt);
};

TM.toggleToolTip = function (evt) {
	if (typeof this.group != 'undefined') {
		TM.remove();
	} else {
		TM.show(evt);
	}
};

TM.setContent = function (textElement, text) {
	text = text.replace(/\n/g, "\\n");
	var multiLine = text.split(/\\n/);
	for ( var x = 0; x < multiLine.length; x++) {
		if (x == 0) {
			textObj = new BuildHelper("tspan", {
				x : 5
			}, multiLine[x]);
		} else {
			textObj = new BuildHelper("tspan", {
				x : 5,
				dy : 17
			}, multiLine[x]);
		}
		textObj.addToParent(textElement.element);
	}
};

function toggleLabelsVisibility(evt, id, compList, labelList) {
	var mainSvg = evt.target.ownerDocument;
	for (var i = 0; i < compList.length; i = i + 1) {
		var comp = mainSvg.getElementById(id + '_' + compList[i]);
		if (comp == null)
			continue;
		var styleStr = comp.getAttribute("style");
		rVisibleExp = /visibility:[ ]*visible/g;
		rInheritExp = /visibility:[ ]*inherit/g;
		rHiddenExp = /visibility:[ ]*hidden/g;
		results = styleStr.search(rVisibleExp);
		inResults = styleStr.search(rInheritExp);
		if ((results == -1) && (inResults == -1)) {
			results = styleStr.search(rHiddenExp);
			if (results == -1)
				styleStr = styleStr + "visibility:hidden;";
			else
				styleStr = styleStr.replace(rHiddenExp, "visibility:visible");
		} else {
			if (inResults == -1) {
				styleStr = styleStr.replace(rVisibleExp, "visibility:hidden");
			} else {
				styleStr = styleStr.replace(rInheritExp, "visibility:hidden");
			}
		}
		comp.setAttributeNS(null, "style", styleStr);
	}
}
function toggleVisibility(evt, id, compList, labelList) {
	var mainSvg = evt.target.ownerDocument;
	var isHidden = true;
	for (var i = 0; i < compList.length; i = i + 1) {
		var comp = mainSvg.getElementById(id + '_' + compList[i]);
		if (comp == null)
			continue;
		var styleStr = comp.getAttribute("style");
		rVisibleExp = /visibility:[ ]*visible/g;
		rHiddenExp = /visibility:[ ]*hidden/g;
		results = styleStr.search(rVisibleExp);
		if (results == -1) {
			results = styleStr.search(rHiddenExp);
			if (results == -1)
				styleStr = styleStr + "visibility:hidden;";
			else {
				styleStr = styleStr.replace(rHiddenExp, "visibility:visible");
				isHidden = false;
			}
		} else {
			styleStr = styleStr.replace(rVisibleExp, "visibility:hidden");
		}
		comp.setAttributeNS(null, "style", styleStr);
	}
	if (labelList != null) {
		for (i = 0; i < labelList.length; i = i + 1) {
			var comp = mainSvg.getElementById(id + '_' + labelList[i] + '_g');
			if (comp == null)
				continue;
			var styleStr = comp.getAttribute("style");
			if (isHidden) {
				styleStr = styleStr + "visibility:hidden;";
				toggleLabelVisibility(evt, id + '_' + labelList[i], 'inherit');
			} else {
				styleStr = styleStr.replace(rHiddenExp, "visibility:visible");
			}
			comp.setAttributeNS(null, "style", styleStr);
		}
	}
}
function toggleLabelVisibility(evt, id, property) {
	var mainSvg = evt.target.ownerDocument;
	var comp = mainSvg.getElementById(id);
	var styleStr = comp.getAttribute("style");
	rVisibleExp = /visibility:[ ]*visible/g;
	rInheritExp = /visibility:[ ]*inherit/g;
	rHiddenExp = /visibility:[ ]*hidden/g;
	results = styleStr.search(rVisibleExp);
	inResults = styleStr.search(rInheritExp);
	if ((results == -1) && (inResults == -1)) {
		results = styleStr.search(rHiddenExp);
		if (results == -1)
			styleStr = styleStr + "visibility:" + property + ";";
	} else {
		if (inResults == -1)
			styleStr = styleStr.replace(rVisibleExp, "visibility:" + property);
		else
			styleStr = styleStr.replace(rInheritExp, "visibility:" + property);
	}
	comp.setAttributeNS(null, "style", styleStr);
}
function toHex(val) {
	strVal = Number(val).toString(16);
	while (strVal.length < 6) {
		strVal = "0" + strVal;
	}
	return strVal;
}
function getXorColor(color) {
	var value = parseInt(color, 16);
	value = 0xFFFFFF ^ value;
	return "#" + toHex(value);
}
var oldCompId = null;
var oldCompList = null;
var fillToColor = new Array();
var strokeToColor = new Array();
function highlight(evt, id, compList) {
	highlightElement(evt, oldCompId, oldCompList, false);
	if (id != oldCompId) {
		highlightElement(evt, id, compList, true);
		oldCompId = id;
		oldCompList = compList;
	} else {
		oldCompId = null;
		oldCompList = null;
		fillToColor = new Array();
		strokeToColor = new Array();
	}
}
function highlightElement(evt, id, compList, highlight) {
	if ((id == null) || (compList == null))
		return;
	var mainSvg = evt.target.ownerDocument;
	for (var i = 0; i < compList.length; i = i + 1) {
		var comp = mainSvg.getElementById(id + '_' + compList[i]);
		if (comp == null)
			continue;
		var styleStr = comp.getAttribute("style");
		// There's a blank between property name and value in IE9, so here
		// remove the blank first
		styleStr = styleStr.replace(/:[ ]*/g,':');
		fillIndex = styleStr.search("fill:");
		if (fillIndex != -1) {
			styleStr = getNewStyle(styleStr, fillIndex, "fill:", highlight,
					fillToColor, compList[i]);
		}
		strokeIndex = styleStr.search("stroke:");
		if (strokeIndex != -1) {
			styleStr = getNewStyle(styleStr, strokeIndex, "stroke:", highlight,
					strokeToColor, compList[i]);
		}
		comp.setAttributeNS(null, "style", styleStr);
	}
}
function getNewStyle(style, index, styleAttr, highlight, lookUpTable, id) {
    var start = index + styleAttr.length;
    var end = style.length;
    for ( var i = start; i < style.length; i++ ) {
         if ( style.charAt(i) == ';' ) {
             end = i;
             break;
         }
    }
    color = style.substring(start, end);
    if (color.substring(0, 6).search("none") != -1)
        return style;
    rgbIndex = color.search("rgb");
    urlIndex = color.search("url");
    if (rgbIndex == -1 || urlIndex != -1 ) {
        if ( urlIndex != -1 ) {
        	var rgbPattern = /rgb\s*([^\x27]+)/g;
	        var rgbResult = rgbPattern.exec(style);
    	    if ( rgbResult != null && typeof rgbResult != 'undefnied' ) {
        	    style = style.replace( rgbPattern, "");
            	style = style + rgbResult[0].substring( rgbResult[0].search(";") );
        	}
        }

        var urlStr = undefined;
        if (styleAttr == "fill:")
            urlStr = /fill:[\x20]*url\(#([^\x27]+)\)[\x20]*;/g;
        else
            urlStr = /stroke:[\x20]*url\(#([^\x27]+)\)[\x20]*;/g;
        var result = urlStr.exec(style);
        if (result != null && typeof result != 'undefined') {
            var endOf = /\w+h\b/;
            var re =  endOf.exec(result[1]);
            if ( typeof re == 'undefined' || re == null ) {
                return style.replace(urlStr, styleAttr + "url(#" + result[1]
                        + "h);");
            } else {
                return style.replace(urlStr, styleAttr + "url(#"
                        + result[1].substring(0, result[1].length - 1) + ");");
            }
        } else {
            hexColor = color.substring(1, 7);
            hc = getHighlight(hexColor, highlight, lookUpTable, id);
            return style.replace(styleAttr + "#" + hexColor, styleAttr + hc);
        }
    } else {
        bracketIndex = color.search("\\)");
        color = color.substring(0, bracketIndex);
        hexColor = getHexFromRGB(color);
        hc = getHighlight(hexColor, highlight, lookUpTable, id);
        return style.substring(0, index)
                + styleAttr
                + hc
                + style.substring(index + bracketIndex + styleAttr.length + 1,
                        style.length);
    } 
    return style;
}
function redirect(target, url) {
	if (isIE() && getIEVersion() < 9) {
		// SVG viewer in IE has issue in location.href, but IE 9 supports native
		// SVG so works well.
		target = '_blank';
	}
	if (target == '_top') {
		window.top.location.href = url;
	} else if (target == '_parent') {
		parent.location.href = url;
	} else if (target == '_self') {
		parent.location.href = url;
	} else {
		// Include '_blank'
		try {
			open(url);
		} catch (e) {
		}
	}
}
function isIPadIPhone() {
	var agt = parent.navigator.userAgent.toLowerCase();
	return agt.match(/iPad/i) || agt.match(/iPhone/i);
}
function isAndroid() {
	var agt = parent.navigator.userAgent.toLowerCase();
	return (agt.indexOf("android") > -1);
}
var isIPadIPhoneAndroid = isIPadIPhone() || isAndroid();

function isIE() {
	var agt = parent.navigator.userAgent.toLowerCase();
	return (agt.indexOf("msie") != -1);
}
function getIEVersion() {
	var agt = parent.navigator.userAgent.toLowerCase();
	var indexStart = agt.indexOf("msie");	
	if(indexStart>0) {
		var indexEnd = agt.substring(indexStart).indexOf(";");
		return parseFloat(agt.substring(indexStart+5,indexStart+indexEnd));
	}
	return 0;
}

var xScale = 1;
var yScale = 1;
function resizeSVG(e) {
	try {
		var root = e.target.ownerDocument.documentElement;
		var hotSpot = e.target.ownerDocument.getElementById('hotSpots');
		var g = e.target.ownerDocument.getElementById('outerG');
		xScale = innerWidth>0 ? innerWidth / root.getAttribute('initialWidth') : 1;
		yScale = innerHeight>0 ? innerHeight / root.getAttribute('initialHeight') : 1;
		root.setAttribute('width', xScale * root.getAttribute('initialWidth'));
		root
				.setAttribute('height', yScale
						* root.getAttribute('initialHeight'));
		g.setAttributeNS(null, 'transform', 'scale(' + xScale + ',' + yScale
				+ ')');
		hotSpot.setAttributeNS(null, 'transform', 'scale(' + xScale + ','
				+ yScale + ')');
	} catch (e) {
	}
}
function getHighlight(color, highlight, lookupTable, id) {
	if (!(highlight)) {
		color = lookupTable[id];
	} else {
		lookupTable[id] = color;
	}
	var r = color.substring(0, 2);
	r = parseInt(r, 16);
	var g = color.substring(2, 4);
	g = parseInt(g, 16);
	var b = color.substring(4, 6);
	b = parseInt(b, 16);
	if (highlight) {
		r = Math.ceil((r + 255) / 2);
		g = Math.ceil((g + 255) / 2);
		b = Math.ceil((b + 255) / 2);
	}
	rStr = r.toString(16);
	gStr = g.toString(16);
	bStr = b.toString(16);
	while (rStr.length < 2) {
		rStr = "0" + rStr;
	}
	while (gStr.length < 2) {
		gStr = "0" + gStr;
	}
	while (bStr.length < 2) {
		bStr = "0" + bStr;
	}
	return "#" + rStr + gStr + bStr;
}
function getHexFromRGB(color) {
	findThem = /\d{1,3}/g;
	listOfnum = color.match(findThem);
	r = Number(listOfnum[0]).toString(16);
	while (r.length < 2) {
		r = "0" + r;
	}
	g = Number(listOfnum[1]).toString(16);
	while (g.length < 2) {
		g = "0" + g;
	}
	b = Number(listOfnum[2]).toString(16);
	while (b.length < 2) {
		b = "0" + b;
	}
	return r + g + b;
};

MenuLayout = function () {
	this.width = 0;
	this.height = 0;
};

MenuLayout.prototype.updateMenuWidth = function(width) {
	if (width > this.width)
		this.width = width;
};

BirtChartActionsMenu = function() {
	this.hideTimer = undefined;
	this.group = undefined;
	this.menuInfo = undefined;
};
BirtChartActionsMenu.prototype= new Object();

BirtChartActionsMenu.TEXT_STYLES = 'font:font-family:font-size:font-size-adjust:font-stretch:font-style:font-variant:font-weight:direction:letter-spacing:text-decoration:unicode-bidi:word-spacing:alignment-baseline:baseline-shift:dominant-baseline:glyph-orientation-horizontal:glyph-orientation-vertical:kerning:text-anchor:writing-mode:cursor:color:';

// Hide tooltip		
BirtChartActionsMenu.remove = function() {
	if (typeof this.group != 'undefined') {
		this.group.removeNode();
		this.group = undefined;
	}
};

BirtChartActionsMenu.show = function (evt, source, menuInfo ) {
	
	if ( menuInfo.menuItemNames.length == 0 ) {
		BirtChartActionsMenu.remove();
	} else {
	this.menuInfo = menuInfo;
	this.menuLayout = new MenuLayout();

	var x = evt.clientX;
	var y = evt.clientY;

	update = true;
	if (this.oldX != 'undefined') {
		diffX = (x - this.oldX);
		if (diffX < 0)
			diffX = diffX * (-1);
		diffY = (y - this.oldY);
		if (diffY < 0)
			diffY = diffY * (-1);
		if ((diffY > 5) || (diffX > 5))
			update = true;
	}

	if (update)
		BirtChartActionsMenu.remove();

	// Destory this menu if no action in two seconds.
	if ( isIPadIPhoneAndroid ) {
		this.hideTimer = window.setTimeout('BirtChartActionsMenu.remove();', 2000);
	}
	    
	if (typeof this.group == 'undefined') {
		this.oldX = x;
		this.oldY = y;
		this.xPadding = 5;
		this.yPadding = 5;
		var mainSvg = evt.target.ownerDocument.documentElement;
		var off = mainSvg.currentTranslate;
		var scl = mainSvg.currentScale;
		var adjustedX = (x - off.x) / scl;
		var adjustedY = (y - off.y) / scl;
		this.group = new BuildHelper('g', {
			display : 'inline',
			transform : 'translate(' + adjustedX + ',' + adjustedY + ')'
		});
		this.group.addToParent(mainSvg);

		// Create menu items
		this.menuItems = new Array();
		this.textItems = new Array();
		var menuX = 0;
		var menuY = 0;

		// Create menu.
		var menu = BirtChartActionsMenu.createMenu(evt, this.group, menuX, menuY, scl);
		menuX = menuX + 1;
		menuY = menuY + 1;

		var offset = 0;
		for ( var i = 0; i < this.menuInfo.menuItemNames.length; i++) {
			var menuIdentify = this.menuInfo.menuItemNames[i];
			
			// Create a menu item.
			// 1. Create a menu item group.
			var menuItemGroup = new BuildHelper('g', {
				opacity : 1,
				display : 'inline'
			});
			// Add to parent.
			menuItemGroup.addToParent(this.group.element);

			// 2. Create outline of menu item.
			this.menuItems.push( BirtChartActionsMenu.createMenuItem(evt, menuItemGroup, menuX, menuY,
					scl, this.menuInfo.menuItems[menuIdentify], menuIdentify, i) );
			// 3. Create menu item text.
			this.textItems.push( BirtChartActionsMenu.createTextItem(evt, menuItemGroup, menuX
					+ this.xPadding, menuY + this.yPadding, scl,
					this.menuInfo.menuItems[menuIdentify], menuIdentify, i) );
			var outline = this.textItems[i].element.getBBox();
			// 4. Adjust menu item bounds.
			var menuHeight = this.yPadding * 2 + outline.height;
			var menuWidth = this.xPadding * 2 + outline.width;
			this.menuItems[i].element.setAttribute('height', menuHeight);
			this.menuLayout.updateMenuWidth(menuWidth);
			this.menuLayout.height += menuHeight;
			menuY = menuY + menuHeight;

			// 5. Adjust menu item text bounds.
			if (outline.y < 0) {
				offset += Math.abs(outline.y);
			}
			var curY = this.textItems[i].element.getAttribute('y');
			this.textItems[i].element.setAttribute('y', parseInt(curY) + offset
					+ this.yPadding);
		}

		// Set menu layout and styles.
		menu.element.setAttribute('width', this.menuLayout.width + 2);
		menu.element.setAttribute('height', this.menuLayout.height + 2);
		menu.element.setAttribute('stroke', 'black');
		menu.element.setAttribute('stroke-width', '1px');
		SVGChartUtil.setStyles(menu.element, BirtChartActionsMenu.getMenuStyles(this.menuInfo.menuStyles));

		// Update all menu items bounds.
		for ( var i = 0; i < this.menuItems.length; i++) {
			this.menuItems[i].element.setAttribute('width', this.menuLayout.width);
		}

		// Adjust position of menu.		
		var root = evt.target.ownerDocument.documentElement;
		var rootWidth = root.getAttribute('width');
		var rootHeight = root.getAttribute('height');
		var menuWidth = this.menuLayout.width;
		var menuHeight = this.menuLayout.height;
		if (((y + menuHeight) > rootHeight) || ((x + menuWidth) > rootWidth)) {
			var transformX = x + this.xPadding;
			var transformY = y + this.yPadding;
			if ((y + menuHeight) > rootHeight)
				transformY = (rootHeight - menuHeight) - this.yPadding;
			if ((x + menuWidth) > rootWidth)
				transformX = (rootWidth - menuWidth) - this.xPadding;
			if ( transformX < 0 ) transformX = 0;
			if ( transformY < 0 ) transformY = 0;
			this.group.element.setAttribute('transform', 'translate('
					+ (transformX / scl) + ', ' + (transformY / scl) + ')');
		}
	}
	}
	SVGChartUtil.stopBubble(evt);
	SVGChartUtil.stopDefault(evt);
};

BirtChartActionsMenu.createMenu = function(evt, group, xOff, yOff, scl) {
	var rectangle = new BuildHelper('rect', {
		id : 'hyperlinkmenu',
		x : xOff,
		y : yOff,
		height : 1,
		width : 1,
		fill : 'white',
		transform : 'scale(' + (1 / scl) + ',' + (1 / scl) + ')',
		onmouseover : isIPadIPhoneAndroid ? '' : 'BirtChartActionsMenu.onMouseOver( evt )',
		onmouseout : isIPadIPhoneAndroid ? '' : 'BirtChartActionsMenu.onMouseOut( evt )'
	});

	rectangle.addToParent(group.element);
	return rectangle;
};

BirtChartActionsMenu.createMenuItem = function(evt, group, xOff, yOff, scl,
		menuItemInfo, identify, index ) {
	var menuID = 'menuitem_' + menuItemInfo.text + '_' + index;
	var rectangle = new BuildHelper('rect', {
		id : menuID,
		x : xOff,
		y : yOff,
		height : 1,
		width : 1,
		transform : 'scale(' + (1 / scl) + ',' + (1 / scl) + ')',
		fill : 'white',
		stroke : 'none',
		onmouseover : isIPadIPhoneAndroid ? '' : 'BirtChartActionsMenu.onMouseOver( evt, ' + identify + ');',
		onmouseout : isIPadIPhoneAndroid ? '' : 'BirtChartActionsMenu.onMouseOut( evt, ' + identify + ');',
		onclick : 'BirtChartActionsMenu.executeMenuAction( evt, ' + identify + ');'
	});

	rectangle.addToParent(group.element);
	SVGChartUtil.setStyles(rectangle.element, BirtChartActionsMenu.getMenuStyles(this.menuInfo.menuItemStyles));
	BirtChartActionsMenu.createTooltipItem(evt, rectangle, menuItemInfo.tooltip);
	return rectangle;
};

BirtChartActionsMenu.createTextItem = function(evt, group, xOff, yOff, scl,
		menuItemInfo, identify, index ) {
	var menuID = 'menuitem_' + menuItemInfo.text + '_' + index;
	var textObj = new BuildHelper('text', {
		id : 'text_' + menuID,
		x : xOff,
		y : yOff,
		transform : 'scale(' + (1 / scl) + ',' + (1 / scl) + ')',
		style : 'text-anchor:start; fill:black',
		onmouseover : isIPadIPhoneAndroid ? '' : 'BirtChartActionsMenu.onMouseOver( evt, ' + identify + ');',
		onmouseout : isIPadIPhoneAndroid ? '' : 'BirtChartActionsMenu.onMouseOut( evt, ' + identify + ');',
		onclick : 'BirtChartActionsMenu.executeMenuAction( evt, ' + identify + ');'
	});

	textObj.addToParent(group.element);
	var styles = BirtChartActionsMenu.getTextStyles(this.menuInfo.menuItemStyles)
	BirtChartActionsMenu.setContent(evt, textObj, styles, menuItemInfo.text, menuItemInfo.tooltip);
	SVGChartUtil.setStyles(textObj.element, styles);
	if (!BirtChartActionsMenu.isSetCursor(styles))
		textObj.element.setAttribute('pointer-events', 'none');

	return textObj;
};

BirtChartActionsMenu.setContent = function(evt, textElement, styles, text, tooltip) {
	text = text.replace(/\n/g, '\\n');
	var multiLine = text.split(/\n/);
	for ( var x = 0; x < multiLine.length; x++) {
		if (x == 0) {
			textObj = new BuildHelper('tspan', {
				x : 5,
				onmouseover : isIPadIPhoneAndroid ? '' : 'BirtChartActionsMenu.showTooltip(evt);',
				onmouseout : isIPadIPhoneAndroid ? '' : 'try{TM.remove();}catch(e){}'
			}, multiLine[x]);
		} else {
			textObj = new BuildHelper('tspan', {
				x : 5,
				dy : 17,
				onmouseover : isIPadIPhoneAndroid ? '' : 'BirtChartActionsMenu.showTooltip(evt);',
				onmouseout : isIPadIPhoneAndroid ? '' : 'try{TM.remove();}catch(e){}'
			}, multiLine[x]);
		}
		textObj.addToParent(textElement.element);
		SVGChartUtil.setStyles(textObj.element, styles);
		if (!BirtChartActionsMenu.isSetCursor(styles))
			textObj.element.setAttribute('pointer-events', 'none');
		BirtChartActionsMenu.createTooltipItem(evt, textElement, tooltip);
	}
};

BirtChartActionsMenu.createTooltipItem = function(evt, parent, tooltip) {
	if (typeof tooltip == 'undefined')
		return null;
	var title = new BuildHelper('title', {
		id : 'title_' + tooltip
	});
	title.addToParent(parent.element);
	var textObj = evt.target.ownerDocument.createTextNode(tooltip);
	title.element.appendChild(textObj);
	return title;
};

BirtChartActionsMenu.showTooltip = function(evt) {
	try {
		var elem = BirtChartActionsMenu.getTitleElement(evt.currentTarget);
		if (elem != null)
			TM.show(evt, null, elem);
	} catch (e) {
	}
	return;
};

BirtChartActionsMenu.getTitleElement = function(elem) {
	if (elem == null)
		return null;
	var childs = elem.childNodes;

	for ( var x = 0; x < childs.length; x++) {
		if (childs.item(x).nodeType == 1 && childs.item(x).nodeName == 'title')
			return childs.item(x);
		var e = BirtChartActionsMenu.getTitleElement(childs.item(x));
		if (e != null)
			return e;
	}
	return null;
};

BirtChartActionsMenu.executeMenuAction = function(evt, identify){
	try {
		TM.remove();
	} catch (e) {
	};
	BirtChartActionsMenu.remove();
    var menuItemInfo = this.menuInfo.menuItems[identify];
    BirtChartActionsMenu.executeMenuActionImpl( evt, menuItemInfo, this.menuInfo );
};

BirtChartActionsMenu.executeMenuActionImpl = function(evt, menuItemInfo, menuInfo ){
 	switch (menuItemInfo.actionType) {
        case BirtChartInteractivityActions.HYPER_LINK:
            BirtChartActionsMenu.redirect(menuItemInfo.actionValue, menuItemInfo.target);
            break;
        case BirtChartInteractivityActions.INVOKE_SCRIPTS:
			var scripts = menuItemInfo.actionValue;
			if (scripts != undefined) {
				BirtChartActionsMenu.invokeScripts(scripts, evt,
					menuInfo.categoryData, menuInfo.valueData,
					menuInfo.valueSeriesName, menuInfo.legendItemData,
					menuInfo.legendItemText, menuInfo.legendItemValue,
					menuInfo.axisLabel, menuInfo);
			}
            break;
        case BirtChartInteractivityActions.HIGHLIGHT:
            highlight(evt, menuInfo.id2, menuInfo.compList);
            break;
        case BirtChartInteractivityActions.TOGGLE_VISIBILITY:
            toggleVisibility(evt, menuInfo.id2, menuInfo.compList, menuInfo.labelList);
            break;
        case BirtChartInteractivityActions.TOGGLE_DATA_POINT_VISIBILITY:
            toggleLabelsVisibility(evt, menuInfo.id2, menuInfo.labelList);
            break;
        case BirtChartInteractivityActions.SHOW_TOOLTIP:
            TM.show( evt, null, null, menuItemInfo.text );
            TM.registerHideTimer(1000);
            break;
 	}
}

BirtChartActionsMenu.redirect = function(url, urlTarget){

    if (url.indexOf('#', 0) == 0) {
        top.document.location.hash = url;
        return;
    }
    if (url.indexOf('javascript:', 0) == 0) {
        eval(url.substring(11, url.length - 1));
        return;
    }
    var target = 'null';
    if (urlTarget && urlTarget != '') 
        target = urlTarget;
    try {
        parent.redirect(target, url);
    } 
    catch (e) {
        redirect(target, url);
    }
};

BirtChartActionsMenu.invokeScripts = function(scripts, evt, categoryData,
		valueData, valueSeriesName, legendItemData, legendItemText,
		legendItemValue, axisLabel, menuInfo) {
	eval( scripts );
};

BirtChartActionsMenu.onMouseOver = function(evt, identify){
    var target = evt.currentTarget;
    if (target == null) return;
	try { window.clearTimeout(this.hideTimer); } catch (e) {};
    if ( typeof identify == 'undefined' ) return;
    var menuItemInfo = this.menuInfo.menuItems[identify];
    if ( menuItemInfo.isTooltipItem( ) ) return;
    var id = target.id;
    if (id.substr(0, 'text_'.length) == 'text_') {
        var mainSvg = evt.target.ownerDocument;
        var menuComp = mainSvg.getElementById(id.substring('text_'.length, id.length));
        SVGChartUtil.setStyles(menuComp, BirtChartActionsMenu.getMenuStyles(this.menuInfo.mouseOverStyles));
        var textStyle = BirtChartActionsMenu.getTextStyles(this.menuInfo.mouseOverStyles);
        SVGChartUtil.setStyles(target, textStyle);
        SVGChartUtil.setStyles(target.childNodes.item(0), textStyle);
    } else {
        var mainSvg = evt.target.ownerDocument;
        var menuComp = mainSvg.getElementById(id);
        var textComp = mainSvg.getElementById('text_' + id);
        SVGChartUtil.setStyles(menuComp, BirtChartActionsMenu.getMenuStyles(this.menuInfo.mouseOverStyles));
        var textStyle = BirtChartActionsMenu.getTextStyles(this.menuInfo.mouseOverStyles);
        SVGChartUtil.setStyles(textComp, textStyle);
        SVGChartUtil.setStyles(textComp.childNodes.item(0), textStyle);
    }
    BirtChartActionsMenu.showTooltip(evt);
};

BirtChartActionsMenu.onMouseOut = function(evt, identify ){
    var target = evt.currentTarget;
    if (target == null) return;
    try { TM.remove(); } catch (e) {};
    this.hideTimer = window.setTimeout('BirtChartActionsMenu.remove();', 300);
    if ( typeof identify == 'undefined' ) return;
    var id = target.id;
    var menuItemInfo = this.menuInfo.menuItems[identify];
    if ( menuItemInfo.isTooltipItem( ) ) return;
    if (id.substr(0, 'text_'.length) == 'text_') {
        var mainSvg = evt.target.ownerDocument;
        var menuComp = mainSvg.getElementById(id.substring('text_'.length, id.length));
        SVGChartUtil.setStyles(menuComp, BirtChartActionsMenu.getMenuStyles(this.menuInfo.mouseOutStyles));
        var textStyle = BirtChartActionsMenu.getTextStyles(this.menuInfo.mouseOutStyles);
        SVGChartUtil.setStyles(target, textStyle);
        SVGChartUtil.setStyles(target.childNodes.item(0), textStyle);
    } else {
        var mainSvg = evt.target.ownerDocument;
        var menuComp = mainSvg.getElementById(id);
        var textComp = mainSvg.getElementById('text_' + id);
        SVGChartUtil.setStyles(menuComp, BirtChartActionsMenu.getMenuStyles(this.menuInfo.mouseOutStyles));
        var textStyle = BirtChartActionsMenu.getTextStyles(this.menuInfo.mouseOutStyles);
        SVGChartUtil.setStyles(textComp, textStyle);
        SVGChartUtil.setStyles(textComp.childNodes.item(0), textStyle);
    }
};

BirtChartActionsMenu.getTextStyles = function(styles) {
	var total;
	if (!SVGChartUtil.isArray(styles)) {
		total = SVGChartUtil.getStylesArray(styles);
	} else {
		total = styles;
	}

	var styleString = '';
	for ( var i = 0; i < total.length; i++) {
		if (this.TEXT_STYLES.search(total[i][0] + ':') < 0)
			continue;
		if (total[i][0] == 'backgroundColor'
				|| total[i][0] == 'background-color')
			continue;
		if (total[i][0] == 'fill')
			continue;
		if (total[i][0] == 'color') {
			styleString += 'fill';
		} else
			styleString += total[i][0];
		styleString += ': ' + total[i][1] + ';';
	}

	return styleString;
};

BirtChartActionsMenu.getMenuStyles = function(styles) {
	var total;
	if (!SVGChartUtil.isArray(styles)) {
		total = SVGChartUtil.getStylesArray(styles);
	} else {
		total = styles;
	}

	var styleString = '';
	for ( var i = 0; i < total.length; i++) {
		if (this.TEXT_STYLES.search(total[i][0] + ':') >= 0)
			continue;
		if (total[i][0] == 'color')
			continue;
		if (total[i][0] == 'backgroundColor'
				|| total[i][0] == 'background-color') {
			styleString += 'fill';
		} else
			styleString += total[i][0];
		styleString += ': ' + total[i][1] + ';';
	}
	return styleString;
};

BirtChartActionsMenu.isSetCursor = function(styleStr) {
	if (styleStr.search('cursor[ ]*:') >= 0)
		return true;
	return false;
};

SVGChartUtil = function() {};
SVGChartUtil.prototype = new Object();

SVGChartUtil.getStylesArray = function (stylesStr) {
	var stylesArray = stylesStr.split(';');
	var total = new Array(stylesArray.length);
	for ( var i = 0; i < stylesArray.length; i++) {
		var unit = stylesArray[i].split(':');
		total[i] = new Array(2);
		total[i][0] = unit[0];
		total[i][1] = unit[1];
	}
	return total;
};

SVGChartUtil.setStyles = function (element, styles) {
	var total;
	if (!this.isArray(styles)) {
		total = this.getStylesArray(styles);
	} else {
		total = styles;
	}

	var styleAttr = element.getAttribute('style');
	for ( var i = 0; i < total.length; i++) {
		var key = total[i][0];
		var value = total[i][1];
		if (key == '' || typeof value == 'undefined')
			continue;
		styleAttr = this.updateStyle(styleAttr, key, value);
	}
	element.setAttribute('style', styleAttr);
};

SVGChartUtil.updateStyle = function (styleStr, key, value) {
	if (!styleStr)
		return key + ':' + value + ';';
	var styleAttr = styleStr;
	var index = styleAttr.search('[ ]*' + key + ':');
	if (index >= 0) {
		var index2 = styleAttr.indexOf(';', index);
		var s = styleAttr.substring(index, index2 + 1);
		styleAttr = styleAttr.replace(s, key + ':' + value + ';');
	} else {
		styleAttr = styleAttr + key + ':' + value + ';';
	}
	return styleAttr;
};

SVGChartUtil.isArray = function (arr) {
	return !!arr && arr.constructor == Array;
};

// Stop the event bubble.		
SVGChartUtil.stopBubble = function (e) {
	// If the e exists, then it isn't in IE.		
	try {
		if (e && e.stopPropagation)
			e.stopPropagation();
		else
			window.event.cancelBubble = true;
	} catch (e) {
	}
	;
	return false;
};

// Stop default action of Browser for event.		
SVGChartUtil.stopDefault = function (e) {
	// If the e exists, the it isn't in IE.		
	try {
		if (e && e.preventDefault)
			e.preventDefault();
		else
			window.event.returnValue = false;
	} catch (e) {
	}
	;
	return false;
};

BirtChartMenuInfo = function() {
	this.className = 'BirtChartMenuInfo';

	this.id = undefined;
	this.text = undefined;
	this.cssClass = undefined;

	this.categoryData = undefined;
	this.valueData = undefined;
	this.valueSeriesName = undefined;

	this.legendItemText = undefined;
	this.legendItemValue = undefined;
	this.axisLabel = undefined;
	
	this.menuStyles = undefined;
	this.menuItemStyles = undefined;
	this.mouseOverStyles = undefined;
	this.mouseOutStyles = undefined;

	this.menuItemNames = [];
	this.menuItems = [];
	this.menuCount = 0;
	
	this.compList = undefined;
	this.labelList = undefined;
	this.id2 = undefined;
};

BirtChartMenuInfo.prototype = {
	addItemInfo : function(itemInfo) {
		var item = '' + this.menuCount;
		this.menuItemNames.push( item );
		this.menuItems[item] = itemInfo;
		this.menuCount = this.menuCount + 1;
	}
};

BirtChartMenuItemInfo = function() {
	this.className = 'BirtChartMenuItemInfo';
	this.text = undefined;
	this.target = undefined;
	this.cssClass = undefined;
	this.tooltip = undefined;

	this.actionType = undefined;
	this.actionValue = undefined;
};

BirtChartMenuItemInfo.prototype = new Object();
BirtChartMenuItemInfo.prototype.isTooltipItem = function() {
	return ( this.actionType == BirtChartInteractivityActions.SHOW_TOOLTIP );
}

BirtChartInteractivityActions = function () {};
BirtChartInteractivityActions.prototype = new Object();

BirtChartInteractivityActions.HYPER_LINK = 1;
BirtChartInteractivityActions.INVOKE_SCRIPTS = 2;
BirtChartInteractivityActions.HIGHLIGHT = 3;
BirtChartInteractivityActions.TOGGLE_VISIBILITY = 4;
BirtChartInteractivityActions.TOGGLE_DATA_POINT_VISIBILITY = 5;
BirtChartInteractivityActions.SHOW_TOOLTIP = 6;
]]></script><style type="text/css"><![CDATA[.tooltip.text{ text-anchor:start;font-size:12pt;fill:black;}.tooltip{fill:rgb(244,245,235)}]]></style><g id="909101101_1799579108" style="visibility:visible;fill-opacity:1.0;fill:#ffffff;stroke:none;"><path d=" M0.0 0.0 L763.0 0.0 L763.0 381.5 L0.0 381.5 L0.0 0.0 Z"/></g><g id="909101101_1799579108@1" style="visibility:visible;"/><g id="1157709283_1799579108" style="visibility:visible;"/><g id="1157709283_1799579108@1" style="visibility:visible;"/><g id="1157709283_1335772743@2" style="visibility:visible;fill-opacity:0.0;fill:#ffffff;stroke:none;"><path d=" M301.66666 8.0 L461.3333 8.0 L461.3333 33.0 L301.66666 33.0 L301.66666 8.0 Z"/><text font-family="Times New Roman" font-size="21" font-weight="bold" stroke="none" style="fill-opacity:1.0;fill:#000000;" x="305.0" xml:space="preserve" y="28.0">Exam results</text></g><g id="517636632_1799579108" style="visibility:visible;"/><g id="517636632_1799579108@1" style="visibility:visible;"/><g id="517636632_1799579108@2" style="visibility:visible;"/><g id="512344324_1762597412" style="visibility:visible;"/><g id="512344324_1762597412@1" style="visibility:visible;"/><g id="512344324_1762597412@2" style="visibility:visible;"/><g id="512344324_1762597412@3" style="visibility:visible;"/><g id="512344324_1762597412@4" style="visibility:visible;stroke:#c4c4c4;stroke-width:1.0;stroke-miterlimit:10.0;stroke-linejoin:round;stroke-linecap:square;"><path d=" M42.333332 346.5 L42.333332 356.5"/></g><g id="512344324_1762597412@5" style="visibility:visible;"/><g id="512344324_1762597412@6" style="visibility:visible;"/><g id="512344324_1762597412@7" style="visibility:visible;"/><g id="512344324_1762597412@8" style="visibility:visible;"/><g id="512344324_1762597412@9" style="visibility:visible;stroke:#c4c4c4;stroke-width:1.0;stroke-miterlimit:10.0;stroke-linejoin:round;stroke-linecap:square;"><path d=" M247.72223 346.5 L247.72223 356.5"/></g><g id="512344324_1762597412@10" style="visibility:visible;"/><g id="512344324_1762597412@11" style="visibility:visible;"/><g id="512344324_1762597412@12" style="visibility:visible;"/><g id="512344324_1762597412@13" style="visibility:visible;"/><g id="512344324_1762597412@14" style="visibility:visible;stroke:#c4c4c4;stroke-width:1.0;stroke-miterlimit:10.0;stroke-linejoin:round;stroke-linecap:square;"><path d=" M453.1111 346.5 L453.1111 356.5"/></g><g id="512344324_1762597412@15" style="visibility:visible;stroke:#c4c4c4;stroke-width:1.0;stroke-miterlimit:10.0;stroke-linejoin:round;stroke-linecap:square;"><path d=" M658.0 346.5 L658.0 356.5"/></g><g id="512344324_1762597412@16" style="visibility:visible;stroke:#000000;stroke-width:1.0;stroke-miterlimit:10.0;stroke-linejoin:round;stroke-linecap:square;"><path d=" M42.333332 351.5 L658.5 351.5"/></g><g id="560648627_1762597412" style="visibility:visible;stroke:#c4c4c4;stroke-width:1.0;stroke-miterlimit:10.0;stroke-linejoin:round;stroke-linecap:square;"><path d=" M30.666666 344.83334 L40.666668 344.83334"/></g><g id="560648627_1762597412@1" style="visibility:visible;stroke:#c4c4c4;stroke-width:1.0;stroke-miterlimit:10.0;stroke-linejoin:round;stroke-linecap:square;"><path d=" M30.666666 312.96295 L40.666668 312.96295"/></g><g id="560648627_1762597412@2" style="visibility:visible;stroke:#c4c4c4;stroke-width:1.0;stroke-miterlimit:10.0;stroke-linejoin:round;stroke-linecap:square;"><path d=" M30.666666 281.0926 L40.666668 281.0926"/></g><g id="560648627_1762597412@3" style="visibility:visible;stroke:#c4c4c4;stroke-width:1.0;stroke-miterlimit:10.0;stroke-linejoin:round;stroke-linecap:square;"><path d=" M30.666666 249.22223 L40.666668 249.22223"/></g><g id="560648627_1762597412@4" style="visibility:visible;stroke:#c4c4c4;stroke-width:1.0;stroke-miterlimit:10.0;stroke-linejoin:round;stroke-linecap:square;"><path d=" M30.666666 217.35185 L40.666668 217.35185"/></g><g id="560648627_1762597412@5" style="visibility:visible;stroke:#c4c4c4;stroke-width:1.0;stroke-miterlimit:10.0;stroke-linejoin:round;stroke-linecap:square;"><path d=" M30.666666 185.48148 L40.666668 185.48148"/></g><g id="560648627_1762597412@6" style="visibility:visible;stroke:#c4c4c4;stroke-width:1.0;stroke-miterlimit:10.0;stroke-linejoin:round;stroke-linecap:square;"><path d=" M30.666666 153.61111 L40.666668 153.61111"/></g><g id="560648627_1762597412@7" style="visibility:visible;stroke:#c4c4c4;stroke-width:1.0;stroke-miterlimit:10.0;stroke-linejoin:round;stroke-linecap:square;"><path d=" M30.666666 121.74074 L40.666668 121.74074"/></g><g id="560648627_1762597412@8" style="visibility:visible;stroke:#c4c4c4;stroke-width:1.0;stroke-miterlimit:10.0;stroke-linejoin:round;stroke-linecap:square;"><path d=" M30.666666 89.87037 L40.666668 89.87037"/></g><g id="560648627_1762597412@9" style="visibility:visible;stroke:#c4c4c4;stroke-width:1.0;stroke-miterlimit:10.0;stroke-linejoin:round;stroke-linecap:square;"><path d=" M30.666666 58.0 L40.666668 58.0"/></g><g id="560648627_1762597412@10" style="visibility:visible;stroke:#000000;stroke-width:1.0;stroke-miterlimit:10.0;stroke-linejoin:round;stroke-linecap:square;"><path d=" M35.666668 344.83334 L35.666668 58.0"/></g><g clip-path="url(#clip1754786894)" id="809583745_123219630" style="visibility:visible;fill-opacity:1.0;fill:#50a6da;stroke:none;"><path d=" M93.68056 281.0926 L93.68056 345.83334 L127.91204 345.83334 L127.91204 281.0926 Z"/></g><g clip-path="url(#clip1754786894)" id="809583745_123219630@1" style="visibility:visible;stroke:#387498;stroke-width:1.0;stroke-miterlimit:10.0;stroke-linejoin:round;stroke-linecap:square;"><path d=" M93.68056 281.0926 L93.68056 345.83334 L127.91204 345.83334 L127.91204 281.0926 Z"/></g><g clip-path="url(#clip1754786894)" id="809583745_463047511@2" style="visibility:visible;fill-opacity:1.0;fill:#50a6da;stroke:none;"><path d=" M299.06946 312.96295 L299.06946 345.83334 L333.30093 345.83334 L333.30093 312.96295 Z"/></g><g clip-path="url(#clip1754786894)" id="809583745_463047511@3" style="visibility:visible;stroke:#387498;stroke-width:1.0;stroke-miterlimit:10.0;stroke-linejoin:round;stroke-linecap:square;"><path d=" M299.06946 312.96295 L299.06946 345.83334 L333.30093 345.83334 L333.30093 312.96295 Z"/></g><g clip-path="url(#clip1754786894)" id="809583745_329676543@4" style="visibility:visible;fill-opacity:1.0;fill:#50a6da;stroke:none;"><path d=" M504.45834 217.35185 L504.45834 345.83334 L538.6898 345.83334 L538.6898 217.35185 Z"/></g><g clip-path="url(#clip1754786894)" id="809583745_329676543@5" style="visibility:visible;stroke:#387498;stroke-width:1.0;stroke-miterlimit:10.0;stroke-linejoin:round;stroke-linecap:square;"><path d=" M504.45834 217.35185 L504.45834 345.83334 L538.6898 345.83334 L538.6898 217.35185 Z"/></g><g clip-path="url(#clip1754786894)" id="1890359668_1106044969" style="visibility:visible;fill-opacity:1.0;fill:#f2586a;stroke:none;"><path d=" M127.91204 121.74074 L127.91204 345.83334 L162.14352 345.83334 L162.14352 121.74074 Z"/></g><g clip-path="url(#clip1754786894)" id="1890359668_1106044969@1" style="visibility:visible;stroke:#a93d4a;stroke-width:1.0;stroke-miterlimit:10.0;stroke-linejoin:round;stroke-linecap:square;"><path d=" M127.91204 121.74074 L127.91204 345.83334 L162.14352 345.83334 L162.14352 121.74074 Z"/></g><g clip-path="url(#clip1754786894)" id="1890359668_1548779488@2" style="visibility:visible;fill-opacity:1.0;fill:#f2586a;stroke:none;"><path d=" M333.30093 153.61111 L333.30093 345.83334 L367.5324 345.83334 L367.5324 153.61111 Z"/></g><g clip-path="url(#clip1754786894)" id="1890359668_1548779488@3" style="visibility:visible;stroke:#a93d4a;stroke-width:1.0;stroke-miterlimit:10.0;stroke-linejoin:round;stroke-linecap:square;"><path d=" M333.30093 153.61111 L333.30093 345.83334 L367.5324 345.83334 L367.5324 153.61111 Z"/></g><g clip-path="url(#clip1754786894)" id="1890359668_748801710@4" style="visibility:visible;fill-opacity:1.0;fill:#f2586a;stroke:none;"><path d=" M538.6898 249.22223 L538.6898 345.83334 L572.9213 345.83334 L572.9213 249.22223 Z"/></g><g clip-path="url(#clip1754786894)" id="1890359668_748801710@5" style="visibility:visible;stroke:#a93d4a;stroke-width:1.0;stroke-miterlimit:10.0;stroke-linejoin:round;stroke-linecap:square;"><path d=" M538.6898 249.22223 L538.6898 345.83334 L572.9213 345.83334 L572.9213 249.22223 Z"/></g><g clip-path="url(#clip1754786894)" id="646966268_3903062" style="visibility:visible;fill-opacity:1.0;fill:#e8ac39;stroke:none;"><path d=" M162.14352 185.48148 L162.14352 345.83334 L196.375 345.83334 L196.375 185.48148 Z"/></g><g clip-path="url(#clip1754786894)" id="646966268_3903062@1" style="visibility:visible;stroke:#a27827;stroke-width:1.0;stroke-miterlimit:10.0;stroke-linejoin:round;stroke-linecap:square;"><path d=" M162.14352 185.48148 L162.14352 345.83334 L196.375 345.83334 L196.375 185.48148 Z"/></g><g clip-path="url(#clip1754786894)" id="646966268_2124940538@2" style="visibility:visible;fill-opacity:1.0;fill:#e8ac39;stroke:none;"><path d=" M367.5324 89.87037 L367.5324 345.83334 L401.7639 345.83334 L401.7639 89.87037 Z"/></g><g clip-path="url(#clip1754786894)" id="646966268_2124940538@3" style="visibility:visible;stroke:#a27827;stroke-width:1.0;stroke-miterlimit:10.0;stroke-linejoin:round;stroke-linecap:square;"><path d=" M367.5324 89.87037 L367.5324 345.83334 L401.7639 345.83334 L401.7639 89.87037 Z"/></g><g clip-path="url(#clip1754786894)" id="646966268_660260059@4" style="visibility:visible;fill-opacity:1.0;fill:#e8ac39;stroke:none;"><path d=" M572.9213 249.22223 L572.9213 345.83334 L607.1528 345.83334 L607.1528 249.22223 Z"/></g><g clip-path="url(#clip1754786894)" id="646966268_660260059@5" style="visibility:visible;stroke:#a27827;stroke-width:1.0;stroke-miterlimit:10.0;stroke-linejoin:round;stroke-linecap:square;"><path d=" M572.9213 249.22223 L572.9213 345.83334 L607.1528 345.83334 L607.1528 249.22223 Z"/></g><g id="512344324_1976040555@17" style="visibility:visible;fill-opacity:0.0;fill:#ffffff;stroke:none;"><path d=" M125.19444 357.5 L164.86111 357.5 L164.86111 374.5 L125.19444 374.5 L125.19444 357.5 Z"/><text font-family="Times New Roman" font-size="13" stroke="none" style="text-rendering:optimizeLegibility;fill-opacity:1.0;fill:#000000;" x="127.861115" xml:space="preserve" y="370.5">Anne</text></g><g id="512344324_1628192564@18" style="visibility:visible;fill-opacity:0.0;fill:#ffffff;stroke:none;"><path d=" M338.08334 357.5 L362.75 357.5 L362.75 374.5 L338.08334 374.5 L338.08334 357.5 Z"/><text font-family="Times New Roman" font-size="13" stroke="none" style="text-rendering:optimizeLegibility;fill-opacity:1.0;fill:#000000;" x="340.75" xml:space="preserve" y="370.5">Bill</text></g><g id="512344324_1606216362@19" style="visibility:visible;fill-opacity:0.0;fill:#ffffff;stroke:none;"><path d=" M538.4722 357.5 L573.1389 357.5 L573.1389 374.5 L538.4722 374.5 L538.4722 357.5 Z"/><text font-family="Times New Roman" font-size="13" stroke="none" style="text-rendering:optimizeLegibility;fill-opacity:1.0;fill:#000000;" x="541.1389" xml:space="preserve" y="370.5">Tom</text></g><g id="560648627_1420868390@11" style="visibility:visible;fill-opacity:0.0;fill:#ffffff;stroke:none;"><path d=" M15.0 336.33334 L29.666668 336.33334 L29.666668 353.33334 L15.0 353.33334 L15.0 336.33334 Z"/><text font-family="Times New Roman" font-size="13" stroke="none" style="text-rendering:optimizeLegibility;fill-opacity:1.0;fill:#000000;" x="17.666666" xml:space="preserve" y="349.33334">2</text></g><g id="560648627_722075734@12" style="visibility:visible;fill-opacity:0.0;fill:#ffffff;stroke:none;"><path d=" M15.0 304.46295 L29.666668 304.46295 L29.666668 321.46295 L15.0 321.46295 L15.0 304.46295 Z"/><text font-family="Times New Roman" font-size="13" stroke="none" style="text-rendering:optimizeLegibility;fill-opacity:1.0;fill:#000000;" x="17.666666" xml:space="preserve" y="317.46295">3</text></g><g id="560648627_1435966024@13" style="visibility:visible;fill-opacity:0.0;fill:#ffffff;stroke:none;"><path d=" M15.0 272.5926 L29.666668 272.5926 L29.666668 289.5926 L15.0 289.5926 L15.0 272.5926 Z"/><text font-family="Times New Roman" font-size="13" stroke="none" style="text-rendering:optimizeLegibility;fill-opacity:1.0;fill:#000000;" x="17.666666" xml:space="preserve" y="285.5926">4</text></g><g id="560648627_1973763333@14" style="visibility:visible;fill-opacity:0.0;fill:#ffffff;stroke:none;"><path d=" M15.0 240.72223 L29.666668 240.72223 L29.666668 257.72223 L15.0 257.72223 L15.0 240.72223 Z"/><text font-family="Times New Roman" font-size="13" stroke="none" style="text-rendering:optimizeLegibility;fill-opacity:1.0;fill:#000000;" x="17.666666" xml:space="preserve" y="253.72223">5</text></g><g id="560648627_1671084525@15" style="visibility:visible;fill-opacity:0.0;fill:#ffffff;stroke:none;"><path d=" M15.0 208.85185 L29.666668 208.85185 L29.666668 225.85185 L15.0 225.85185 L15.0 208.85185 Z"/><text font-family="Times New Roman" font-size="13" stroke="none" style="text-rendering:optimizeLegibility;fill-opacity:1.0;fill:#000000;" x="17.666666" xml:space="preserve" y="221.85185">6</text></g><g id="560648627_88526289@16" style="visibility:visible;fill-opacity:0.0;fill:#ffffff;stroke:none;"><path d=" M15.0 176.98148 L29.666668 176.98148 L29.666668 193.98148 L15.0 193.98148 L15.0 176.98148 Z"/><text font-family="Times New Roman" font-size="13" stroke="none" style="text-rendering:optimizeLegibility;fill-opacity:1.0;fill:#000000;" x="17.666666" xml:space="preserve" y="189.98148">7</text></g><g id="560648627_682966729@17" style="visibility:visible;fill-opacity:0.0;fill:#ffffff;stroke:none;"><path d=" M15.0 145.11111 L29.666668 145.11111 L29.666668 162.11111 L15.0 162.11111 L15.0 145.11111 Z"/><text font-family="Times New Roman" font-size="13" stroke="none" style="text-rendering:optimizeLegibility;fill-opacity:1.0;fill:#000000;" x="17.666666" xml:space="preserve" y="158.11111">8</text></g><g id="560648627_2120984904@18" style="visibility:visible;fill-opacity:0.0;fill:#ffffff;stroke:none;"><path d=" M15.0 113.24074 L29.666668 113.24074 L29.666668 130.24074 L15.0 130.24074 L15.0 113.24074 Z"/><text font-family="Times New Roman" font-size="13" stroke="none" style="text-rendering:optimizeLegibility;fill-opacity:1.0;fill:#000000;" x="17.666666" xml:space="preserve" y="126.24074">9</text></g><g id="560648627_1419630463@19" style="visibility:visible;fill-opacity:0.0;fill:#ffffff;stroke:none;"><path d=" M7.0 81.37037 L29.666666 81.37037 L29.666666 98.37037 L7.0 98.37037 L7.0 81.37037 Z"/><text font-family="Times New Roman" font-size="13" stroke="none" style="text-rendering:optimizeLegibility;fill-opacity:1.0;fill:#000000;" x="9.666667" xml:space="preserve" y="94.37037">10</text></g><g id="560648627_1020248219@20" style="visibility:visible;fill-opacity:0.0;fill:#ffffff;stroke:none;"><path d=" M7.0 49.5 L29.666666 49.5 L29.666666 66.5 L7.0 66.5 L7.0 49.5 Z"/><text font-family="Times New Roman" font-size="13" stroke="none" style="text-rendering:optimizeLegibility;fill-opacity:1.0;fill:#000000;" x="9.666667" xml:space="preserve" y="62.5">11</text></g><path d=" M670.1667 172.41667 L670.1667 187.41667 L695.6667 187.41667 L695.6667 172.41667 Z" style="fill-opacity:1.0;fill:#50a6da;stroke:none;"/><path d=" M670.1667 172.41667 L670.1667 187.41667 L695.6667 187.41667 L695.6667 172.41667 Z" style="stroke:#387498;stroke-width:1.0;stroke-miterlimit:10.0;stroke-linejoin:round;stroke-linecap:square;"/><path d=" M698.6667 172.41667 L731.3334 172.41667 L731.3334 189.41667 L698.6667 189.41667 L698.6667 172.41667 Z" style="fill-opacity:0.0;fill:#ffffff;stroke:none;"/><text font-family="Times New Roman" font-size="13" stroke="none" style="text-rendering:optimizeLegibility;fill-opacity:1.0;fill:#000000;" x="701.3333" xml:space="preserve" y="185.41667">Geo</text><path d=" M666.5 193.58333 L751.0 193.58333" style="stroke:#000000;stroke-width:1.0;stroke-miterlimit:10.0;stroke-linejoin:round;stroke-linecap:square;"/><path d=" M670.1667 199.75 L670.1667 214.75 L695.6667 214.75 L695.6667 199.75 Z" style="fill-opacity:1.0;fill:#f2586a;stroke:none;"/><path d=" M670.1667 199.75 L670.1667 214.75 L695.6667 214.75 L695.6667 199.75 Z" style="stroke:#a93d4a;stroke-width:1.0;stroke-miterlimit:10.0;stroke-linejoin:round;stroke-linecap:square;"/><path d=" M698.6667 199.75 L750.3334 199.75 L750.3334 216.75 L698.6667 216.75 L698.6667 199.75 Z" style="fill-opacity:0.0;fill:#ffffff;stroke:none;"/><text font-family="Times New Roman" font-size="13" stroke="none" style="text-rendering:optimizeLegibility;fill-opacity:1.0;fill:#000000;" x="701.3333" xml:space="preserve" y="212.75">History</text><path d=" M666.5 220.91667 L751.0 220.91667" style="stroke:#000000;stroke-width:1.0;stroke-miterlimit:10.0;stroke-linejoin:round;stroke-linecap:square;"/><path d=" M670.1667 227.08333 L670.1667 242.08333 L695.6667 242.08333 L695.6667 227.08333 Z" style="fill-opacity:1.0;fill:#e8ac39;stroke:none;"/><path d=" M670.1667 227.08333 L670.1667 242.08333 L695.6667 242.08333 L695.6667 227.08333 Z" style="stroke:#a27827;stroke-width:1.0;stroke-miterlimit:10.0;stroke-linejoin:round;stroke-linecap:square;"/><path d=" M698.6667 227.08333 L737.3334 227.08333 L737.3334 244.08333 L698.6667 244.08333 L698.6667 227.08333 Z" style="fill-opacity:0.0;fill:#ffffff;stroke:none;"/><text font-family="Times New Roman" font-size="13" stroke="none" style="text-rendering:optimizeLegibility;fill-opacity:1.0;fill:#000000;" x="701.3333" xml:space="preserve" y="240.08333">Math</text></g><g id="hotSpots" style="fill-opacity:0.01;fill:#FFFFFF;"><a xlink:href="javascript:void(0);"><g onmousemove="TM.show(evt,'809583745_123219630')" onmouseout="TM.remove()"><polygon points="93.68055555555554,281.0925925925926 93.68055555555554,345.8333333333333 127.91203703703704,345.8333333333333 127.91203703703704,281.0925925925926 "/><title>4</title></g></a><a xlink:href="javascript:void(0);"><g onmousemove="TM.show(evt,'809583745_123219630')" onmouseout="TM.remove()"><polygon points="299.06944444444446,312.96296296296293 299.06944444444446,345.8333333333333 333.3009259259259,345.8333333333333 333.3009259259259,312.96296296296293 "/><title>3</title></g></a><a xlink:href="javascript:void(0);"><g onmousemove="TM.show(evt,'809583745_123219630')" onmouseout="TM.remove()"><polygon points="504.4583333333333,217.35185185185185 504.4583333333333,345.8333333333333 538.6898148148148,345.8333333333333 538.6898148148148,217.35185185185185 "/><title>6</title></g></a><a xlink:href="javascript:void(0);"><g onmousemove="TM.show(evt,'1890359668_1106044969')" onmouseout="TM.remove()"><polygon points="127.91203703703702,121.74074074074073 127.91203703703702,345.8333333333333 162.1435185185185,345.8333333333333 162.1435185185185,121.74074074074073 "/><title>9</title></g></a><a xlink:href="javascript:void(0);"><g onmousemove="TM.show(evt,'1890359668_1106044969')" onmouseout="TM.remove()"><polygon points="333.3009259259259,153.61111111111111 333.3009259259259,345.8333333333333 367.5324074074074,345.8333333333333 367.5324074074074,153.61111111111111 "/><title>8</title></g></a><a xlink:href="javascript:void(0);"><g onmousemove="TM.show(evt,'1890359668_1106044969')" onmouseout="TM.remove()"><polygon points="538.6898148148148,249.22222222222223 538.6898148148148,345.8333333333333 572.9212962962963,345.8333333333333 572.9212962962963,249.22222222222223 "/><title>5</title></g></a><a xlink:href="javascript:void(0);"><g onmousemove="TM.show(evt,'646966268_3903062')" onmouseout="TM.remove()"><polygon points="162.14351851851853,185.48148148148147 162.14351851851853,345.8333333333333 196.37500000000003,345.8333333333333 196.37500000000003,185.48148148148147 "/><title>7</title></g></a><a xlink:href="javascript:void(0);"><g onmousemove="TM.show(evt,'646966268_3903062')" onmouseout="TM.remove()"><polygon points="367.5324074074074,89.87037037037038 367.5324074074074,345.8333333333333 401.76388888888886,345.8333333333333 401.76388888888886,89.87037037037038 "/><title>10</title></g></a><a xlink:href="javascript:void(0);"><g onmousemove="TM.show(evt,'646966268_3903062')" onmouseout="TM.remove()"><polygon points="572.9212962962963,249.22222222222223 572.9212962962963,345.8333333333333 607.1527777777778,345.8333333333333 607.1527777777778,249.22222222222223 "/><title>5</title></g></a><a xlink:href="javascript:void(0);"><g onclick="toggleVisibility(evt, 809583745,new Array('123219630','123219630@1','463047511@2','463047511@3','329676543@4','329676543@5'))"><polygon points="667.5,172.41666666666666 750.0,172.41666666666666 750.0,187.41666666666666 667.5,187.41666666666666 "/></g></a><a xlink:href="javascript:void(0);"><g onclick="toggleVisibility(evt, 1890359668,new Array('1106044969','1106044969@1','1548779488@2','1548779488@3','748801710@4','748801710@5'))"><polygon points="667.5,199.75 750.0,199.75 750.0,214.75 667.5,214.75 "/></g></a><a xlink:href="javascript:void(0);"><g onclick="toggleVisibility(evt, 646966268,new Array('3903062','3903062@1','2124940538@2','2124940538@3','660260059@4','660260059@5'))"><polygon points="667.5,227.08333333333331 750.0,227.08333333333331 750.0,242.08333333333331 667.5,242.08333333333331 "/></g></a></g></svg>