/home/enas/Desktop/birt/src/main/java/com/progressoft/birt/designer/ReportDesignApplication.java
/home/enas/Desktop/birt/src/main/java/com/progressoft/birt/engine/controller/BirtReportController.java
/home/enas/Desktop/birt/src/main/java/com/progressoft/birt/engine/dto/OutputType.java
/home/enas/Desktop/birt/src/main/java/com/progressoft/birt/engine/service/BirtReportService.java
/home/enas/Desktop/birt/src/main/java/com/progressoft/birt/engine/dto/Report.java
/home/enas/Desktop/birt/src/main/java/com/progressoft/birt/engine/ReportEngineApplication.java
