{
  "project_info": {
    "project_number": "250885317191",
    "project_id": "qiib-9e06a",
    "storage_bucket": "qiib-9e06a.appspot.com"
  },
  "client": [
    {
      "client_info": {
        "mobilesdk_app_id": "1:250885317191:android:657cc6b691ef005c214762",
        "android_client_info": {
          "package_name": "com.progressoft.qiib.customer"
        }
      },
      "oauth_client": [
        {
          "client_id": "250885317191-q27n0ot19qfagp94bi2ftboeeusmnc53.apps.googleusercontent.com",
          "client_type": 3
        }
      ],
      "api_key": [
        {
          "current_key": "AIzaSyCs63gg3ebHg-Vnn--iNMIgqFHPdLRDctY"
        }
      ],
      "services": {
        "appinvite_service": {
          "other_platform_oauth_client": [
            {
              "client_id": "250885317191-q27n0ot19qfagp94bi2ftboeeusmnc53.apps.googleusercontent.com",
              "client_type": 3
            },
            {
              "client_id": "250885317191-32p21vl84g88oe7p1kfdcbtt9orlqfi1.apps.googleusercontent.com",
              "client_type": 2,
              "ios_info": {
                "bundle_id": "com.progressoft.qiib.customer.test"
              }
            }
          ]
        }
      }
    }
  ],
  "configuration_version": "1"
}