// created on: Dec 26, 2014
package com.baeldung.drools.rules;

// list any import classes here.
import com.baeldung.drools.model.ItemCity;
import java.math.BigDecimal;

// declare any global variables here
dialect "java"
rule "Nagpur Medicine Item"
   when
      item : ItemCity(purchaseCity == ItemCity.City.NAGPUR,
         typeofItem == ItemCity.Type.MEDICINES)
   then
      BigDecimal tax = new BigDecimal(0.0);
      item.setLocalTax(tax.multiply(item.getSellPrice()));
end

rule "Nagpur Groceries Item"
   when
      item : ItemCity(purchaseCity == ItemCity.City.NAGPUR,
         typeofItem == ItemCity.Type.GROCERIES)
   then
      BigDecimal tax = new BigDecimal(1.0);
      item.setLocalTax(tax.multiply(item.getSellPrice()));
end