-------------------------------------------------------------------------------
Test set: com.progressoft.jip9.reconciliation.servlet.LoginServletTest
-------------------------------------------------------------------------------
Tests run: 2, Failures: 0, Errors: 0, Skipped: 0, Time elapsed: 0.702 sec
