/home/user/work/induction/jip-9-javase/induction-reconciliation-task/ui/src/main/java/com/progressoft/jip9/reconciliation/filters/SessionFilter.java
/home/user/work/induction/jip-9-javase/induction-reconciliation-task/ui/src/main/java/com/progressoft/jip9/reconciliation/servlet/FileSummaryServlet.java
/home/user/work/induction/jip-9-javase/induction-reconciliation-task/ui/src/main/java/com/progressoft/jip9/reconciliation/model/activites/entity/Activity.java
/home/user/work/induction/jip-9-javase/induction-reconciliation-task/ui/src/main/java/com/progressoft/jip9/reconciliation/listner/SessionListener.java
/home/user/work/induction/jip-9-javase/induction-reconciliation-task/ui/src/main/java/com/progressoft/jip9/reconciliation/model/util/DataSourceFactory.java
/home/user/work/induction/jip-9-javase/induction-reconciliation-task/ui/src/main/java/com/progressoft/jip9/reconciliation/model/files/FileMetaData.java
/home/user/work/induction/jip-9-javase/induction-reconciliation-task/ui/src/main/java/com/progressoft/jip9/reconciliation/servlet/ComparatorServlet.java
/home/user/work/induction/jip-9-javase/induction-reconciliation-task/ui/src/main/java/com/progressoft/jip9/reconciliation/model/users/dao/UserDao.java
/home/user/work/induction/jip-9-javase/induction-reconciliation-task/ui/src/main/java/com/progressoft/jip9/reconciliation/model/util/PasswordHashing.java
/home/user/work/induction/jip-9-javase/induction-reconciliation-task/ui/src/main/java/com/progressoft/jip9/reconciliation/servlet/ActivityServlet.java
/home/user/work/induction/jip-9-javase/induction-reconciliation-task/ui/src/main/java/com/progressoft/jip9/reconciliation/servlet/TargetFileUploadServlet.java
/home/user/work/induction/jip-9-javase/induction-reconciliation-task/ui/src/main/java/com/progressoft/jip9/reconciliation/model/activites/dao/ActivityDao.java
/home/user/work/induction/jip-9-javase/induction-reconciliation-task/ui/src/main/java/com/progressoft/jip9/reconciliation/servlet/util/FileDownloader.java
/home/user/work/induction/jip-9-javase/induction-reconciliation-task/ui/src/main/java/com/progressoft/jip9/reconciliation/model/users/ConsoleUserInsertion.java
/home/user/work/induction/jip-9-javase/induction-reconciliation-task/ui/src/main/java/com/progressoft/jip9/reconciliation/servlet/SourceFileUploadServlet.java
/home/user/work/induction/jip-9-javase/induction-reconciliation-task/ui/src/main/java/com/progressoft/jip9/reconciliation/servlet/SourceFileServlet.java
/home/user/work/induction/jip-9-javase/induction-reconciliation-task/ui/src/main/java/com/progressoft/jip9/reconciliation/model/activites/dao/ActivityDaoImpl.java
/home/user/work/induction/jip-9-javase/induction-reconciliation-task/ui/src/main/java/com/progressoft/jip9/reconciliation/database/DatabaseCrudImpl.java
/home/user/work/induction/jip-9-javase/induction-reconciliation-task/ui/src/main/java/com/progressoft/jip9/reconciliation/servletInitializer/ServletInitializer.java
/home/user/work/induction/jip-9-javase/induction-reconciliation-task/ui/src/main/java/com/progressoft/jip9/reconciliation/model/users/entity/User.java
/home/user/work/induction/jip-9-javase/induction-reconciliation-task/ui/src/main/java/com/progressoft/jip9/reconciliation/servlet/TargetFileServlet.java
/home/user/work/induction/jip-9-javase/induction-reconciliation-task/ui/src/main/java/com/progressoft/jip9/reconciliation/model/users/dao/UserDaoImpl.java
/home/user/work/induction/jip-9-javase/induction-reconciliation-task/ui/src/main/java/com/progressoft/jip9/reconciliation/servlet/LoginServlet.java
/home/user/work/induction/jip-9-javase/induction-reconciliation-task/ui/src/main/java/com/progressoft/jip9/reconciliation/servlet/FileDownloadServlet.java
/home/user/work/induction/jip-9-javase/induction-reconciliation-task/ui/src/main/java/com/progressoft/jip9/reconciliation/servlet/WelcomeServlet.java
/home/user/work/induction/jip-9-javase/induction-reconciliation-task/ui/src/main/java/com/progressoft/jip9/reconciliation/database/DataBaseCrud.java
