-------------------------------------------------------------------------------
Test set: com.progressoft.jip9.reconciliation.comparator.TransactionComparatorTest
-------------------------------------------------------------------------------
Tests run: 8, Failures: 0, Errors: 0, Skipped: 0, Time elapsed: 0.219 s - in com.progressoft.jip9.reconciliation.comparator.TransactionComparatorTest
