com/progressoft/jip9/exception/ParsingTransactionException.class
com/progressoft/jip9/exception/InvalidPathException.class
com/progressoft/jip9/exception/IllegalFormatException.class
com/progressoft/jip9/CsvParser$HeaderDetails.class
com/progressoft/jip9/transaction/Transaction.class
com/progressoft/jip9/TransactionParser.class
com/progressoft/jip9/JsonParser.class
com/progressoft/jip9/CsvParser.class
