-------------------------------------------------------------------------------
Test set: com.progressoft.jip9.CSVResultPrinterTest
-------------------------------------------------------------------------------
Tests run: 4, Failures: 0, Errors: 0, Skipped: 0, Time elapsed: 0.156 s - in com.progressoft.jip9.CSVResultPrinterTest
