127.0.0.1 - - [10/Nov/2020:09:41:26 +0545] "GET / HTTP/1.1" 404 682
127.0.0.1 - - [10/Nov/2020:09:41:26 +0545] "GET /favicon.ico HTTP/1.1" 404 682
127.0.0.1 - - [10/Nov/2020:09:41:31 +0545] "GET /sr HTTP/1.1" 200 246
127.0.0.1 - - [10/Nov/2020:10:29:34 +0545] "GET /sr HTTP/1.1" 200 246
127.0.0.1 - - [10/Nov/2020:10:29:35 +0545] "GET /favicon.ico HTTP/1.1" 404 682
127.0.0.1 - - [10/Nov/2020:10:29:38 +0545] "GET /sr HTTP/1.1" 200 246
127.0.0.1 - - [10/Nov/2020:10:39:02 +0545] "GET /sr HTTP/1.1" 200 246
127.0.0.1 - - [10/Nov/2020:10:39:02 +0545] "GET /sr HTTP/1.1" 200 246
127.0.0.1 - - [10/Nov/2020:10:39:13 +0545] "GET /sr HTTP/1.1" 200 246
127.0.0.1 - - [10/Nov/2020:11:05:29 +0545] "GET /favicon.ico HTTP/1.0" 404 682
127.0.0.1 - - [10/Nov/2020:11:06:02 +0545] "GET /sr HTTP/1.0" 200 246
