/Users/rchandra/eclipse-workspace/honeycomb/src/main/java/com/alti/reporter/ExtentTestManager.java
/Users/rchandra/eclipse-workspace/honeycomb/src/main/java/com/alti/reporter/ExtentManager.java
/Users/rchandra/eclipse-workspace/honeycomb/src/main/java/com/alti/constants/EndPoints.java
/Users/rchandra/eclipse-workspace/honeycomb/src/main/java/com/alti/constants/Auth.java
/Users/rchandra/eclipse-workspace/honeycomb/src/main/java/com/alti/base/BrowserService.java
/Users/rchandra/eclipse-workspace/honeycomb/src/main/java/com/alti/constants/Paths.java
/Users/rchandra/eclipse-workspace/honeycomb/src/main/java/com/alti/common/RestUtilities.java
/Users/rchandra/eclipse-workspace/honeycomb/src/main/java/com/alti/constants/ConstantTexts.java
/Users/rchandra/eclipse-workspace/honeycomb/src/main/java/com/alti/base/Driverutils.java
/Users/rchandra/eclipse-workspace/honeycomb/src/main/java/com/alti/common/ConfigReader.java
/Users/rchandra/eclipse-workspace/honeycomb/src/main/java/com/alti/common/Specifications.java
