<?xml version="1.0" encoding="UTF-8" standalone="no"?>
<svg
   xmlns:dc="http://purl.org/dc/elements/1.1/"
   xmlns:cc="http://creativecommons.org/ns#"
   xmlns:rdf="http://www.w3.org/1999/02/22-rdf-syntax-ns#"
   xmlns:svg="http://www.w3.org/2000/svg"
   xmlns="http://www.w3.org/2000/svg"
   xmlns:sodipodi="http://sodipodi.sourceforge.net/DTD/sodipodi-0.dtd"
   xmlns:inkscape="http://www.inkscape.org/namespaces/inkscape"
   xml:space="preserve"
   width="354.3307px"
   height="354.3307px"
   version="1.1"
   style="shape-rendering:geometricPrecision; text-rendering:geometricPrecision; image-rendering:optimizeQuality; fill-rule:evenodd; clip-rule:evenodd"
   viewBox="-1.935 0.0 11.74 11.74"
   id="svg2"
   inkscape:version="0.91 r13725"
   sodipodi:docname="usb_small_white.svg"><metadata
     id="metadata18"><rdf:RDF><cc:Work
         rdf:about=""><dc:format>image/svg+xml</dc:format><dc:type
           rdf:resource="http://purl.org/dc/dcmitype/StillImage" /></cc:Work></rdf:RDF></metadata><sodipodi:namedview
     pagecolor="#ffffff"
     bordercolor="#666666"
     borderopacity="1"
     objecttolerance="10"
     gridtolerance="10"
     guidetolerance="10"
     inkscape:pageopacity="0"
     inkscape:pageshadow="2"
     inkscape:window-width="1043"
     inkscape:window-height="779"
     id="namedview16"
     showgrid="false"
     inkscape:zoom="12.140139"
     inkscape:cx="2.4742747"
     inkscape:cy="9.7198228"
     inkscape:window-x="0"
     inkscape:window-y="0"
     inkscape:window-maximized="0"
     inkscape:current-layer="svg2"
     inkscape:document-rotation="0" /><defs
     id="defs4"><style
       type="text/css"
       id="style6">
    .fil0 {fill:black}
    .fil1 {fill:white}
   </style></defs><rect
     class="fil0"
     x="-41.02"
     y="-331.94"
     width="449.52"
     height="635.75"
     id="rect8"
     style="opacity:0" /><g
     id="Layer_x0020_1"><metadata
       id="CorelCorpID_0Corel-Layer" /><g
       id="_2603018587328"><g
         id="usb"><path
           class="fil1"
           d="M5.65 3.32l0 2.22 0.55 0 0 1.11 -1.66 0 0 -4.43 1.11 0 -1.66 -2.22 -1.66 2.22 1.11 0 0 4.43 -1.66 0 0 -1.16c0.39,-0.17 0.66,-0.61 0.66,-1.05 0,-0.66 -0.55,-1.22 -1.22,-1.22 -0.66,0 -1.22,0.55 -1.22,1.22 0,0.44 0.28,0.89 0.66,1.05l0 1.16c0,0.61 0.5,1.11 1.11,1.11l1.66 0 0 1.72c-0.39,0.22 -0.66,0.61 -0.66,1.05 0,0.66 0.55,1.22 1.22,1.22 0.66,0 1.22,-0.55 1.22,-1.22 0,-0.5 -0.28,-0.89 -0.66,-1.05l0 -1.72 1.66 0c0.61,0 1.11,-0.5 1.11,-1.11l0 -1.11 0.55 0 0 -2.22 -2.22 0z"
           id="path14" /></g></g></g></svg>
