<?xml version="1.0" encoding="UTF-8" standalone="no"?>
<svg
   xmlns:dc="http://purl.org/dc/elements/1.1/"
   xmlns:cc="http://creativecommons.org/ns#"
   xmlns:rdf="http://www.w3.org/1999/02/22-rdf-syntax-ns#"
   xmlns:svg="http://www.w3.org/2000/svg"
   xmlns="http://www.w3.org/2000/svg"
   xmlns:sodipodi="http://sodipodi.sourceforge.net/DTD/sodipodi-0.dtd"
   xmlns:inkscape="http://www.inkscape.org/namespaces/inkscape"
   xml:space="preserve"
   width="354.3307px"
   height="354.3307px"
   version="1.1"
   style="shape-rendering:geometricPrecision; text-rendering:geometricPrecision; image-rendering:optimizeQuality; fill-rule:evenodd; clip-rule:evenodd"
   viewBox="0.0 -1.8999999999999995 15.22 15.219999999999999"
   id="svg2"
   inkscape:version="0.91 r13725"
   sodipodi:docname="wifi_strength_0.svg"><metadata
     id="metadata18"><rdf:RDF><cc:Work
         rdf:about=""><dc:format>image/svg+xml</dc:format><dc:type
           rdf:resource="http://purl.org/dc/dcmitype/StillImage" /><dc:title /></cc:Work></rdf:RDF></metadata><sodipodi:namedview
     pagecolor="#ffffff"
     bordercolor="#666666"
     borderopacity="1"
     objecttolerance="10"
     gridtolerance="10"
     guidetolerance="10"
     inkscape:pageopacity="0"
     inkscape:pageshadow="2"
     inkscape:window-width="1405"
     inkscape:window-height="883"
     id="namedview16"
     showgrid="false"
     inkscape:zoom="17.296262"
     inkscape:cx="-17.61814"
     inkscape:cy="6.8222839"
     inkscape:window-x="0"
     inkscape:window-y="0"
     inkscape:window-maximized="0"
     inkscape:current-layer="svg2"
     inkscape:document-rotation="0" /><defs
     id="defs4"><style
       type="text/css"
       id="style6">
    .fil0 {fill:black}
    .fil1 {fill:white}
   </style></defs><rect
     class="fil0"
     x="-54.66"
     y="-307.2"
     width="622.55"
     height="880.47"
     id="rect8"
     style="opacity:0" /><path
     id="iconmonstr-wireless-1.svg"
     class="fil1"
     d="M 1.51,4.95 C 3.07,3.29 5.22,2.27 7.6,2.27 c 2.38,0 4.53,1.02 6.09,2.68 L 15.2,3.34 C 13.25,1.27 10.57,0 7.59,0 4.62,0 1.93,1.28 -0.02,3.34 l 1.51,1.61 z"
     style="fill:#808080"
     inkscape:connector-curvature="0" /><path
     id="iconmonstr-wireless-1.svg_0"
     class="fil1"
     d="M 4.1,7.69 C 5,6.74 6.24,6.15 7.61,6.15 c 1.37,0 2.61,0.59 3.51,1.54 L 12.6,6.13 C 11.33,4.78 9.57,3.94 7.62,3.94 5.67,3.94 3.91,4.77 2.64,6.13 l 1.48,1.56 0,0 -0.02,0 z"
     style="fill:#808080"
     inkscape:connector-curvature="0" /><path
     id="iconmonstr-wireless-1.svg_1"
     class="fil1"
     d="M 5.2,8.87 C 5.81,8.22 6.66,7.82 7.6,7.82 c 0.94,0 1.79,0.4 2.4,1.05 L 7.6,11.42 5.2,8.87 Z"
     style="fill:#808080;fill-opacity:1"
     inkscape:connector-curvature="0" /></svg>
