<?xml version="1.0" encoding="UTF-8" standalone="no"?>
<svg
   xmlns:dc="http://purl.org/dc/elements/1.1/"
   xmlns:cc="http://creativecommons.org/ns#"
   xmlns:rdf="http://www.w3.org/1999/02/22-rdf-syntax-ns#"
   xmlns:svg="http://www.w3.org/2000/svg"
   xmlns="http://www.w3.org/2000/svg"
   xmlns:sodipodi="http://sodipodi.sourceforge.net/DTD/sodipodi-0.dtd"
   xmlns:inkscape="http://www.inkscape.org/namespaces/inkscape"
   xml:space="preserve"
   width="354.3307px"
   height="354.3307px"
   version="1.1"
   style="clip-rule:evenodd;fill-rule:evenodd;image-rendering:optimizeQuality;shape-rendering:geometricPrecision;text-rendering:geometricPrecision"
   viewBox="0.0 -23.0600475 63.440095 63.440095"
   id="svg2"
   inkscape:version="0.91 r13725"
   sodipodi:docname="back_white.svg"><metadata
   id="metadata15"><rdf:RDF><cc:Work
       rdf:about=""><dc:format>image/svg+xml</dc:format><dc:type
         rdf:resource="http://purl.org/dc/dcmitype/StillImage" /><dc:title /></cc:Work></rdf:RDF></metadata><sodipodi:namedview
   pagecolor="#ffffff"
   bordercolor="#666666"
   borderopacity="1"
   objecttolerance="10"
   gridtolerance="10"
   guidetolerance="10"
   inkscape:pageopacity="0.50588235"
   inkscape:pageshadow="2"
   inkscape:window-width="1920"
   inkscape:window-height="1054"
   id="namedview13"
   showgrid="false"
   inkscape:zoom="13.55457"
   inkscape:cx="21.951299"
   inkscape:cy="11.341126"
   inkscape:window-x="0"
   inkscape:window-y="1200"
   inkscape:window-maximized="1"
   inkscape:current-layer="svg2"
   inkscape:document-rotation="0" /><defs
   id="defs4"><style
     type="text/css"
     id="style6">
    .fil0 {fill:black}
    .fil1 {fill:white}
   </style></defs><rect
   class="fil0"
   x="-70.129997"
   y="-194.37"
   width="740.07001"
   height="1046.67"
   id="rect8"
   style="opacity:0;fill:#000000" /><g
   id="Layer_x0020_1"><metadata
     id="CorelCorpID_0Corel-Layer" /><polygon
     id="iconmonstr-undo-1.svg"
     class="fil1"
     points="21.14,12.59 21.14,4.76 9.45,4.76 9.45,0 0,8.49 9.45,17.32 9.45,12.59 "
     style="fill:#ffffff" /></g><text
   xml:space="preserve"
   style="font-style:normal;font-weight:normal;line-height:0%;font-family:sans-serif;letter-spacing:0px;word-spacing:0px;fill:#ffffff;fill-opacity:1;stroke:none;stroke-width:1px;stroke-linecap:butt;stroke-linejoin:miter;stroke-opacity:1"
   x="24.584639"
   y="12.769829"
   id="text4143"><tspan
     sodipodi:role="line"
     id="tspan4145"
     x="24.584639"
     y="12.769829"
     style="font-size:14.9215px;line-height:1.25">back</tspan></text>
</svg>
