<?xml version="1.0" encoding="UTF-8" standalone="no"?>
<svg
   xmlns:dc="http://purl.org/dc/elements/1.1/"
   xmlns:cc="http://creativecommons.org/ns#"
   xmlns:rdf="http://www.w3.org/1999/02/22-rdf-syntax-ns#"
   xmlns:svg="http://www.w3.org/2000/svg"
   xmlns="http://www.w3.org/2000/svg"
   xmlns:sodipodi="http://sodipodi.sourceforge.net/DTD/sodipodi-0.dtd"
   xmlns:inkscape="http://www.inkscape.org/namespaces/inkscape"
   xml:space="preserve"
   width="354.3307px"
   height="354.3307px"
   version="1.1"
   style="shape-rendering:geometricPrecision; text-rendering:geometricPrecision; image-rendering:optimizeQuality; fill-rule:evenodd; clip-rule:evenodd"
   viewBox="0.0 0.0 2002.76 2002.76"
   id="svg344"
   inkscape:version="0.91 r13725"
   sodipodi:docname="yes_orange.svg"><metadata
     id="metadata359"><rdf:RDF><cc:Work
         rdf:about=""><dc:format>image/svg+xml</dc:format><dc:type
           rdf:resource="http://purl.org/dc/dcmitype/StillImage" /><dc:title /></cc:Work></rdf:RDF></metadata><sodipodi:namedview
     pagecolor="#ffffff"
     bordercolor="#666666"
     borderopacity="1"
     objecttolerance="10"
     gridtolerance="10"
     guidetolerance="10"
     inkscape:pageopacity="0"
     inkscape:pageshadow="2"
     inkscape:window-width="1131"
     inkscape:window-height="894"
     id="namedview357"
     showgrid="true"
     inkscape:zoom="6.6581141"
     inkscape:cx="-5.5571287"
     inkscape:cy="17.722736"
     inkscape:window-x="0"
     inkscape:window-y="0"
     inkscape:window-maximized="0"
     inkscape:current-layer="svg344"
     inkscape:document-rotation="0"><inkscape:grid
       type="xygrid"
       id="grid4138" /></sodipodi:namedview><defs
     id="defs346"><style
       type="text/css"
       id="style348">
    .fil0 {fill:black}
    .fil1 {fill:white}
    .fil2 {fill:white;fill-rule:nonzero}
   </style></defs><rect
     class="fil0"
     x="-21521.82"
     y="-48780.71"
     width="42043.29"
     height="59461.22"
     id="rect350"
     style="opacity:0" /><g
     id="Layer_x0020_1"
     style="fill:#ed6b21;fill-opacity:1"><metadata
       id="CorelCorpID_0Corel-Layer" /><polygon
       id="iconmonstr-check-mark-5.svg"
       class="fil1"
       points="1367.83,626 897.1,1108.52 676.54,899.49 521.7,1054.49 897.08,1418.52 1522.73,780.94 1367.83,626.04 "
       style="fill:#ed6b21;fill-opacity:1" /><path
       class="fil2"
       d="M1001.03 0c888.88,0 1336.92,1079.77 707.83,1708.86 -629.09,629.09 -1708.86,181.05 -1708.86,-707.83 0,-552.83 448.2,-1001.03 1001.03,-1001.03zm566.28 434.75c-503.24,-503.18 -1367.11,-144.95 -1367.11,566.28 0,711.29 863.95,1069.44 1367.11,566.28 312.72,-312.72 312.7,-819.86 0,-1132.57z"
       id="path355"
       style="fill:#ed6b21;fill-opacity:1" /></g></svg>
