<?xml version="1.0" encoding="UTF-8" standalone="no"?>
<svg
   xmlns:dc="http://purl.org/dc/elements/1.1/"
   xmlns:cc="http://creativecommons.org/ns#"
   xmlns:rdf="http://www.w3.org/1999/02/22-rdf-syntax-ns#"
   xmlns:svg="http://www.w3.org/2000/svg"
   xmlns="http://www.w3.org/2000/svg"
   xmlns:sodipodi="http://sodipodi.sourceforge.net/DTD/sodipodi-0.dtd"
   xmlns:inkscape="http://www.inkscape.org/namespaces/inkscape"
   width="354.3307px"
   height="354.3307px"
   viewBox="-3.8285 0.0 30.629 30.629"
   version="1.1"
   id="svg3"
   sodipodi:docname="finish_black.svg"
   inkscape:version="0.92.4 (5da689c313, 2019-01-14)">
  <metadata
     id="metadata9">
    <rdf:RDF>
      <cc:Work
         rdf:about="">
        <dc:format>image/svg+xml</dc:format>
        <dc:type
           rdf:resource="http://purl.org/dc/dcmitype/StillImage" />
        <dc:title />
      </cc:Work>
    </rdf:RDF>
  </metadata>
  <defs
     id="defs7" />
  <sodipodi:namedview
     pagecolor="#ffffff"
     bordercolor="#666666"
     borderopacity="1"
     objecttolerance="10"
     gridtolerance="10"
     guidetolerance="10"
     inkscape:pageopacity="0"
     inkscape:pageshadow="2"
     inkscape:window-width="1341"
     inkscape:window-height="676"
     id="namedview5"
     showgrid="false"
     inkscape:zoom="7.7051161"
     inkscape:cx="-0.51901054"
     inkscape:cy="15.3145"
     inkscape:window-x="0"
     inkscape:window-y="29"
     inkscape:window-maximized="0"
     inkscape:current-layer="svg3"
     inkscape:document-rotation="0" />
  <g
     id="g4704"
     style="fill:#000000">
    <path
       style="fill:#000000"
       fill="#000000"
       transform="translate(-3)"
       d="M21.181,5.158c-4.288,0-4.385-3.695-9.364-3.695A10.584,10.584,0,0,0,5.552,3.626V0H3V30.629H5.552V19.05A11.477,11.477,0,0,1,11.835,16.9c4.7,0,5.361,3.515,9.551,3.515a7.348,7.348,0,0,0,4.585-1.734V3.335a8.03,8.03,0,0,1-4.791,1.824Zm2.238,6.666c-3.085,2.268-6.418-.434-8.1-1.547V14.96h0a9.888,9.888,0,0,0-3.484-.609,13.327,13.327,0,0,0-6.283,1.709V11.224c2.884-2.517,7.077-2.85,9.763-.947V5.424a8.792,8.792,0,0,0,5.865,2.287,9.074,9.074,0,0,0,2.238-.285Z"
       id="iconmonstr-flag-6" />
  </g>
</svg>
