<?xml version="1.0" encoding="UTF-8" standalone="no"?>
<svg
   xmlns:dc="http://purl.org/dc/elements/1.1/"
   xmlns:cc="http://creativecommons.org/ns#"
   xmlns:rdf="http://www.w3.org/1999/02/22-rdf-syntax-ns#"
   xmlns:svg="http://www.w3.org/2000/svg"
   xmlns="http://www.w3.org/2000/svg"
   xmlns:sodipodi="http://sodipodi.sourceforge.net/DTD/sodipodi-0.dtd"
   xmlns:inkscape="http://www.inkscape.org/namespaces/inkscape"
   xml:space="preserve"
   width="354.3307px"
   height="354.3307px"
   version="1.1"
   style="shape-rendering:geometricPrecision; text-rendering:geometricPrecision; image-rendering:optimizeQuality; fill-rule:evenodd; clip-rule:evenodd"
   viewBox="0.0 -1.1049999999999969 64.02 64.02"
   id="svg2"
   inkscape:version="1.0.1 (3bc2e813f5, 2020-09-07)"
   sodipodi:docname="statistics_color.svg"><metadata
     id="metadata19"><rdf:RDF><cc:Work
         rdf:about=""><dc:format>image/svg+xml</dc:format><dc:type
           rdf:resource="http://purl.org/dc/dcmitype/StillImage" /></cc:Work></rdf:RDF></metadata><sodipodi:namedview
     pagecolor="#ffffff"
     bordercolor="#666666"
     borderopacity="1"
     objecttolerance="10"
     gridtolerance="10"
     guidetolerance="10"
     inkscape:pageopacity="0"
     inkscape:pageshadow="2"
     inkscape:window-width="1920"
     inkscape:window-height="979"
     id="namedview17"
     showgrid="false"
     inkscape:zoom="1"
     inkscape:cx="-75.707255"
     inkscape:cy="13.124763"
     inkscape:window-x="0"
     inkscape:window-y="36"
     inkscape:window-maximized="1"
     inkscape:current-layer="svg2"
     inkscape:document-rotation="0" /><defs
     id="defs4"><style
       type="text/css"
       id="style6">
    .fil1 {fill:#EC691F}
    .fil0 {fill:black}
    .fil2 {fill:white}
   </style></defs><polygon
     id="iconmonstr-chart-4.svg"
     class="fil1"
     points="0,61.81 64.02,61.81 64.02,55.55 64.02,55.56 0,55.56 "
     style="fill:#5ea796;fill-opacity:1" /><polygon
     id="iconmonstr-chart-4.svg_0"
     class="fil2"
     points="50.68,0 61.35,0 61.35,50.68 50.68,50.68 " /><polygon
     id="iconmonstr-chart-4.svg_1"
     class="fil2"
     points="34.67,16 45.34,16 45.34,50.68 34.67,50.68 " /><polygon
     id="iconmonstr-chart-4.svg_2"
     class="fil2"
     points="18.67,29.34 29.34,29.34 29.34,50.68 18.67,50.68 " /><polygon
     id="iconmonstr-chart-4.svg_3"
     class="fil2"
     points="2.67,40.01 13.34,40.01 13.34,50.68 2.67,50.68 " /></svg>
