<?xml version="1.0" encoding="UTF-8" standalone="no"?>
<svg
   viewBox="0 0 640 512"
   version="1.1"
   id="svg4"
   sodipodi:docname="usb-drive_1.svg"
   inkscape:version="1.1.2 (0a00cf5339, 2022-02-04)"
   xmlns:inkscape="http://www.inkscape.org/namespaces/inkscape"
   xmlns:sodipodi="http://sodipodi.sourceforge.net/DTD/sodipodi-0.dtd"
   xmlns="http://www.w3.org/2000/svg"
   xmlns:svg="http://www.w3.org/2000/svg">
  <defs
     id="defs8" />
  <sodipodi:namedview
     id="namedview6"
     pagecolor="#505050"
     bordercolor="#808080"
     borderopacity="1"
     inkscape:pageshadow="0"
     inkscape:pageopacity="0"
     inkscape:pagecheckerboard="1"
     showgrid="false"
     inkscape:zoom="1.6152344"
     inkscape:cx="163.75333"
     inkscape:cy="259.40508"
     inkscape:window-width="1920"
     inkscape:window-height="1051"
     inkscape:window-x="0"
     inkscape:window-y="420"
     inkscape:window-maximized="1"
     inkscape:current-layer="svg4" />
  <!--! Font Awesome Pro 6.5.2 by @fontawesome - https://fontawesome.com License - https://fontawesome.com/license (Commercial License) Copyright 2024 Fonticons, Inc. -->
  <path
     d="M64 128c-17.7 0-32 14.3-32 32V352c0 17.7 14.3 32 32 32H416V128H64zM0 160c0-35.3 28.7-64 64-64H416c17.7 0 32 14.3 32 32V384c0 17.7-14.3 32-32 32H64c-35.3 0-64-28.7-64-64V160zM480 384V352H608V160H480V128H608c17.7 0 32 14.3 32 32V352c0 17.7-14.3 32-32 32H480zm96-176a16 16 0 1 1 -32 0 16 16 0 1 1 32 0zM560 320a16 16 0 1 1 0-32 16 16 0 1 1 0 32z"
     id="path2"
     style="fill:#808080" />
  <rect
     style="fill:#5ea796;fill-opacity:1;stroke:none;stroke-width:2.26594;paint-order:stroke fill markers"
     id="rect54"
     width="125.64423"
     height="254.62234"
     x="32.754948"
     y="128.60916"
     ry="29.264093" />
</svg>
