<?xml version="1.0" encoding="UTF-8" standalone="no"?>
<svg
   xmlns:dc="http://purl.org/dc/elements/1.1/"
   xmlns:cc="http://creativecommons.org/ns#"
   xmlns:rdf="http://www.w3.org/1999/02/22-rdf-syntax-ns#"
   xmlns:svg="http://www.w3.org/2000/svg"
   xmlns="http://www.w3.org/2000/svg"
   xmlns:sodipodi="http://sodipodi.sourceforge.net/DTD/sodipodi-0.dtd"
   xmlns:inkscape="http://www.inkscape.org/namespaces/inkscape"
   xml:space="preserve"
   width="354.3307px"
   height="354.3307px"
   version="1.1"
   style="shape-rendering:geometricPrecision; text-rendering:geometricPrecision; image-rendering:optimizeQuality; fill-rule:evenodd; clip-rule:evenodd"
   viewBox="0.0 0.0 27.31 27.31"
   id="svg2"
   inkscape:version="1.0.1 (3bc2e813f5, 2020-09-07)"
   sodipodi:docname="plus_color.svg"><metadata
     id="metadata16"><rdf:RDF><cc:Work
         rdf:about=""><dc:format>image/svg+xml</dc:format><dc:type
           rdf:resource="http://purl.org/dc/dcmitype/StillImage" /><dc:title /></cc:Work></rdf:RDF></metadata><sodipodi:namedview
     pagecolor="#ffffff"
     bordercolor="#666666"
     borderopacity="1"
     objecttolerance="10"
     gridtolerance="10"
     guidetolerance="10"
     inkscape:pageopacity="0"
     inkscape:pageshadow="2"
     inkscape:window-width="1920"
     inkscape:window-height="979"
     id="namedview14"
     showgrid="false"
     inkscape:zoom="1"
     inkscape:cx="-70.384534"
     inkscape:cy="11.25"
     inkscape:window-x="0"
     inkscape:window-y="36"
     inkscape:window-maximized="1"
     inkscape:current-layer="svg2"
     inkscape:document-rotation="0" /><defs
     id="defs4"><style
       type="text/css"
       id="style6">
    .fil1 {fill:#EC691F}
    .fil0 {fill:black}
    .fil2 {fill:white}
   </style></defs><rect
     class="fil0"
     x="-769.12"
     y="-969.1"
     width="903.24"
     height="1277.45"
     id="rect8"
     style="opacity:0" /><polygon
     id="iconmonstr-plus-6.svg"
     class="fil1"
     points="14.79,20.48 12.52,20.48 12.52,14.79 6.83,14.79 6.83,12.52 12.52,12.52 12.52,6.83 14.79,6.83 14.79,12.52 20.48,12.52 20.48,14.79 14.79,14.79 "
     style="fill:#5ea796;fill-opacity:1" /><path
     id="iconmonstr-plus-6.svg_0"
     class="fil2"
     d="M 13.66,0 C 6.12,0 0,6.11 0,13.66 0,21.2 6.11,27.32 13.66,27.32 21.2,27.32 27.32,21.21 27.32,13.66 27.32,6.12 21.21,0 13.66,0 Z m 0,2.28 c 6.27,0 11.38,5.11 11.38,11.38 0,6.27 -5.11,11.38 -11.38,11.38 C 7.39,25.04 2.28,19.93 2.28,13.66 2.28,7.39 7.39,2.28 13.66,2.28 Z" /></svg>
