<?xml version="1.0" encoding="UTF-8" standalone="no"?>
<svg
   xmlns:dc="http://purl.org/dc/elements/1.1/"
   xmlns:cc="http://creativecommons.org/ns#"
   xmlns:rdf="http://www.w3.org/1999/02/22-rdf-syntax-ns#"
   xmlns:svg="http://www.w3.org/2000/svg"
   xmlns="http://www.w3.org/2000/svg"
   xmlns:sodipodi="http://sodipodi.sourceforge.net/DTD/sodipodi-0.dtd"
   xmlns:inkscape="http://www.inkscape.org/namespaces/inkscape"
   xml:space="preserve"
   width="354.3307px"
   height="354.3307px"
   version="1.1"
   style="shape-rendering:geometricPrecision; text-rendering:geometricPrecision; image-rendering:optimizeQuality; fill-rule:evenodd; clip-rule:evenodd"
   viewBox="-0.005000000000002558 0.0 33.49 33.49"
   id="svg10"
   sodipodi:docname="running_color.svg"><metadata
   id="metadata14"><rdf:RDF><cc:Work
       rdf:about=""><dc:format>image/svg+xml</dc:format><dc:type
         rdf:resource="http://purl.org/dc/dcmitype/StillImage" /></cc:Work></rdf:RDF></metadata><sodipodi:namedview
   pagecolor="#ffffff"
   bordercolor="#666666"
   borderopacity="1"
   objecttolerance="10"
   gridtolerance="10"
   guidetolerance="10"
   inkscape:pageopacity="0"
   inkscape:pageshadow="2"
   inkscape:window-width="640"
   inkscape:window-height="480"
   id="namedview12" />
 <defs
   id="defs4">
  <style
   type="text/css"
   id="style2">
   
    .fil0 {fill:#9A9A9A;fill-rule:nonzero}
   
  </style>
 </defs>
 <g
   id="Značky_x0020_a_x0020_spadávky">
  <metadata
   id="CorelCorpID_0Corel-Layer" />
  <path
   class="fil0"
   d="M12.51 32.94c-1.23,-0.32 -1.97,-1.57 -1.65,-2.81 0.32,-1.23 1.57,-1.97 2.81,-1.65 2.3,0.6 4.68,0.5 6.86,-0.21 2.17,-0.71 4.14,-2.04 5.64,-3.89 1.5,-1.85 2.38,-4.05 2.63,-6.32 0.25,-2.28 -0.15,-4.63 -1.21,-6.76 -0.57,-1.14 -0.11,-2.52 1.03,-3.09 1.14,-0.57 2.52,-0.11 3.09,1.03 1.47,2.94 2.02,6.17 1.68,9.3 -0.34,3.14 -1.57,6.18 -3.64,8.74 -2.07,2.55 -4.79,4.38 -7.79,5.37 -2.99,0.98 -6.26,1.12 -9.44,0.28l-0.01 -0zm-6.61 -10.76c0.57,1.14 0.11,2.52 -1.03,3.09 -1.14,0.57 -2.52,0.11 -3.09,-1.03 -1.47,-2.94 -2.02,-6.17 -1.68,-9.3 0.34,-3.14 1.57,-6.18 3.64,-8.74 2.07,-2.55 4.79,-4.38 7.79,-5.37 2.99,-0.98 6.26,-1.12 9.44,-0.28 1.23,0.32 1.97,1.57 1.65,2.81 -0.32,1.23 -1.57,1.97 -2.81,1.65 -2.3,-0.6 -4.68,-0.5 -6.86,0.21 -2.17,0.71 -4.15,2.04 -5.64,3.89 -1.5,1.85 -2.38,4.05 -2.63,6.32 -0.25,2.28 0.15,4.63 1.21,6.76l0.01 0z"
   id="path7" />
 </g>
</svg>
