<?xml version="1.0" encoding="UTF-8" standalone="no"?>
<svg
   xmlns:dc="http://purl.org/dc/elements/1.1/"
   xmlns:cc="http://creativecommons.org/ns#"
   xmlns:rdf="http://www.w3.org/1999/02/22-rdf-syntax-ns#"
   xmlns:svg="http://www.w3.org/2000/svg"
   xmlns="http://www.w3.org/2000/svg"
   xmlns:sodipodi="http://sodipodi.sourceforge.net/DTD/sodipodi-0.dtd"
   xmlns:inkscape="http://www.inkscape.org/namespaces/inkscape"
   sodipodi:docname="swipe_right_white.svg"
   inkscape:version="1.0 (4035a4fb49, 2020-05-01)"
   id="svg2"
   viewBox="0.0 -5.045000000000002 90.83 90.83"
   style="shape-rendering:geometricPrecision; text-rendering:geometricPrecision; image-rendering:optimizeQuality; fill-rule:evenodd; clip-rule:evenodd"
   version="1.1"
   height="354.3307px"
   width="354.3307px"
   xml:space="preserve"><metadata
     id="metadata16"><rdf:RDF><cc:Work
         rdf:about=""><dc:format>image/svg+xml</dc:format><dc:type
           rdf:resource="http://purl.org/dc/dcmitype/StillImage" /><dc:title /></cc:Work></rdf:RDF></metadata><sodipodi:namedview
     inkscape:document-rotation="0"
     inkscape:current-layer="svg2"
     inkscape:window-maximized="1"
     inkscape:window-y="0"
     inkscape:window-x="56"
     inkscape:cy="10.629921"
     inkscape:cx="-2.454791"
     inkscape:zoom="11.100741"
     showgrid="false"
     id="namedview14"
     inkscape:window-height="2134"
     inkscape:window-width="3784"
     inkscape:pageshadow="2"
     inkscape:pageopacity="0"
     guidetolerance="10"
     gridtolerance="10"
     objecttolerance="10"
     borderopacity="1"
     bordercolor="#666666"
     pagecolor="#ffffff" /><defs
     id="defs4"><style
       id="style6"
       type="text/css">
    .fil2 {fill:#EC691F}
    .fil0 {fill:black}
    .fil1 {fill:white}
   </style></defs><rect
     style="opacity:0"
     id="rect8"
     height="3996.61"
     width="2825.89"
     y="-2360.01"
     x="-1750.44"
     class="fil0" /><polygon
     id="iconmonstr-arrow-66.svg"
     class="fil1"
     points="31.42,40.36 0,9.52 9.52,0 50.46,40.36 9.52,80.74 0,71.22 "
     style="fill:#ffffff;fill-opacity:1" /><polygon
     id="iconmonstr-arrow-66.svg_0"
     class="fil2"
     points="71.79,40.36 40.37,9.52 49.89,0 90.83,40.36 49.89,80.74 40.37,71.22 "
     style="fill:#ffffff;fill-opacity:1" /></svg>
