<?xml version="1.0" encoding="UTF-8" standalone="no"?>
<svg
   xmlns:dc="http://purl.org/dc/elements/1.1/"
   xmlns:cc="http://creativecommons.org/ns#"
   xmlns:rdf="http://www.w3.org/1999/02/22-rdf-syntax-ns#"
   xmlns:svg="http://www.w3.org/2000/svg"
   xmlns="http://www.w3.org/2000/svg"
   xmlns:sodipodi="http://sodipodi.sourceforge.net/DTD/sodipodi-0.dtd"
   xmlns:inkscape="http://www.inkscape.org/namespaces/inkscape"
   xml:space="preserve"
   width="354.3307px"
   height="354.3307px"
   version="1.1"
   style="clip-rule:evenodd;fill-rule:evenodd;image-rendering:optimizeQuality;shape-rendering:geometricPrecision;text-rendering:geometricPrecision"
   viewBox="-0.09910000000002128 0.0 539.24 539.24"
   id="svg2"
   inkscape:version="0.91 r13725"
   sodipodi:docname="move_platform_color.svg"><metadata
     id="metadata15"><rdf:RDF><cc:Work
         rdf:about=""><dc:format>image/svg+xml</dc:format><dc:type
           rdf:resource="http://purl.org/dc/dcmitype/StillImage" /><dc:title /></cc:Work></rdf:RDF></metadata><sodipodi:namedview
     pagecolor="#ffffff"
     bordercolor="#666666"
     borderopacity="1"
     objecttolerance="10"
     gridtolerance="10"
     guidetolerance="10"
     inkscape:pageopacity="0"
     inkscape:pageshadow="2"
     inkscape:window-width="1243"
     inkscape:window-height="775"
     id="namedview13"
     showgrid="false"
     inkscape:zoom="8.2810447"
     inkscape:cx="5.9807494"
     inkscape:cy="14.24941"
     inkscape:window-x="0"
     inkscape:window-y="0"
     inkscape:window-maximized="0"
     inkscape:current-layer="svg2"
     inkscape:document-rotation="0" /><defs
     id="defs4"><style
       type="text/css"
       id="style6">
    .fil1 {fill:#EC691F}
    .fil0 {fill:white}
   </style></defs><polygon
     style="fill:#ffffff;fill-opacity:1"
     points="402.27,491.81 201.2,287.82 0,491.81 47.41,539.24 201.2,382.71 354.86,539.24 "
     class="fil0"
     id="iconmonstr-arrow-66.svg"
     transform="matrix(1.3919259,0,0,1.2544665,0,-137.21853)" /><polygon
     style="fill:#ec691f"
     id="polygon11"
     points="0.01,217.35 0.01,150.3 138.7,150.3 138.7,0 263.57,0 263.57,150.3 402.26,150.3 402.26,217.35 "
     class="fil1"
     transform="scale(1.3919259,1)" /></svg>
