<?xml version="1.0" encoding="UTF-8" standalone="no"?>
<svg
   xmlns:dc="http://purl.org/dc/elements/1.1/"
   xmlns:cc="http://creativecommons.org/ns#"
   xmlns:rdf="http://www.w3.org/1999/02/22-rdf-syntax-ns#"
   xmlns:svg="http://www.w3.org/2000/svg"
   xmlns="http://www.w3.org/2000/svg"
   xmlns:sodipodi="http://sodipodi.sourceforge.net/DTD/sodipodi-0.dtd"
   xmlns:inkscape="http://www.inkscape.org/namespaces/inkscape"
   xml:space="preserve"
   width="354.3307px"
   height="354.3307px"
   version="1.1"
   style="shape-rendering:geometricPrecision; text-rendering:geometricPrecision; image-rendering:optimizeQuality; fill-rule:evenodd; clip-rule:evenodd"
   viewBox="-4.744999999999999 0.0 28.479999999999997 28.48"
   id="svg2"
   inkscape:version="0.91 r13725"
   sodipodi:docname="clock_color.svg"><metadata
     id="metadata17"><rdf:RDF><cc:Work
         rdf:about=""><dc:format>image/svg+xml</dc:format><dc:type
           rdf:resource="http://purl.org/dc/dcmitype/StillImage" /><dc:title /></cc:Work></rdf:RDF></metadata><sodipodi:namedview
     pagecolor="#ffffff"
     bordercolor="#666666"
     borderopacity="1"
     objecttolerance="10"
     gridtolerance="10"
     guidetolerance="10"
     inkscape:pageopacity="0"
     inkscape:pageshadow="2"
     inkscape:window-width="1353"
     inkscape:window-height="992"
     id="namedview15"
     showgrid="false"
     inkscape:zoom="10.488889"
     inkscape:cx="12.362406"
     inkscape:cy="11.25"
     inkscape:window-x="0"
     inkscape:window-y="0"
     inkscape:window-maximized="0"
     inkscape:current-layer="svg2"
     inkscape:document-rotation="0" /><defs
     id="defs4"><style
       type="text/css"
       id="style6">
    .fil2 {fill:#EC691F}
    .fil0 {fill:black}
    .fil1 {fill:white}
   </style></defs><rect
     class="fil0"
     x="-682.68"
     y="-1073.49"
     width="942.02"
     height="1332.29"
     id="rect8"
     style="opacity:0" /><g
     id="Layer_x0020_1"><metadata
       id="CorelCorpID_0Corel-Layer" /><path
       id="iconmonstr-time-14.svg"
       class="fil1"
       d="M17.23 8.45c1.14,-1.36 1.76,-3.06 1.76,-4.79l0 -3.66 -18.99 0 0 3.66c0,1.73 0.63,3.43 1.76,4.79l3.66 4.37c0.67,0.8 0.68,1.93 0.01,2.74l-3.71 4.5c-1.11,1.35 -1.72,3.03 -1.72,4.74l0 3.69 18.99 0 0 -3.69c0,-1.71 -0.61,-3.39 -1.72,-4.74l-3.71 -4.5c-0.67,-0.81 -0.66,-1.93 0.01,-2.74l3.66 -4.37 -0 0zm-5.51 8.61l3.71 4.5c0.77,0.94 1.18,2.95 1.18,4.26l-14.24 0c0,-1.31 0.41,-3.32 1.18,-4.25l3.71 -4.5c1.39,-1.68 1.38,-4.11 -0.02,-5.77l-3.66 -4.37c-0.78,-0.93 -1.21,-2.96 -1.21,-4.26l14.24 -0c0,1.31 -0.43,3.33 -1.21,4.26l-3.66 4.37c-1.4,1.67 -1.41,4.1 -0.02,5.77z" /><path
       class="fil2"
       d="M5.61 9.34l7.78 -0.02 -1.65 1.97c-0.69,0.83 -1.05,1.85 -1.05,2.86l-2.39 0c-0.01,-1.02 -0.36,-2.03 -1.05,-2.86l-1.63 -1.95z"
       id="path13" /></g></svg>
