<?xml version="1.0" encoding="UTF-8" standalone="no"?>
<svg
   xmlns:dc="http://purl.org/dc/elements/1.1/"
   xmlns:cc="http://creativecommons.org/ns#"
   xmlns:rdf="http://www.w3.org/1999/02/22-rdf-syntax-ns#"
   xmlns:svg="http://www.w3.org/2000/svg"
   xmlns="http://www.w3.org/2000/svg"
   xmlns:sodipodi="http://sodipodi.sourceforge.net/DTD/sodipodi-0.dtd"
   xmlns:inkscape="http://www.inkscape.org/namespaces/inkscape"
   xml:space="preserve"
   width="354.3307px"
   height="354.3307px"
   version="1.1"
   style="shape-rendering:geometricPrecision; text-rendering:geometricPrecision; image-rendering:optimizeQuality; fill-rule:evenodd; clip-rule:evenodd"
   viewBox="0.0 -17.739999999999995 175.1 175.1"
   id="svg2"
   inkscape:version="0.92.4 (5da689c313, 2019-01-14)"
   sodipodi:docname="wifi_off_grey.svg"><metadata
     id="metadata19"><rdf:RDF><cc:Work
         rdf:about=""><dc:format>image/svg+xml</dc:format><dc:type
           rdf:resource="http://purl.org/dc/dcmitype/StillImage" /><dc:title /></cc:Work></rdf:RDF></metadata><sodipodi:namedview
     pagecolor="#ffffff"
     bordercolor="#666666"
     borderopacity="1"
     objecttolerance="10"
     gridtolerance="10"
     guidetolerance="10"
     inkscape:pageopacity="0"
     inkscape:pageshadow="2"
     inkscape:window-width="1404"
     inkscape:window-height="837"
     id="namedview17"
     showgrid="false"
     inkscape:zoom="9.1265217"
     inkscape:cx="10.845559"
     inkscape:cy="12.929351"
     inkscape:window-x="0"
     inkscape:window-y="0"
     inkscape:window-maximized="0"
     inkscape:current-layer="svg2"
     inkscape:document-rotation="0" /><defs
     id="defs4"><style
       type="text/css"
       id="style6">
    .fil2 {fill:#EC691F}
    .fil0 {fill:black}
    .fil1 {fill:white}
   </style></defs><rect
     class="fil0"
     x="-2466.45"
     y="-3322.25"
     width="4017.68"
     height="5682.15"
     id="rect8"
     style="opacity:0" /><path
     style="fill:#808080"
     inkscape:connector-curvature="0"
     d="M 17.41,65.18 C 35.31,46.1 60.16,34.37 87.55,34.37 c 27.39,0 52.14,11.74 70.14,30.81 L 175.1,46.69 C 152.7,22.92 121.79,8.25 87.55,8.25 53.31,8.25 22.4,22.92 0,46.69 Z"
     class="fil1"
     id="iconmonstr-wireless-1.svg" /><path
     style="fill:#808080"
     inkscape:connector-curvature="0"
     d="M 47.15,96.78 C 57.52,85.82 71.8,79.07 87.55,79.07 c 15.75,0 30.03,6.75 40.4,17.71 l 17.02,-18 C 130.3,63.23 110.05,53.54 87.65,53.54 65.25,53.54 45,63.13 30.33,78.78 l 17.02,18 v 0 z"
     class="fil1"
     id="iconmonstr-wireless-1.svg_0" /><path
     style="fill:#808080"
     inkscape:connector-curvature="0"
     d="m 59.87,110.28 c 7.04,-7.53 16.83,-12.13 27.59,-12.13 10.76,0 20.54,4.6 27.58,12.13 l -27.58,29.34 z"
     class="fil1"
     id="iconmonstr-wireless-1.svg_1" /><rect
     style="fill:#ec691f;stroke-width:0.86425769"
     y="101.36057"
     x="-69.568344"
     id="rect15"
     height="19.129192"
     width="170.93094"
     transform="rotate(-45)"
     class="fil2" /></svg>
