{
    "WiFi.": {
        "Order": 1,
        "Param": "r--n"
    },
    "WiFi.AccessPoint.*.MACFiltering.Mode": {
        "Order": 2,
        "Param": "rw-n"
    },
    "WiFi.AccessPoint.*.MACFiltering.Entry.": {
        "Order": 2,
        "Param": "rw-n",
        "InstantiatedObj": "rwxn",
        "CommandEvent": "rwxn"
    }
}