{
    "Device.Time.": {
        "Order": 1,
        "Param": "r--n"
    },
    "Device.Time.NTPServer1": {
        "Order": 2,
        "Param": "rw-n"
    },
    "Device.Time.NTPServer2": {
        "Order": 2,
        "Param": "rw-n"
    },
    "Device.Time.NTPServer3": {
        "Order": 2,
        "Param": "rw-n"
    },
    "Device.Time.NTPServer4": {
        "Order": 2,
        "Param": "rw-n"
    },
    "Device.Time.NTPServer5": {
        "Order": 2,
        "Param": "rw-n"
    }
}
