{
    "Device.X_PRPL-COM_PersistentConfiguration.": {
        "Order": 1,
        "Param": "r--n",
        "Obj": "r--n",
        "InstantiatedObj": "r--n",
        "CommandEvent": "r--n"
    },
    "Device.X_PRPL-COM_PersistentConfiguration.Backup": {
        "Order": 2,
        "Param": "rwxn",
        "Obj": "rwxn",
        "InstantiatedObj": "rwxn",
        "CommandEvent": "rwxn"
    },
    "Device.X_PRPL-COM_PersistentConfiguration.Restore": {
        "Order": 2,
        "Param": "rwxn",
        "Obj": "rwxn",
        "InstantiatedObj": "rwxn",
        "CommandEvent": "rwxn"
    },
    "Device.X_PRPL-COM_PersistentConfiguration.Config.": {
        "Order": 2,
        "Param": "----",
        "Obj": "----",
        "InstantiatedObj": "----",
        "CommandEvent": "----"
    }
} 
