{
    "Device.IP.Interface.": {
        "Order": 1,
        "Param": "r--n"
    },
    "Device.IP.Interface.[Alias=='lan'].IPv4Address.[Alias=='lan'].": {
        "Order": 2,
        "Param": "rw-n"
    },
    "Device.IP.Interface.[Alias=='lan'].IPv6Address.[Alias=='ULA'].": {
        "Order": 2,
        "Param": "rw-n"
    }
}