{
    "Device.Firewall.": {
        "Order": 2,
        "Param": "rw-n",
        "Obj": "rw-n",
        "InstantiatedObj": "rw-n",
        "CommandEvent": "rw-n"
    },
    "Device.NAT.": {
        "Order": 2,
        "Param": "rw-n",
        "Obj": "rw-n",
        "InstantiatedObj": "rw-n",
        "CommandEvent": "rw-n"
    }
}
