{
    "Device.DHCPv4.": {
        "Order": 1,
        "Param": "r--n",
        "Obj": "r--n"
    },
    "Device.DHCPv4.Server.Pool.[Alias=='lan'].": {
        "Order": 2,
        "Param": "rw-n"
    },
    "Device.DHCPv4.Server.Pool.[Alias=='lan'].StaticAddress.": {
        "Order": 3,
        "Param": "rw-n",
        "Obj": "rw-n",
        "InstantiatedObj": "rw-n"
    }
}