{
  "files": {
    "main.css": "/static/css/main.3c20db26.chunk.css",
    "main.js": "/static/js/main.c0d4c2f3.chunk.js",
    "main.js.map": "/static/js/main.c0d4c2f3.chunk.js.map",
    "runtime-main.js": "/static/js/runtime-main.841cf0f2.js",
    "runtime-main.js.map": "/static/js/runtime-main.841cf0f2.js.map",
    "static/css/2.c1e28d34.chunk.css": "/static/css/2.c1e28d34.chunk.css",
    "static/js/2.926106e9.chunk.js": "/static/js/2.926106e9.chunk.js",
    "static/js/2.926106e9.chunk.js.map": "/static/js/2.926106e9.chunk.js.map",
    "index.html": "/index.html",
    "static/css/2.c1e28d34.chunk.css.map": "/static/css/2.c1e28d34.chunk.css.map",
    "static/css/main.3c20db26.chunk.css.map": "/static/css/main.3c20db26.chunk.css.map",
    "static/js/2.926106e9.chunk.js.LICENSE.txt": "/static/js/2.926106e9.chunk.js.LICENSE.txt",
    "static/media/1540.60b425da.jpg": "/static/media/1540.60b425da.jpg",
    "static/media/Frame 1.8170b91d.svg": "/static/media/Frame 1.8170b91d.svg",
    "static/media/styles.scss": "/static/media/svgbubbles.23a5e3c0.svg",
    "static/media/streetLight.5a52d624.svg": "/static/media/streetLight.5a52d624.svg",
    "static/media/streetLightError.41f15fba.svg": "/static/media/streetLightError.41f15fba.svg"
  },
  "entrypoints": [
    "static/js/runtime-main.841cf0f2.js",
    "static/css/2.c1e28d34.chunk.css",
    "static/js/2.926106e9.chunk.js",
    "static/css/main.3c20db26.chunk.css",
    "static/js/main.c0d4c2f3.chunk.js"
  ]
}