<svg width="188" height="88" viewBox="0 0 188 88" fill="none" xmlns="http://www.w3.org/2000/svg">
<rect x="0.5" y="0.5" width="187" height="87" rx="4.5" fill="white" stroke="#1C80DF"/>
<path d="M88.1172 44.5635C86.9915 44.2399 86.1712 43.8434 85.6562 43.374C85.1458 42.9001 84.8906 42.3167 84.8906 41.624C84.8906 40.8402 85.2028 40.193 85.8271 39.6826C86.4561 39.1676 87.2718 38.9102 88.2744 38.9102C88.958 38.9102 89.5664 39.0423 90.0996 39.3066C90.6374 39.571 91.0521 39.9355 91.3438 40.4004C91.64 40.8652 91.7881 41.3734 91.7881 41.9248H90.4688C90.4688 41.3232 90.2773 40.8516 89.8945 40.5098C89.5117 40.1634 88.9717 39.9902 88.2744 39.9902C87.6273 39.9902 87.1214 40.1338 86.7568 40.4209C86.3968 40.7035 86.2168 41.0977 86.2168 41.6035C86.2168 42.0091 86.3877 42.3532 86.7295 42.6357C87.0758 42.9137 87.6615 43.1689 88.4863 43.4014C89.3158 43.6338 89.9629 43.8913 90.4277 44.1738C90.8971 44.4518 91.2435 44.7777 91.4668 45.1514C91.6947 45.5251 91.8086 45.9648 91.8086 46.4707C91.8086 47.2773 91.4941 47.9245 90.8652 48.4121C90.2363 48.8952 89.3955 49.1367 88.3428 49.1367C87.6592 49.1367 87.0212 49.0068 86.4287 48.7471C85.8363 48.4827 85.3783 48.1227 85.0547 47.667C84.7357 47.2113 84.5762 46.694 84.5762 46.1152H85.8955C85.8955 46.7168 86.1165 47.193 86.5586 47.5439C87.0052 47.8903 87.5999 48.0635 88.3428 48.0635C89.0355 48.0635 89.5664 47.9222 89.9355 47.6396C90.3047 47.3571 90.4893 46.972 90.4893 46.4844C90.4893 45.9967 90.3184 45.6208 89.9766 45.3564C89.6348 45.0876 89.015 44.8232 88.1172 44.5635ZM94.6729 49H93.4082V41.6035H94.6729V49ZM93.3057 39.6416C93.3057 39.4365 93.3672 39.2633 93.4902 39.1221C93.6178 38.9808 93.8047 38.9102 94.0508 38.9102C94.2969 38.9102 94.4837 38.9808 94.6113 39.1221C94.7389 39.2633 94.8027 39.4365 94.8027 39.6416C94.8027 39.8467 94.7389 40.0176 94.6113 40.1543C94.4837 40.291 94.2969 40.3594 94.0508 40.3594C93.8047 40.3594 93.6178 40.291 93.4902 40.1543C93.3672 40.0176 93.3057 39.8467 93.3057 39.6416ZM96.4023 45.2402C96.4023 44.0872 96.6689 43.1712 97.2021 42.4922C97.7354 41.8086 98.4417 41.4668 99.3213 41.4668C100.224 41.4668 100.928 41.7858 101.434 42.4238L101.495 41.6035H102.65V48.8223C102.65 49.7793 102.366 50.5335 101.796 51.085C101.231 51.6364 100.47 51.9121 99.5127 51.9121C98.9795 51.9121 98.4577 51.7982 97.9473 51.5703C97.4368 51.3424 97.0472 51.0303 96.7783 50.6338L97.4346 49.875C97.9769 50.5449 98.64 50.8799 99.4238 50.8799C100.039 50.8799 100.518 50.7067 100.859 50.3604C101.206 50.014 101.379 49.5264 101.379 48.8975V48.2617C100.873 48.8451 100.183 49.1367 99.3076 49.1367C98.4417 49.1367 97.7399 48.7881 97.2021 48.0908C96.6689 47.3936 96.4023 46.4434 96.4023 45.2402ZM97.6738 45.3838C97.6738 46.2178 97.8447 46.874 98.1865 47.3525C98.5283 47.8265 99.0068 48.0635 99.6221 48.0635C100.42 48.0635 101.005 47.7012 101.379 46.9766V43.5996C100.992 42.8932 100.41 42.54 99.6357 42.54C99.0205 42.54 98.5397 42.7793 98.1934 43.2578C97.847 43.7363 97.6738 44.445 97.6738 45.3838ZM105.761 41.6035L105.802 42.5332C106.367 41.8223 107.105 41.4668 108.017 41.4668C109.58 41.4668 110.368 42.3486 110.382 44.1123V49H109.117V44.1055C109.113 43.5723 108.99 43.1781 108.748 42.9229C108.511 42.6676 108.14 42.54 107.634 42.54C107.224 42.54 106.864 42.6494 106.554 42.8682C106.244 43.0869 106.002 43.374 105.829 43.7295V49H104.564V41.6035H105.761ZM117.026 42.499C117.587 41.8109 118.316 41.4668 119.214 41.4668C120.777 41.4668 121.565 42.3486 121.579 44.1123V49H120.314V44.1055C120.31 43.5723 120.187 43.1781 119.945 42.9229C119.708 42.6676 119.337 42.54 118.831 42.54C118.421 42.54 118.061 42.6494 117.751 42.8682C117.441 43.0869 117.2 43.374 117.026 43.7295V49H115.762V38.5H117.026V42.499ZM126.542 49.1367C125.539 49.1367 124.724 48.8086 124.095 48.1523C123.466 47.4915 123.151 46.6097 123.151 45.5068V45.2744C123.151 44.5407 123.29 43.8867 123.568 43.3125C123.851 42.7337 124.243 42.2826 124.744 41.959C125.25 41.6309 125.797 41.4668 126.385 41.4668C127.346 41.4668 128.094 41.7835 128.627 42.417C129.16 43.0505 129.427 43.9574 129.427 45.1377V45.6641H124.416C124.434 46.3932 124.646 46.9834 125.052 47.4346C125.462 47.8812 125.981 48.1045 126.61 48.1045C127.057 48.1045 127.435 48.0133 127.745 47.8311C128.055 47.6488 128.326 47.4072 128.559 47.1064L129.331 47.708C128.711 48.6605 127.782 49.1367 126.542 49.1367ZM126.385 42.5059C125.874 42.5059 125.446 42.6927 125.1 43.0664C124.753 43.4355 124.539 43.9551 124.457 44.625H128.162V44.5293C128.126 43.8867 127.952 43.39 127.643 43.0391C127.333 42.6836 126.913 42.5059 126.385 42.5059ZM134.472 42.7383C134.28 42.7064 134.073 42.6904 133.85 42.6904C133.02 42.6904 132.457 43.0436 132.161 43.75V49H130.896V41.6035H132.127L132.147 42.458C132.562 41.7972 133.15 41.4668 133.911 41.4668C134.157 41.4668 134.344 41.4987 134.472 41.5625V42.7383ZM138.573 49.1367C137.571 49.1367 136.755 48.8086 136.126 48.1523C135.497 47.4915 135.183 46.6097 135.183 45.5068V45.2744C135.183 44.5407 135.322 43.8867 135.6 43.3125C135.882 42.7337 136.274 42.2826 136.775 41.959C137.281 41.6309 137.828 41.4668 138.416 41.4668C139.378 41.4668 140.125 41.7835 140.658 42.417C141.191 43.0505 141.458 43.9574 141.458 45.1377V45.6641H136.447C136.465 46.3932 136.677 46.9834 137.083 47.4346C137.493 47.8812 138.013 48.1045 138.642 48.1045C139.088 48.1045 139.466 48.0133 139.776 47.8311C140.086 47.6488 140.357 47.4072 140.59 47.1064L141.362 47.708C140.743 48.6605 139.813 49.1367 138.573 49.1367ZM138.416 42.5059C137.906 42.5059 137.477 42.6927 137.131 43.0664C136.785 43.4355 136.57 43.9551 136.488 44.625H140.193V44.5293C140.157 43.8867 139.984 43.39 139.674 43.0391C139.364 42.6836 138.945 42.5059 138.416 42.5059Z" fill="#1C80DF"/>
<path d="M53.1222 49.2531C52.9362 49.8138 52.9362 50.5606 53.3082 50.9354C53.683 51.3101 54.6158 51.1214 55.1792 50.9354C55.554 50.7493 61.3504 47.7568 61.9111 47.196C62.0972 47.01 71.8216 37.2855 72.5684 36.5387C73.3152 35.792 72.9432 34.6677 72.5684 34.2957C72.1937 33.9209 70.8861 32.6134 69.5759 31.4918C68.4543 30.3703 67.3328 31.4918 67.1441 31.6779C66.9554 31.8639 60.2288 38.4098 56.6755 41.9604C55.9287 42.7099 53.3109 48.8783 53.1222 49.2531ZM67.7075 33.1741C67.8936 32.9881 68.4543 32.7994 68.8291 33.1741C69.2038 33.5489 70.3254 34.6704 70.5114 34.8564C70.6974 35.0425 71.0721 35.6032 70.6974 35.978C70.3227 36.3527 69.0151 37.6603 69.0151 37.6603L66.0225 34.8564C66.0252 34.8564 67.5188 33.3602 67.7075 33.1741ZM64.901 36.164L67.8936 38.9678L60.7896 46.0745L57.7971 43.0819L64.901 36.164ZM59.2933 46.8213C59.2933 46.8213 55.9287 49.0643 55.368 49.4391C54.8072 49.8138 54.4324 49.8138 54.4324 49.4391C54.4324 49.2531 54.8072 48.5036 54.9932 48.1315C54.9932 47.9455 57.0503 44.5782 57.0503 44.5782L59.2933 46.8213Z" fill="#1C80DF" fill-opacity="0.87"/>
<line x1="43" y1="55.5" x2="63" y2="55.5" stroke="#1C80DF"/>
</svg>
