<svg width="510" height="46" viewBox="0 0 510 46" fill="none" xmlns="http://www.w3.org/2000/svg">
<path d="M214.369 30H212.182V15.9082H220.98V17.793H214.369V22.2559H220.424V24.1016H214.369V30ZM222.748 30V19.3945H224.867V30H222.748ZM224.691 17.5293C224.451 17.7637 224.158 17.8809 223.812 17.8809C223.467 17.8809 223.174 17.7637 222.934 17.5293C222.693 17.2884 222.572 16.9987 222.572 16.6602C222.572 16.3151 222.693 16.0254 222.934 15.791C223.174 15.5566 223.467 15.4395 223.812 15.4395C224.158 15.4395 224.451 15.5566 224.691 15.791C224.932 16.0254 225.053 16.3151 225.053 16.6602C225.053 16.9987 224.932 17.2884 224.691 17.5293ZM227.211 30V15.2734H229.33V30H227.211ZM231.684 30V15.2734H233.803V30H231.684ZM240.756 30V19.3945H242.875V30H240.756ZM242.699 17.5293C242.458 17.7637 242.165 17.8809 241.82 17.8809C241.475 17.8809 241.182 17.7637 240.941 17.5293C240.701 17.2884 240.58 16.9987 240.58 16.6602C240.58 16.3151 240.701 16.0254 240.941 15.791C241.182 15.5566 241.475 15.4395 241.82 15.4395C242.165 15.4395 242.458 15.5566 242.699 15.791C242.94 16.0254 243.061 16.3151 243.061 16.6602C243.061 16.9987 242.94 17.2884 242.699 17.5293ZM245.131 30V19.3945H247.152V21.1816H247.191C247.849 19.9121 248.998 19.2773 250.639 19.2773C251.811 19.2773 252.732 19.6289 253.402 20.332C254.079 21.0286 254.418 21.9857 254.418 23.2031V30H252.299V23.6035C252.299 22.7962 252.094 22.1777 251.684 21.748C251.273 21.3118 250.681 21.0938 249.906 21.0938C249.105 21.0938 248.461 21.3509 247.973 21.8652C247.491 22.373 247.25 23.0436 247.25 23.877V30H245.131ZM261.781 30V21.0645H260.316V19.3945H261.781V18.418C261.781 17.4219 262.022 16.6992 262.504 16.25C262.986 15.7943 263.76 15.5664 264.828 15.5664C265.167 15.5664 265.525 15.599 265.902 15.6641V17.2754C265.674 17.2233 265.411 17.1973 265.111 17.1973C264.675 17.1973 264.359 17.2982 264.164 17.5C263.975 17.7018 263.878 18.0306 263.871 18.4863V19.3945H265.912V21.0645H263.891V30H261.781ZM275.434 28.6621C274.535 29.6387 273.318 30.127 271.781 30.127C270.245 30.127 269.024 29.6387 268.119 28.6621C267.214 27.6855 266.762 26.3639 266.762 24.6973C266.762 23.0371 267.214 21.7155 268.119 20.7324C269.031 19.7493 270.251 19.2578 271.781 19.2578C273.311 19.2578 274.529 19.7493 275.434 20.7324C276.339 21.709 276.791 23.0306 276.791 24.6973C276.791 26.3639 276.339 27.6855 275.434 28.6621ZM269.672 27.4023C270.18 28.0469 270.883 28.3691 271.781 28.3691C272.68 28.3691 273.38 28.0469 273.881 27.4023C274.389 26.7578 274.643 25.8561 274.643 24.6973C274.643 23.5384 274.389 22.6367 273.881 21.9922C273.38 21.3411 272.68 21.0156 271.781 21.0156C270.883 21.0156 270.18 21.3411 269.672 21.9922C269.164 22.6432 268.91 23.5449 268.91 24.6973C268.91 25.8496 269.164 26.7513 269.672 27.4023ZM278.49 30V19.3945H280.512V21.1816H280.551C280.714 20.5892 281.023 20.127 281.479 19.7949C281.941 19.4564 282.484 19.2871 283.109 19.2871C283.402 19.2871 283.637 19.3132 283.812 19.3652V21.3477C283.578 21.2565 283.269 21.2109 282.885 21.2109C282.188 21.2109 281.635 21.4355 281.225 21.8848C280.814 22.3275 280.609 22.9232 280.609 23.6719V30H278.49ZM285.209 30V19.3945H287.23V21.1914H287.27C287.51 20.599 287.898 20.1335 288.432 19.7949C288.972 19.4499 289.59 19.2773 290.287 19.2773C291.023 19.2773 291.648 19.4564 292.162 19.8145C292.676 20.1725 293.041 20.6803 293.256 21.3379H293.305C293.585 20.6999 294.018 20.1986 294.604 19.834C295.196 19.4629 295.87 19.2773 296.625 19.2773C297.673 19.2773 298.51 19.5964 299.135 20.2344C299.766 20.8659 300.082 21.7122 300.082 22.7734V30H297.973V23.2812C297.973 22.5846 297.79 22.0475 297.426 21.6699C297.068 21.2858 296.56 21.0938 295.902 21.0938C295.251 21.0938 294.717 21.3118 294.301 21.748C293.891 22.1842 293.686 22.7409 293.686 23.418V30H291.605V23.1055C291.605 22.4935 291.42 22.0052 291.049 21.6406C290.684 21.276 290.193 21.0938 289.574 21.0938C288.923 21.0938 288.386 21.3216 287.963 21.7773C287.54 22.2266 287.328 22.7995 287.328 23.4961V30H285.209Z" fill="#ACACAC"/>
<line y1="22.5" x2="200" y2="22.5" stroke="#ACACAC"/>
<line x1="310" y1="22.5" x2="510" y2="22.5" stroke="#ACACAC"/>
</svg>
