<svg width="574" height="53" viewBox="0 0 574 53" fill="none" xmlns="http://www.w3.org/2000/svg">
<path d="M25 48.0635C37.7376 48.0635 48.0635 37.7376 48.0635 25C48.0635 12.2624 37.7376 1.93652 25 1.93652C12.2624 1.93652 1.93652 12.2624 1.93652 25C1.93652 37.7376 12.2624 48.0635 25 48.0635Z" fill="#74C318"/>
<path d="M25 50C11.2161 50 0 38.7858 0 25C0 11.2161 11.2161 0 25 0C38.7858 0 50 11.2161 50 25C50 38.7858 38.7858 50 25 50ZM25 3.87295C13.3501 3.87295 3.87295 13.3501 3.87295 25C3.87295 36.6499 13.3501 46.1271 25 46.1271C36.6499 46.1271 46.1271 36.6479 46.1271 25C46.1271 13.3501 36.6499 3.87295 25 3.87295Z" fill="#74C318"/>
<path d="M21.9794 34.1988C21.4605 34.1988 20.9647 33.9916 20.5987 33.6198L13.4531 26.358C12.7036 25.595 12.7133 24.3712 13.4763 23.6198C14.2393 22.8724 15.4651 22.8801 16.2145 23.6431L21.9233 29.4447L33.7339 16.4374C34.4562 15.6454 35.6801 15.5893 36.4682 16.3058C37.2602 17.0242 37.3183 18.2481 36.5998 19.042L23.4124 33.5655C23.0542 33.9605 22.5507 34.1891 22.0182 34.2007C22.0046 34.1988 21.993 34.1988 21.9794 34.1988Z" fill="white"/>
<path d="M82.9043 43H80.0947V30.2031L69.4922 13.4072H72.6914L81.4482 27.4551H81.5508L90.3076 13.4072H93.5068L82.9043 30.2031V43ZM101.238 43.2461C98.2031 43.2461 95.7695 42.2275 93.9375 40.1904C92.1191 38.1396 91.21 35.3916 91.21 31.9463C91.21 28.5146 92.1191 25.7803 93.9375 23.7432C95.7695 21.6924 98.2031 20.667 101.238 20.667C104.287 20.667 106.721 21.6924 108.539 23.7432C110.371 25.7803 111.287 28.5146 111.287 31.9463C111.287 35.3779 110.371 38.1191 108.539 40.1699C106.721 42.2207 104.287 43.2461 101.238 43.2461ZM101.238 40.8057C103.494 40.8057 105.271 40.0195 106.57 38.4473C107.869 36.8613 108.519 34.6943 108.519 31.9463C108.519 29.1982 107.869 27.0381 106.57 25.4658C105.271 23.8799 103.494 23.0869 101.238 23.0869C98.9961 23.0869 97.2256 23.8799 95.9268 25.4658C94.6279 27.0381 93.9785 29.1982 93.9785 31.9463C93.9785 34.6943 94.6279 36.8613 95.9268 38.4473C97.2256 40.0195 98.9961 40.8057 101.238 40.8057ZM133.005 20.9131V43H130.441V38.8574H130.38C129.765 40.2246 128.794 41.2979 127.468 42.0771C126.142 42.8564 124.61 43.2461 122.874 43.2461C120.468 43.2461 118.547 42.5215 117.111 41.0723C115.676 39.6094 114.958 37.6338 114.958 35.1455V20.9131H117.665V34.6943C117.665 36.6494 118.191 38.1602 119.244 39.2266C120.297 40.2793 121.767 40.8057 123.653 40.8057C125.595 40.8057 127.181 40.1768 128.411 38.9189C129.655 37.6475 130.277 35.9727 130.277 33.8945V20.9131H133.005ZM137.886 43V20.9131H140.429V24.8301H140.511C140.894 23.5176 141.577 22.499 142.562 21.7744C143.546 21.0361 144.729 20.667 146.109 20.667C146.697 20.667 147.244 20.7422 147.75 20.8926V23.5996C147.285 23.3809 146.615 23.2715 145.74 23.2715C144.182 23.2715 142.931 23.832 141.987 24.9531C141.058 26.0605 140.593 27.5098 140.593 29.3008V43H137.886ZM180.193 43L176.912 33.9355H164.484L161.203 43H158.229L169.304 13.4072H172.093L183.146 43H180.193ZM170.637 16.873L165.325 31.5156H176.071L170.76 16.873H170.637ZM196.354 20.667C199.143 20.667 201.405 21.7061 203.142 23.7842C204.892 25.8623 205.767 28.583 205.767 31.9463C205.767 35.3096 204.898 38.0371 203.162 40.1289C201.439 42.207 199.184 43.2461 196.395 43.2461C194.658 43.2461 193.12 42.8154 191.78 41.9541C190.454 41.0791 189.477 39.9102 188.848 38.4473H188.786V50.2393H186.079V20.9131H188.643V25.4863H188.704C189.292 24.0645 190.283 22.9092 191.678 22.0205C193.072 21.1182 194.631 20.667 196.354 20.667ZM195.882 40.8057C198.015 40.8057 199.73 39.999 201.029 38.3857C202.342 36.7588 202.998 34.6191 202.998 31.9668C202.998 29.3145 202.342 27.1748 201.029 25.5479C199.73 23.9072 198.015 23.0869 195.882 23.0869C193.776 23.0869 192.061 23.9141 190.734 25.5684C189.422 27.209 188.766 29.335 188.766 31.9463C188.766 34.5713 189.422 36.7041 190.734 38.3447C192.061 39.9854 193.776 40.8057 195.882 40.8057ZM219.814 20.667C222.604 20.667 224.866 21.7061 226.603 23.7842C228.353 25.8623 229.228 28.583 229.228 31.9463C229.228 35.3096 228.359 38.0371 226.623 40.1289C224.9 42.207 222.645 43.2461 219.855 43.2461C218.119 43.2461 216.581 42.8154 215.241 41.9541C213.915 41.0791 212.938 39.9102 212.309 38.4473H212.247V50.2393H209.54V20.9131H212.104V25.4863H212.165C212.753 24.0645 213.744 22.9092 215.139 22.0205C216.533 21.1182 218.092 20.667 219.814 20.667ZM219.343 40.8057C221.476 40.8057 223.191 39.999 224.49 38.3857C225.803 36.7588 226.459 34.6191 226.459 31.9668C226.459 29.3145 225.803 27.1748 224.49 25.5479C223.191 23.9072 221.476 23.0869 219.343 23.0869C217.237 23.0869 215.521 23.9141 214.195 25.5684C212.883 27.209 212.227 29.335 212.227 31.9463C212.227 34.5713 212.883 36.7041 214.195 38.3447C215.521 39.9854 217.237 40.8057 219.343 40.8057ZM233.206 43V12.1152H235.913V43H233.206ZM241.204 43V20.9131H243.911V43H241.204ZM243.85 16.0117C243.494 16.3672 243.063 16.5449 242.558 16.5449C242.052 16.5449 241.614 16.3672 241.245 16.0117C240.89 15.6426 240.712 15.2119 240.712 14.7197C240.712 14.2139 240.89 13.7832 241.245 13.4277C241.614 13.0586 242.052 12.874 242.558 12.874C243.063 12.874 243.494 13.0586 243.85 13.4277C244.205 13.7832 244.383 14.2139 244.383 14.7197C244.383 15.2119 244.205 15.6426 243.85 16.0117ZM266.9 27.8652H264.214C263.94 26.457 263.236 25.3086 262.102 24.4199C260.967 23.5312 259.545 23.0869 257.836 23.0869C255.676 23.0869 253.939 23.8936 252.627 25.5068C251.314 27.1201 250.658 29.2666 250.658 31.9463C250.658 34.667 251.314 36.8271 252.627 38.4268C253.939 40.0127 255.683 40.8057 257.856 40.8057C259.552 40.8057 260.96 40.4023 262.081 39.5957C263.202 38.7754 263.92 37.6406 264.234 36.1914H266.921C266.606 38.2969 265.622 39.999 263.968 41.2979C262.313 42.5967 260.276 43.2461 257.856 43.2461C254.835 43.2461 252.415 42.2344 250.597 40.2109C248.792 38.1738 247.89 35.4189 247.89 31.9463C247.89 28.5283 248.792 25.7939 250.597 23.7432C252.415 21.6924 254.821 20.667 257.815 20.667C260.304 20.667 262.368 21.3574 264.009 22.7383C265.663 24.1191 266.627 25.8281 266.9 27.8652ZM277.503 40.8672C279.485 40.8672 281.14 40.2793 282.466 39.1035C283.806 37.9141 284.476 36.4443 284.476 34.6943V32.2539L278.016 32.7051C276.156 32.8281 274.741 33.2451 273.771 33.9561C272.813 34.6533 272.335 35.624 272.335 36.8682C272.335 38.0576 272.813 39.0215 273.771 39.7598C274.728 40.498 275.972 40.8672 277.503 40.8672ZM276.97 43.2461C274.769 43.2461 272.984 42.6582 271.617 41.4824C270.25 40.293 269.566 38.748 269.566 36.8477C269.566 34.9609 270.257 33.4844 271.638 32.418C273.019 31.3379 275.035 30.7021 277.688 30.5107L284.476 30.0596V28.1729C284.476 26.5596 283.983 25.3086 282.999 24.4199C282.028 23.5312 280.654 23.0869 278.877 23.0869C277.332 23.0869 276.054 23.4629 275.042 24.2148C274.03 24.9531 273.401 25.9785 273.155 27.291H270.551C270.66 25.3496 271.494 23.7637 273.053 22.5332C274.625 21.2891 276.573 20.667 278.897 20.667C281.427 20.667 283.437 21.3232 284.927 22.6357C286.431 23.9482 287.183 25.7188 287.183 27.9473V43H284.599V38.7754H284.537C283.936 40.1152 282.944 41.1953 281.563 42.0156C280.196 42.8359 278.665 43.2461 276.97 43.2461ZM293.13 15.6221H295.837V20.9131H300.267V23.1895H295.837V37.4629C295.837 38.6113 296.069 39.4453 296.534 39.9648C297.013 40.4844 297.765 40.7441 298.79 40.7441C299.405 40.7441 299.932 40.7168 300.369 40.6621V42.9795C300.041 43.0752 299.337 43.123 298.257 43.123C296.425 43.123 295.112 42.6924 294.319 41.8311C293.526 40.9697 293.13 39.5479 293.13 37.5654V23.1895H289.972V20.9131H293.13V15.6221ZM304.409 43V20.9131H307.116V43H304.409ZM307.055 16.0117C306.699 16.3672 306.269 16.5449 305.763 16.5449C305.257 16.5449 304.819 16.3672 304.45 16.0117C304.095 15.6426 303.917 15.2119 303.917 14.7197C303.917 14.2139 304.095 13.7832 304.45 13.4277C304.819 13.0586 305.257 12.874 305.763 12.874C306.269 12.874 306.699 13.0586 307.055 13.4277C307.41 13.7832 307.588 14.2139 307.588 14.7197C307.588 15.2119 307.41 15.6426 307.055 16.0117ZM321.123 43.2461C318.088 43.2461 315.654 42.2275 313.822 40.1904C312.004 38.1396 311.095 35.3916 311.095 31.9463C311.095 28.5146 312.004 25.7803 313.822 23.7432C315.654 21.6924 318.088 20.667 321.123 20.667C324.172 20.667 326.605 21.6924 328.424 23.7432C330.256 25.7803 331.172 28.5146 331.172 31.9463C331.172 35.3779 330.256 38.1191 328.424 40.1699C326.605 42.2207 324.172 43.2461 321.123 43.2461ZM321.123 40.8057C323.379 40.8057 325.156 40.0195 326.455 38.4473C327.754 36.8613 328.403 34.6943 328.403 31.9463C328.403 29.1982 327.754 27.0381 326.455 25.4658C325.156 23.8799 323.379 23.0869 321.123 23.0869C318.881 23.0869 317.11 23.8799 315.812 25.4658C314.513 27.0381 313.863 29.1982 313.863 31.9463C313.863 34.6943 314.513 36.8613 315.812 38.4473C317.11 40.0195 318.881 40.8057 321.123 40.8057ZM334.966 43V20.9131H337.509V25.0352H337.591C338.206 23.6543 339.156 22.5811 340.441 21.8154C341.727 21.0498 343.251 20.667 345.015 20.667C347.448 20.667 349.383 21.3984 350.818 22.8613C352.268 24.3105 352.992 26.2861 352.992 28.7881V43H350.285V29.2188C350.285 27.2773 349.752 25.7734 348.686 24.707C347.619 23.627 346.143 23.0869 344.256 23.0869C342.287 23.0869 340.694 23.7295 339.478 25.0146C338.274 26.2861 337.673 27.9541 337.673 30.0186V43H334.966ZM367.286 43V20.9131H369.993V43H367.286ZM369.932 16.0117C369.576 16.3672 369.146 16.5449 368.64 16.5449C368.134 16.5449 367.696 16.3672 367.327 16.0117C366.972 15.6426 366.794 15.2119 366.794 14.7197C366.794 14.2139 366.972 13.7832 367.327 13.4277C367.696 13.0586 368.134 12.874 368.64 12.874C369.146 12.874 369.576 13.0586 369.932 13.4277C370.287 13.7832 370.465 14.2139 370.465 14.7197C370.465 15.2119 370.287 15.6426 369.932 16.0117ZM374.628 26.8604C374.628 25.042 375.373 23.5586 376.863 22.4102C378.367 21.248 380.268 20.667 382.564 20.667C384.793 20.667 386.646 21.2686 388.122 22.4717C389.599 23.6748 390.392 25.2266 390.501 27.127H387.896C387.76 25.8691 387.206 24.8643 386.235 24.1123C385.278 23.3467 384.027 22.9639 382.482 22.9639C380.992 22.9639 379.755 23.3125 378.771 24.0098C377.8 24.707 377.314 25.6094 377.314 26.7168C377.314 27.6055 377.643 28.3301 378.299 28.8906C378.969 29.4512 380.015 29.9092 381.437 30.2646L384.82 31.085C387.035 31.6455 388.607 32.3701 389.537 33.2588C390.467 34.1338 390.932 35.3574 390.932 36.9297C390.932 38.7891 390.132 40.3066 388.532 41.4824C386.946 42.6582 384.909 43.2461 382.421 43.2461C380.069 43.2461 378.107 42.6445 376.535 41.4414C374.977 40.2246 374.122 38.6729 373.972 36.7861H376.72C376.884 38.0576 377.485 39.0762 378.524 39.8418C379.577 40.5938 380.931 40.9697 382.585 40.9697C384.253 40.9697 385.6 40.6211 386.625 39.9238C387.664 39.2129 388.184 38.2764 388.184 37.1143C388.184 36.1709 387.869 35.4258 387.24 34.8789C386.611 34.3184 385.552 33.8535 384.062 33.4844L380.329 32.541C378.415 32.0625 376.986 31.3584 376.043 30.4287C375.1 29.499 374.628 28.3096 374.628 26.8604ZM424.031 43L420.75 33.9355H408.322L405.041 43H402.067L413.142 13.4072H415.931L426.984 43H424.031ZM414.475 16.873L409.163 31.5156H419.909L414.598 16.873H414.475ZM440.191 20.667C442.98 20.667 445.243 21.7061 446.979 23.7842C448.729 25.8623 449.604 28.583 449.604 31.9463C449.604 35.3096 448.736 38.0371 447 40.1289C445.277 42.207 443.021 43.2461 440.232 43.2461C438.496 43.2461 436.958 42.8154 435.618 41.9541C434.292 41.0791 433.314 39.9102 432.686 38.4473H432.624V50.2393H429.917V20.9131H432.48V25.4863H432.542C433.13 24.0645 434.121 22.9092 435.516 22.0205C436.91 21.1182 438.469 20.667 440.191 20.667ZM439.72 40.8057C441.853 40.8057 443.568 39.999 444.867 38.3857C446.18 36.7588 446.836 34.6191 446.836 31.9668C446.836 29.3145 446.18 27.1748 444.867 25.5479C443.568 23.9072 441.853 23.0869 439.72 23.0869C437.614 23.0869 435.898 23.9141 434.572 25.5684C433.26 27.209 432.604 29.335 432.604 31.9463C432.604 34.5713 433.26 36.7041 434.572 38.3447C435.898 39.9854 437.614 40.8057 439.72 40.8057ZM463.652 20.667C466.441 20.667 468.704 21.7061 470.44 23.7842C472.19 25.8623 473.065 28.583 473.065 31.9463C473.065 35.3096 472.197 38.0371 470.461 40.1289C468.738 42.207 466.482 43.2461 463.693 43.2461C461.957 43.2461 460.419 42.8154 459.079 41.9541C457.753 41.0791 456.775 39.9102 456.146 38.4473H456.085V50.2393H453.378V20.9131H455.941V25.4863H456.003C456.591 24.0645 457.582 22.9092 458.977 22.0205C460.371 21.1182 461.93 20.667 463.652 20.667ZM463.181 40.8057C465.313 40.8057 467.029 39.999 468.328 38.3857C469.641 36.7588 470.297 34.6191 470.297 31.9668C470.297 29.3145 469.641 27.1748 468.328 25.5479C467.029 23.9072 465.313 23.0869 463.181 23.0869C461.075 23.0869 459.359 23.9141 458.033 25.5684C456.721 27.209 456.064 29.335 456.064 31.9463C456.064 34.5713 456.721 36.7041 458.033 38.3447C459.359 39.9854 461.075 40.8057 463.181 40.8057ZM476.839 43V20.9131H479.382V24.8301H479.464C479.847 23.5176 480.53 22.499 481.515 21.7744C482.499 21.0361 483.682 20.667 485.062 20.667C485.65 20.667 486.197 20.7422 486.703 20.8926V23.5996C486.238 23.3809 485.568 23.2715 484.693 23.2715C483.135 23.2715 481.884 23.832 480.94 24.9531C480.011 26.0605 479.546 27.5098 479.546 29.3008V43H476.839ZM497.49 43.2461C494.455 43.2461 492.021 42.2275 490.189 40.1904C488.371 38.1396 487.462 35.3916 487.462 31.9463C487.462 28.5146 488.371 25.7803 490.189 23.7432C492.021 21.6924 494.455 20.667 497.49 20.667C500.539 20.667 502.973 21.6924 504.791 23.7432C506.623 25.7803 507.539 28.5146 507.539 31.9463C507.539 35.3779 506.623 38.1191 504.791 40.1699C502.973 42.2207 500.539 43.2461 497.49 43.2461ZM497.49 40.8057C499.746 40.8057 501.523 40.0195 502.822 38.4473C504.121 36.8613 504.771 34.6943 504.771 31.9463C504.771 29.1982 504.121 27.0381 502.822 25.4658C501.523 23.8799 499.746 23.0869 497.49 23.0869C495.248 23.0869 493.478 23.8799 492.179 25.4658C490.88 27.0381 490.23 29.1982 490.23 31.9463C490.23 34.6943 490.88 36.8613 492.179 38.4473C493.478 40.0195 495.248 40.8057 497.49 40.8057ZM528.129 20.9131L519.905 43H517.034L508.79 20.9131H511.641L518.429 40.1084H518.49L525.299 20.9131H528.129ZM539.183 23.0664C537.2 23.0664 535.566 23.7432 534.281 25.0967C533.01 26.4365 532.312 28.207 532.189 30.4082H545.93C545.902 28.207 545.267 26.4365 544.022 25.0967C542.792 23.7432 541.179 23.0664 539.183 23.0664ZM545.786 36.7451H548.473C548.145 38.6455 547.14 40.2041 545.458 41.4209C543.79 42.6377 541.767 43.2461 539.388 43.2461C536.325 43.2461 533.892 42.2412 532.087 40.2314C530.282 38.208 529.38 35.4668 529.38 32.0078C529.38 28.5762 530.275 25.8281 532.066 23.7637C533.871 21.6992 536.257 20.667 539.224 20.667C542.122 20.667 544.433 21.6445 546.155 23.5996C547.892 25.541 548.76 28.1523 548.76 31.4336V32.623H532.189V32.7666C532.189 35.2549 532.846 37.2236 534.158 38.6729C535.484 40.1221 537.248 40.8467 539.449 40.8467C541.076 40.8467 542.457 40.4707 543.592 39.7188C544.727 38.9668 545.458 37.9756 545.786 36.7451ZM560.9 43.2461C558.125 43.2461 555.855 42.207 554.092 40.1289C552.328 38.0371 551.446 35.3096 551.446 31.9463C551.446 28.5967 552.321 25.8828 554.071 23.8047C555.821 21.7129 558.077 20.667 560.839 20.667C562.589 20.667 564.141 21.1045 565.494 21.9795C566.848 22.8408 567.825 23.9961 568.427 25.4453H568.488V12.1152H571.216V43H568.632V38.3037H568.57C567.928 39.8213 566.93 41.0244 565.576 41.9131C564.223 42.8018 562.664 43.2461 560.9 43.2461ZM566.499 25.5684C565.173 23.9141 563.45 23.0869 561.331 23.0869C559.212 23.0869 557.496 23.9004 556.184 25.5273C554.871 27.1543 554.215 29.2939 554.215 31.9463C554.215 34.5986 554.871 36.7383 556.184 38.3652C557.496 39.9922 559.212 40.8057 561.331 40.8057C563.45 40.8057 565.173 39.9854 566.499 38.3447C567.839 36.7041 568.509 34.5713 568.509 31.9463C568.509 29.335 567.839 27.209 566.499 25.5684Z" fill="#74C318"/>
</svg>
