<svg width="54" height="54" viewBox="0 0 54 54" fill="none" xmlns="http://www.w3.org/2000/svg">
<g filter="url(#filter0_d)">
<circle cx="27" cy="27" r="23" fill="white"/>
</g>
<path d="M17.4907 32.0476C17.5432 32.119 17.6005 32.1693 17.6627 32.1985C17.7248 32.2277 17.7945 32.2423 17.8716 32.2423C18.0238 32.2423 18.1406 32.1877 18.222 32.0785C18.3034 31.9692 18.3441 31.8135 18.3441 31.6112C18.3441 31.5041 18.3345 31.4122 18.3152 31.3354C18.297 31.2586 18.2702 31.1959 18.2348 31.1472C18.1995 31.0974 18.1561 31.0612 18.1047 31.0385C18.0532 31.0158 17.9948 31.0044 17.9295 31.0044C17.8363 31.0044 17.7543 31.0261 17.6836 31.0693C17.6139 31.1126 17.5496 31.1737 17.4907 31.2527V32.0476ZM17.4762 31.0547C17.5448 30.9693 17.6241 30.9006 17.7141 30.8487C17.8041 30.7968 17.907 30.7708 18.0227 30.7708C18.117 30.7708 18.2022 30.7892 18.2782 30.826C18.3543 30.8617 18.4191 30.9152 18.4727 30.9866C18.5263 31.0569 18.5675 31.1445 18.5965 31.2494C18.6254 31.3543 18.6399 31.4749 18.6399 31.6112C18.6399 31.7323 18.6238 31.8454 18.5916 31.9503C18.5595 32.0541 18.5129 32.1444 18.4518 32.2212C18.3918 32.297 18.3179 32.357 18.23 32.4013C18.1432 32.4446 18.0452 32.4662 17.9359 32.4662C17.8363 32.4662 17.7505 32.4495 17.6788 32.4159C17.608 32.3813 17.5454 32.3337 17.4907 32.2732V33H17.203V30.8H17.375C17.4157 30.8 17.4409 30.82 17.4505 30.86L17.4762 31.0547Z" fill="#1675EC"/>
<path d="M19.6911 30.774C19.81 30.774 19.9172 30.7941 20.0125 30.8341C20.1079 30.8741 20.1893 30.9309 20.2568 31.0044C20.3243 31.078 20.3758 31.1672 20.4111 31.2721C20.4476 31.376 20.4658 31.4922 20.4658 31.6209C20.4658 31.7507 20.4476 31.8676 20.4111 31.9714C20.3758 32.0752 20.3243 32.1639 20.2568 32.2375C20.1893 32.311 20.1079 32.3678 20.0125 32.4078C19.9172 32.4468 19.81 32.4662 19.6911 32.4662C19.5711 32.4662 19.4629 32.4468 19.3665 32.4078C19.2711 32.3678 19.1897 32.311 19.1222 32.2375C19.0547 32.1639 19.0027 32.0752 18.9663 31.9714C18.9309 31.8676 18.9132 31.7507 18.9132 31.6209C18.9132 31.4922 18.9309 31.376 18.9663 31.2721C19.0027 31.1672 19.0547 31.078 19.1222 31.0044C19.1897 30.9309 19.2711 30.8741 19.3665 30.8341C19.4629 30.7941 19.5711 30.774 19.6911 30.774ZM19.6911 32.2407C19.8518 32.2407 19.9718 32.1866 20.0511 32.0785C20.1304 31.9692 20.1701 31.8173 20.1701 31.6226C20.1701 31.4268 20.1304 31.2743 20.0511 31.165C19.9718 31.0558 19.8518 31.0012 19.6911 31.0012C19.6097 31.0012 19.5384 31.0152 19.4774 31.0434C19.4174 31.0715 19.367 31.112 19.3263 31.165C19.2866 31.218 19.2566 31.2835 19.2363 31.3614C19.217 31.4382 19.2073 31.5252 19.2073 31.6226C19.2073 31.8173 19.247 31.9692 19.3263 32.0785C19.4066 32.1866 19.5282 32.2407 19.6911 32.2407Z" fill="#1675EC"/>
<path d="M23.0488 30.8L22.5216 32.4435H22.295C22.2671 32.4435 22.2478 32.4251 22.2371 32.3883L21.8771 31.2737C21.8685 31.2489 21.8616 31.224 21.8562 31.1991C21.8509 31.1732 21.8455 31.1477 21.8401 31.1229C21.8348 31.1477 21.8294 31.1732 21.8241 31.1991C21.8187 31.224 21.8118 31.2494 21.8032 31.2754L21.4367 32.3883C21.4271 32.4251 21.4057 32.4435 21.3725 32.4435H21.1571L20.6299 30.8H20.8549C20.8774 30.8 20.8962 30.8059 20.9112 30.8178C20.9273 30.8297 20.938 30.8438 20.9433 30.86L21.2551 31.9178C21.2733 31.9957 21.2878 32.0693 21.2985 32.1385C21.3082 32.1028 21.3178 32.0666 21.3275 32.0298C21.3382 31.993 21.3494 31.9557 21.3612 31.9178L21.7051 30.8535C21.7105 30.8373 21.7196 30.8238 21.7325 30.813C21.7464 30.8022 21.763 30.7968 21.7823 30.7968H21.9077C21.9291 30.7968 21.9468 30.8022 21.9607 30.813C21.9746 30.8238 21.9843 30.8373 21.9896 30.8535L22.3255 31.9178C22.3373 31.9557 22.348 31.993 22.3577 32.0298C22.3673 32.0666 22.3764 32.1028 22.385 32.1385C22.3903 32.1028 22.3968 32.0671 22.4043 32.0314C22.4128 31.9946 22.422 31.9568 22.4316 31.9178L22.7498 30.86C22.7552 30.8427 22.7654 30.8287 22.7804 30.8178C22.7954 30.8059 22.813 30.8 22.8334 30.8H23.0488Z" fill="#1675EC"/>
<path d="M24.395 31.4425C24.395 31.3754 24.3854 31.3143 24.3661 31.2591C24.3479 31.2029 24.3205 31.1548 24.2841 31.1147C24.2488 31.0736 24.2054 31.0423 24.1539 31.0206C24.1025 30.9979 24.0441 30.9866 23.9787 30.9866C23.8416 30.9866 23.7328 31.0271 23.6525 31.1083C23.5732 31.1883 23.5239 31.2997 23.5046 31.4425H24.395ZM24.6264 32.2131C24.5911 32.2564 24.5488 32.2942 24.4995 32.3267C24.4502 32.3581 24.3971 32.384 24.3404 32.4046C24.2846 32.4251 24.2268 32.4403 24.1668 32.45C24.1068 32.4608 24.0473 32.4662 23.9884 32.4662C23.8759 32.4662 23.7719 32.4473 23.6766 32.4094C23.5823 32.3705 23.5003 32.3143 23.4307 32.2407C23.3621 32.1661 23.3085 32.0741 23.27 31.9649C23.2314 31.8557 23.2121 31.7302 23.2121 31.5885C23.2121 31.4738 23.2293 31.3668 23.2635 31.2673C23.2989 31.1677 23.3493 31.0818 23.4146 31.0093C23.48 30.9357 23.5598 30.8784 23.6541 30.8373C23.7484 30.7951 23.8545 30.774 23.9723 30.774C24.0698 30.774 24.1598 30.7908 24.2423 30.8243C24.3259 30.8568 24.3977 30.9044 24.4577 30.9671C24.5188 31.0288 24.5664 31.1056 24.6007 31.1975C24.635 31.2883 24.6522 31.3922 24.6522 31.509C24.6522 31.5544 24.6473 31.5847 24.6377 31.5999C24.628 31.615 24.6098 31.6226 24.583 31.6226H23.495C23.4982 31.7264 23.5121 31.8167 23.5368 31.8935C23.5625 31.9703 23.5978 32.0347 23.6428 32.0866C23.6878 32.1374 23.7414 32.1758 23.8036 32.2018C23.8657 32.2266 23.9353 32.2391 24.0125 32.2391C24.0843 32.2391 24.1459 32.231 24.1973 32.2147C24.2498 32.1974 24.2948 32.1791 24.3323 32.1596C24.3698 32.1401 24.4009 32.1223 24.4255 32.106C24.4513 32.0887 24.4732 32.0801 24.4914 32.0801C24.515 32.0801 24.5332 32.0893 24.5461 32.1077L24.6264 32.2131Z" fill="#1675EC"/>
<path d="M25.2752 31.1294C25.3266 31.0169 25.3898 30.9293 25.4648 30.8665C25.5398 30.8027 25.6314 30.7708 25.7396 30.7708C25.7739 30.7708 25.8066 30.7746 25.8377 30.7822C25.8698 30.7897 25.8982 30.8016 25.9229 30.8178L25.902 31.0336C25.8955 31.0607 25.8795 31.0742 25.8538 31.0742C25.8388 31.0742 25.8168 31.0709 25.7879 31.0645C25.7589 31.058 25.7263 31.0547 25.6898 31.0547C25.6384 31.0547 25.5923 31.0623 25.5516 31.0774C25.512 31.0926 25.4761 31.1153 25.4439 31.1456C25.4128 31.1748 25.3845 31.2116 25.3587 31.2559C25.3341 31.2992 25.3116 31.3489 25.2912 31.4052V32.4435H25.0036V30.8H25.1675C25.1986 30.8 25.22 30.8059 25.2318 30.8178C25.2436 30.8297 25.2516 30.8503 25.2559 30.8795L25.2752 31.1294Z" fill="#1675EC"/>
<path d="M27.1982 31.4425C27.1982 31.3754 27.1885 31.3143 27.1692 31.2591C27.151 31.2029 27.1237 31.1548 27.0873 31.1147C27.0519 31.0736 27.0085 31.0423 26.9571 31.0206C26.9057 30.9979 26.8473 30.9866 26.7819 30.9866C26.6448 30.9866 26.536 31.0271 26.4556 31.1083C26.3764 31.1883 26.3271 31.2997 26.3078 31.4425H27.1982ZM27.4296 32.2131C27.3942 32.2564 27.3519 32.2942 27.3026 32.3267C27.2534 32.3581 27.2003 32.384 27.1435 32.4046C27.0878 32.4251 27.03 32.4403 26.9699 32.45C26.9099 32.4608 26.8505 32.4662 26.7916 32.4662C26.679 32.4662 26.5751 32.4473 26.4798 32.4094C26.3855 32.3705 26.3035 32.3143 26.2339 32.2407C26.1653 32.1661 26.1117 32.0741 26.0731 31.9649C26.0346 31.8557 26.0153 31.7302 26.0153 31.5885C26.0153 31.4738 26.0324 31.3668 26.0667 31.2673C26.1021 31.1677 26.1524 31.0818 26.2178 31.0093C26.2831 30.9357 26.363 30.8784 26.4573 30.8373C26.5515 30.7951 26.6576 30.774 26.7755 30.774C26.873 30.774 26.963 30.7908 27.0455 30.8243C27.1291 30.8568 27.2008 30.9044 27.2609 30.9671C27.3219 31.0288 27.3696 31.1056 27.4039 31.1975C27.4382 31.2883 27.4553 31.3922 27.4553 31.509C27.4553 31.5544 27.4505 31.5847 27.4409 31.5999C27.4312 31.615 27.413 31.6226 27.3862 31.6226H26.2981C26.3014 31.7264 26.3153 31.8167 26.3399 31.8935C26.3656 31.9703 26.401 32.0347 26.446 32.0866C26.491 32.1374 26.5446 32.1758 26.6067 32.2018C26.6689 32.2266 26.7385 32.2391 26.8157 32.2391C26.8874 32.2391 26.9491 32.231 27.0005 32.2147C27.053 32.1974 27.098 32.1791 27.1355 32.1596C27.173 32.1401 27.2041 32.1223 27.2287 32.106C27.2544 32.0887 27.2764 32.0801 27.2946 32.0801C27.3182 32.0801 27.3364 32.0893 27.3492 32.1077L27.4296 32.2131Z" fill="#1675EC"/>
<path d="M28.8675 31.191C28.8139 31.1185 28.756 31.0682 28.6939 31.0401C28.6317 31.0109 28.5621 30.9963 28.485 30.9963C28.3339 30.9963 28.2176 31.0509 28.1362 31.1602C28.0548 31.2694 28.014 31.4252 28.014 31.6274C28.014 31.7345 28.0232 31.8265 28.0414 31.9032C28.0596 31.979 28.0864 32.0417 28.1217 32.0914C28.1571 32.1401 28.2005 32.1758 28.2519 32.1985C28.3033 32.2212 28.3617 32.2326 28.4271 32.2326C28.5214 32.2326 28.6033 32.211 28.673 32.1677C28.7437 32.1244 28.8085 32.0633 28.8675 31.9844V31.191ZM29.1535 30.0537V32.4435H28.9832C28.9425 32.4435 28.9168 32.4235 28.906 32.3835L28.8803 32.1839C28.8107 32.2683 28.7314 32.3364 28.6425 32.3883C28.5535 32.4403 28.4507 32.4662 28.3339 32.4662C28.2407 32.4662 28.156 32.4484 28.0799 32.4127C28.0039 32.3759 27.939 32.3224 27.8855 32.2521C27.8319 32.1818 27.7906 32.0941 27.7617 31.9892C27.7328 31.8843 27.7183 31.7637 27.7183 31.6274C27.7183 31.5063 27.7344 31.3938 27.7665 31.29C27.7987 31.1851 27.8448 31.0942 27.9048 31.0174C27.9648 30.9406 28.0382 30.8806 28.1249 30.8373C28.2128 30.793 28.3114 30.7708 28.4207 30.7708C28.5203 30.7708 28.6055 30.7881 28.6762 30.8227C28.748 30.8562 28.8117 30.9033 28.8675 30.9639V30.0537H29.1535Z" fill="#1675EC"/>
<path d="M30.7155 32.0476C30.768 32.119 30.8253 32.1693 30.8875 32.1985C30.9507 32.2277 31.0198 32.2423 31.0948 32.2423C31.248 32.2423 31.3653 32.1877 31.4468 32.0785C31.5282 31.9692 31.5689 31.8064 31.5689 31.5901C31.5689 31.3889 31.5325 31.2413 31.4596 31.1472C31.3878 31.052 31.285 31.0044 31.1511 31.0044C31.0578 31.0044 30.9764 31.0261 30.9068 31.0693C30.8382 31.1126 30.7744 31.1737 30.7155 31.2527V32.0476ZM30.7155 31.0369C30.7841 30.9568 30.8612 30.893 30.9469 30.8454C31.0337 30.7978 31.1334 30.774 31.2459 30.774C31.3412 30.774 31.427 30.7924 31.503 30.8292C31.5802 30.866 31.6455 30.9195 31.6991 30.9898C31.7527 31.059 31.7934 31.1434 31.8213 31.2429C31.8502 31.3424 31.8646 31.4544 31.8646 31.5788C31.8646 31.7118 31.8486 31.8329 31.8164 31.9422C31.7843 32.0514 31.7377 32.145 31.6766 32.2229C31.6166 32.2997 31.5432 32.3597 31.4564 32.403C31.3696 32.4451 31.2721 32.4662 31.1639 32.4662C31.0568 32.4662 30.9662 32.4462 30.8923 32.4062C30.8194 32.3651 30.7557 32.3072 30.701 32.2326L30.6866 32.3819C30.678 32.423 30.6534 32.4435 30.6126 32.4435H30.4278V30.0537H30.7155V31.0369Z" fill="#1675EC"/>
<path d="M33.5904 30.8L32.6823 32.9286C32.6727 32.9502 32.6603 32.9676 32.6453 32.9805C32.6314 32.9935 32.6094 33 32.5794 33H32.3673L32.6646 32.3478L31.9928 30.8H32.2403C32.265 30.8 32.2843 30.8065 32.2982 30.8195C32.3132 30.8314 32.3234 30.8449 32.3287 30.86L32.7643 31.8951C32.7814 31.9406 32.7959 31.9882 32.8077 32.0379C32.8227 31.9871 32.8387 31.9389 32.8559 31.8935L33.2786 30.86C33.285 30.8427 33.2957 30.8287 33.3107 30.8178C33.3268 30.8059 33.3445 30.8 33.3638 30.8H33.5904Z" fill="#1675EC"/>
<path d="M35.9608 31.7626C35.9608 31.6616 35.9255 31.5844 35.8548 31.5309C35.7842 31.4762 35.6571 31.4192 35.4734 31.3598C35.2898 31.2992 35.1444 31.2398 35.0373 31.1815C34.7454 31.0223 34.5994 30.8078 34.5994 30.5381C34.5994 30.3979 34.6382 30.2731 34.7159 30.1638C34.7948 30.0533 34.9072 29.9671 35.0532 29.9053C35.2003 29.8435 35.3651 29.8126 35.5476 29.8126C35.7312 29.8126 35.8948 29.8465 36.0385 29.9142C36.1821 29.9808 36.2933 30.0752 36.3722 30.1976C36.4522 30.32 36.4922 30.4591 36.4922 30.6147H35.9625C35.9625 30.4959 35.9254 30.4038 35.8513 30.3384C35.7771 30.2719 35.673 30.2386 35.5388 30.2386C35.4093 30.2386 35.3086 30.2666 35.2368 30.3224C35.165 30.3771 35.1291 30.4496 35.1291 30.5399C35.1291 30.6242 35.1709 30.6949 35.2545 30.752C35.3392 30.809 35.4634 30.8625 35.627 30.9124C35.9284 31.0039 36.1479 31.1174 36.2857 31.2528C36.4234 31.3883 36.4922 31.557 36.4922 31.7591C36.4922 31.9836 36.4081 32.1601 36.2397 32.2884C36.0714 32.4156 35.8448 32.4792 35.5599 32.4792C35.3622 32.4792 35.1821 32.4429 35.0196 32.3704C34.8572 32.2968 34.733 32.1963 34.6471 32.0692C34.5623 31.942 34.5199 31.7947 34.5199 31.6272H35.0514C35.0514 31.9135 35.2209 32.0567 35.5599 32.0567C35.6859 32.0567 35.7842 32.0312 35.8548 31.9801C35.9255 31.9278 35.9608 31.8553 35.9608 31.7626Z" fill="#1675EC"/>
<path d="M37.3574 32.4435H36.8454V30.5149H37.3574V32.4435ZM36.8154 30.0158C36.8154 29.9386 36.8407 29.875 36.8913 29.8251C36.9431 29.7752 37.0131 29.7502 37.1014 29.7502C37.1885 29.7502 37.258 29.7752 37.3098 29.8251C37.3616 29.875 37.3875 29.9386 37.3875 30.0158C37.3875 30.0943 37.361 30.1584 37.308 30.2083C37.2562 30.2582 37.1873 30.2832 37.1014 30.2832C37.0155 30.2832 36.946 30.2582 36.8931 30.2083C36.8413 30.1584 36.8154 30.0943 36.8154 30.0158Z" fill="#1675EC"/>
<path d="M38.853 30.9979C38.7835 30.9884 38.7223 30.9837 38.6694 30.9837C38.4763 30.9837 38.3498 31.0496 38.2897 31.1815V32.4435H37.7794V30.5149H38.2615L38.2756 30.7448C38.378 30.5678 38.5199 30.4793 38.7012 30.4793C38.7577 30.4793 38.8106 30.487 38.8601 30.5024L38.853 30.9979Z" fill="#1675EC"/>
<path d="M39.6387 32.4435H39.1267V30.5149H39.6387V32.4435ZM39.0967 30.0158C39.0967 29.9386 39.122 29.875 39.1726 29.8251C39.2244 29.7752 39.2944 29.7502 39.3827 29.7502C39.4698 29.7502 39.5393 29.7752 39.5911 29.8251C39.6429 29.875 39.6688 29.9386 39.6688 30.0158C39.6688 30.0943 39.6423 30.1584 39.5893 30.2083C39.5375 30.2582 39.4686 30.2832 39.3827 30.2832C39.2968 30.2832 39.2273 30.2582 39.1744 30.2083C39.1226 30.1584 39.0967 30.0943 39.0967 30.0158Z" fill="#1675EC"/>
<path d="M41.2049 32.2474C41.079 32.4019 40.9048 32.4792 40.6823 32.4792C40.4775 32.4792 40.3209 32.4197 40.2126 32.3009C40.1055 32.1821 40.0507 32.008 40.0484 31.7787V30.5149H40.5587V31.7608C40.5587 31.9617 40.6493 32.0621 40.8306 32.0621C41.0036 32.0621 41.1225 32.0015 41.1873 31.8803V30.5149H41.6993V32.4435H41.2191L41.2049 32.2474Z" fill="#1675EC"/>
<path d="M43.119 31.9106C43.119 31.8476 43.0878 31.7983 43.0254 31.7626C42.9642 31.7258 42.8653 31.6931 42.7287 31.6646C42.2744 31.5683 42.0472 31.3735 42.0472 31.0799C42.0472 30.9088 42.1172 30.7662 42.2573 30.6522C42.3986 30.5369 42.5828 30.4793 42.81 30.4793C43.0525 30.4793 43.2461 30.5369 43.3909 30.6522C43.5368 30.7674 43.6098 30.9171 43.6098 31.1013H43.0995C43.0995 31.0277 43.076 30.9671 43.0289 30.9195C42.9818 30.8708 42.9083 30.8464 42.8082 30.8464C42.7223 30.8464 42.6558 30.866 42.6087 30.9053C42.5616 30.9445 42.538 30.9944 42.538 31.055C42.538 31.112 42.5645 31.1584 42.6175 31.194C42.6716 31.2285 42.7623 31.2588 42.8894 31.2849C43.0166 31.3099 43.1237 31.3384 43.2108 31.3705C43.4803 31.4703 43.6151 31.6432 43.6151 31.8892C43.6151 32.065 43.5404 32.2076 43.3909 32.317C43.2414 32.4251 43.0483 32.4792 42.8117 32.4792C42.6516 32.4792 42.5092 32.4506 42.3844 32.3936C42.2608 32.3354 42.1637 32.2564 42.0931 32.1565C42.0225 32.0555 41.9871 31.9468 41.9871 31.8304H42.4709C42.4757 31.9218 42.5092 31.992 42.5716 32.0407C42.634 32.0894 42.7176 32.1138 42.8223 32.1138C42.92 32.1138 42.9936 32.0953 43.043 32.0585C43.0937 32.0205 43.119 31.9712 43.119 31.9106Z" fill="#1675EC"/>
<path d="M44.5421 32.4435H44.0124V29.8483H44.5421V32.4435Z" fill="#1675EC"/>
<path d="M45.0348 32.4435V29.8483H45.8258C46.0518 29.8483 46.2537 29.9 46.4314 30.0033C46.6104 30.1055 46.7499 30.2517 46.8499 30.4418C46.95 30.6308 47 30.8458 47 31.0871V31.2065C47 31.4477 46.9506 31.6622 46.8517 31.85C46.754 32.0377 46.6157 32.1833 46.4367 32.2867C46.2578 32.39 46.0559 32.4423 45.8311 32.4435H45.0348ZM45.5645 30.2814V32.0139H45.8205C46.0277 32.0139 46.186 31.9456 46.2955 31.809C46.405 31.6723 46.4609 31.4768 46.4632 31.2225V31.0853C46.4632 30.8215 46.4091 30.6219 46.3008 30.4864C46.1925 30.3497 46.0342 30.2814 45.8258 30.2814H45.5645Z" fill="#1675EC"/>
<path d="M10.0893 23.8236C10.1708 23.8236 10.2115 23.975 10.2115 24.2779C10.2115 24.3687 10.2008 24.4769 10.1794 24.6024C10.1622 24.7235 10.1279 24.7841 10.0765 24.7841H9.26004V25.433H10.4429C10.5158 25.433 10.5651 25.5282 10.5908 25.7186C10.6036 25.8008 10.6101 25.8895 10.6101 25.9847C10.6101 26.0755 10.5972 26.1945 10.5715 26.3416C10.5458 26.4887 10.5029 26.5622 10.4429 26.5622H8.24429C8.08143 26.5622 8 26.4952 8 26.3611V22.1882C8 22.0757 8.04929 22.0195 8.14786 22.0195H10.4494C10.5394 22.0195 10.5844 22.212 10.5844 22.5971C10.5844 22.9778 10.5394 23.1681 10.4494 23.1681H9.26004V23.8236H10.0893Z" fill="#1675EC"/>
<path d="M14.0505 26.5298C14.0505 26.5601 13.8662 26.5752 13.4976 26.5752C13.1334 26.5752 12.9512 26.5558 12.9512 26.5168V24.6283C12.9512 24.412 12.8805 24.3038 12.7391 24.3038C12.6662 24.3038 12.5698 24.3514 12.4498 24.4466V26.5233C12.4498 26.5666 12.2655 26.5882 11.8969 26.5882C11.5326 26.5882 11.3504 26.5644 11.3504 26.5168V24.3947H11.1897C11.0483 24.3947 10.9776 24.2454 10.9776 23.9469C10.9776 23.8128 11.0033 23.6765 11.0547 23.5381C11.1233 23.3477 11.2347 23.2525 11.389 23.2525C11.5433 23.2525 11.6912 23.2936 11.8326 23.3758C11.9783 23.458 12.0662 23.5359 12.0962 23.6094C12.3619 23.3715 12.6555 23.2525 12.9769 23.2525C13.3026 23.2525 13.5641 23.3542 13.7612 23.5575C13.9927 23.3542 14.2712 23.2525 14.597 23.2525C15.3041 23.2525 15.6577 23.6873 15.6577 24.5569V26.5298C15.6577 26.5601 15.4734 26.5752 15.1048 26.5752C14.7405 26.5752 14.5584 26.5558 14.5584 26.5168V24.6283C14.5584 24.412 14.4877 24.3038 14.3462 24.3038C14.2691 24.3038 14.1705 24.3514 14.0505 24.4466V26.5298Z" fill="#1675EC"/>
<path d="M17.5869 27.7434C17.5869 27.7736 17.4026 27.7888 17.034 27.7888C16.6697 27.7888 16.4876 27.7736 16.4876 27.7434V24.4012H16.269C16.1661 24.4012 16.0954 24.306 16.0568 24.1156C16.044 24.0551 16.0376 23.9772 16.0376 23.882C16.0376 23.7868 16.0676 23.6743 16.1276 23.5445C16.2133 23.3542 16.3504 23.259 16.539 23.259C16.6633 23.259 16.7769 23.2893 16.8797 23.3499C16.9869 23.4061 17.0597 23.4602 17.0983 23.5121C17.1412 23.5597 17.1626 23.5878 17.1626 23.5965C17.4497 23.3715 17.7605 23.259 18.0948 23.259C18.4291 23.259 18.7162 23.391 18.9562 23.6549C19.1962 23.9145 19.3162 24.319 19.3162 24.8684C19.3162 25.4136 19.1962 25.8376 18.9562 26.1404C18.7162 26.4389 18.4119 26.5882 18.0433 26.5882C17.8762 26.5882 17.724 26.5795 17.5869 26.5622V27.7434ZM17.8505 24.3947C17.7776 24.3947 17.7069 24.4185 17.6383 24.4661V25.6147C17.7112 25.6234 17.769 25.6277 17.8119 25.6277C17.859 25.6277 17.8955 25.6277 17.9212 25.6277C18.0969 25.6104 18.1848 25.3833 18.1848 24.9463C18.1848 24.5786 18.0733 24.3947 17.8505 24.3947Z" fill="#1675EC"/>
<path d="M20.9407 26.5103C20.9407 26.5493 20.7221 26.5687 20.285 26.5687C19.9421 26.5644 19.7707 26.5471 19.7707 26.5168V22.0973C19.7707 22.0324 19.9785 22 20.3943 22C20.7586 22.013 20.9407 22.0346 20.9407 22.0649V26.5103Z" fill="#1675EC"/>
<path d="M21.7987 26.1794C21.533 25.8808 21.4001 25.4676 21.4001 24.9398C21.4001 24.412 21.533 23.9988 21.7987 23.7003C22.0687 23.4018 22.4309 23.2525 22.8851 23.2525C23.3394 23.2525 23.6995 23.4018 23.9652 23.7003C24.2309 23.9988 24.3638 24.412 24.3638 24.9398C24.3638 25.4676 24.2309 25.8808 23.9652 26.1794C23.6995 26.4779 23.3394 26.6271 22.8851 26.6271C22.4309 26.6271 22.0687 26.4779 21.7987 26.1794ZM22.8851 24.3363C22.6451 24.3363 22.5251 24.5353 22.5251 24.9333C22.5251 25.3314 22.6451 25.5304 22.8851 25.5304C23.1294 25.5304 23.2516 25.3314 23.2516 24.9333C23.2516 24.5353 23.1294 24.3363 22.8851 24.3363Z" fill="#1675EC"/>
<path d="M24.5932 23.3499C24.5932 23.3023 24.7882 23.2785 25.1783 23.2785C25.5726 23.2785 25.7761 23.3001 25.789 23.3434L26.2519 24.8749L26.6954 23.3304C26.7126 23.2958 26.8455 23.2785 27.094 23.2785C27.664 23.2785 27.9362 23.3066 27.9105 23.3628L26.3997 27.7044C26.3954 27.7304 26.2776 27.7434 26.0461 27.7434C25.819 27.7434 25.6068 27.7347 25.4097 27.7174C25.2125 27.7044 25.1183 27.6871 25.1268 27.6655L25.6861 26.3027L24.5932 23.3499Z" fill="#1675EC"/>
<path d="M28.7276 25.446V23.1357H28.2712C28.1983 23.1357 28.1469 23.0427 28.1169 22.8566C28.104 22.7658 28.0976 22.6728 28.0976 22.5776C28.0976 22.4824 28.104 22.3894 28.1169 22.2985C28.1469 22.1125 28.1983 22.0195 28.2712 22.0195H30.4313C30.5041 22.0195 30.5534 22.1125 30.5791 22.2985C30.5963 22.3894 30.6048 22.4824 30.6048 22.5776C30.6048 22.6728 30.5963 22.7658 30.5791 22.8566C30.5534 23.0427 30.5041 23.1357 30.4313 23.1357H30.0005V25.446H30.4505C30.5234 25.446 30.5748 25.539 30.6048 25.7251C30.622 25.8159 30.6306 25.9089 30.6306 26.0041C30.6306 26.0993 30.622 26.1923 30.6048 26.2832C30.5748 26.4692 30.5234 26.5622 30.4505 26.5622H28.2841C28.2112 26.5622 28.1619 26.4692 28.1362 26.2832C28.119 26.1923 28.1105 26.0993 28.1105 26.0041C28.1105 25.9089 28.119 25.8159 28.1362 25.7251C28.1619 25.539 28.2112 25.446 28.2841 25.446H28.7276Z" fill="#1675EC"/>
<path d="M31.0594 26.2637V22.3699C31.0594 22.2618 31.0851 22.1774 31.1366 22.1168C31.1923 22.0519 31.263 22.0195 31.3487 22.0195H32.4223C33.1038 22.0195 33.6202 22.1925 33.9717 22.5386C34.3274 22.8848 34.5052 23.4299 34.5052 24.174C34.5052 25.7662 33.8324 26.5622 32.4866 26.5622H31.3873C31.1687 26.5622 31.0594 26.4627 31.0594 26.2637ZM32.2937 23.2525V25.1929C32.2937 25.2838 32.3002 25.3422 32.313 25.3681C32.3259 25.3898 32.3645 25.4006 32.4287 25.4006C32.6645 25.4006 32.8423 25.3119 32.9623 25.1345C33.0866 24.9571 33.1488 24.6629 33.1488 24.2519C33.1488 23.8366 33.0845 23.5662 32.9559 23.4407C32.8316 23.3152 32.6323 23.2525 32.358 23.2525H32.2937Z" fill="#1675EC"/>
<path d="M36.0431 26.5817C36.0431 26.612 35.8395 26.6271 35.4323 26.6271C35.0295 26.6271 34.828 26.6142 34.828 26.5882V25.4201C34.828 25.3811 35.0295 25.3617 35.4323 25.3617C35.8395 25.3617 36.0431 25.3725 36.0431 25.3941V26.5817Z" fill="#1675EC"/>
<path d="M37.5121 24.9528C37.5121 25.3768 37.6707 25.5888 37.9879 25.5888C38.1936 25.5888 38.365 25.5477 38.5022 25.4655C38.5665 25.4655 38.6179 25.578 38.6565 25.8029C38.6993 26.0236 38.7208 26.175 38.7208 26.2572C38.7208 26.3351 38.71 26.387 38.6886 26.413C38.4615 26.5558 38.1507 26.6271 37.7564 26.6271C37.3621 26.6271 37.0257 26.48 36.7471 26.1858C36.4728 25.8873 36.3357 25.4828 36.3357 24.9723C36.3357 24.4574 36.4707 24.0421 36.7407 23.7263C37.015 23.4104 37.3771 23.2525 37.8272 23.2525C38.2815 23.2525 38.5965 23.3628 38.7722 23.5835C38.8108 23.6311 38.83 23.7025 38.83 23.7976C38.83 23.8885 38.8129 24.001 38.7786 24.1351C38.7015 24.412 38.6007 24.5721 38.4765 24.6153C38.4593 24.6197 38.4336 24.6218 38.3993 24.6218C38.3693 24.6218 38.3307 24.5959 38.2836 24.544C38.1164 24.3752 37.9814 24.2909 37.8786 24.2909C37.78 24.2909 37.6943 24.3428 37.6214 24.4466C37.5486 24.5504 37.5121 24.7192 37.5121 24.9528Z" fill="#1675EC"/>
<path d="M39.459 26.1794C39.1932 25.8808 39.0604 25.4676 39.0604 24.9398C39.0604 24.412 39.1932 23.9988 39.459 23.7003C39.729 23.4018 40.0911 23.2525 40.5454 23.2525C40.9997 23.2525 41.3597 23.4018 41.6254 23.7003C41.8912 23.9988 42.024 24.412 42.024 24.9398C42.024 25.4676 41.8912 25.8808 41.6254 26.1794C41.3597 26.4779 40.9997 26.6271 40.5454 26.6271C40.0911 26.6271 39.729 26.4779 39.459 26.1794ZM40.5454 24.3363C40.3054 24.3363 40.1854 24.5353 40.1854 24.9333C40.1854 25.3314 40.3054 25.5304 40.5454 25.5304C40.7897 25.5304 40.9119 25.3314 40.9119 24.9333C40.9119 24.5353 40.7897 24.3363 40.5454 24.3363Z" fill="#1675EC"/>
<path d="M45.3907 26.5298C45.3907 26.5601 45.2065 26.5752 44.8379 26.5752C44.4736 26.5752 44.2914 26.5558 44.2914 26.5168V24.6283C44.2914 24.412 44.2207 24.3038 44.0793 24.3038C44.0064 24.3038 43.91 24.3514 43.79 24.4466V26.5233C43.79 26.5666 43.6057 26.5882 43.2371 26.5882C42.8728 26.5882 42.6907 26.5644 42.6907 26.5168V24.3947H42.5299C42.3885 24.3947 42.3178 24.2454 42.3178 23.9469C42.3178 23.8128 42.3435 23.6765 42.3949 23.5381C42.4635 23.3477 42.5749 23.2525 42.7292 23.2525C42.8835 23.2525 43.0314 23.2936 43.1728 23.3758C43.3185 23.458 43.4064 23.5359 43.4364 23.6094C43.7021 23.3715 43.9957 23.2525 44.3171 23.2525C44.6429 23.2525 44.9043 23.3542 45.1014 23.5575C45.3329 23.3542 45.6115 23.2525 45.9372 23.2525C46.6444 23.2525 46.9979 23.6873 46.9979 24.5569V26.5298C46.9979 26.5601 46.8136 26.5752 46.4451 26.5752C46.0808 26.5752 45.8986 26.5558 45.8986 26.5168V24.6283C45.8986 24.412 45.8279 24.3038 45.6865 24.3038C45.6093 24.3038 45.5107 24.3514 45.3907 24.4466V26.5298Z" fill="#1675EC"/>
<defs>
<filter id="filter0_d" x="0" y="0" width="54" height="54" filterUnits="userSpaceOnUse" color-interpolation-filters="sRGB">
<feFlood flood-opacity="0" result="BackgroundImageFix"/>
<feColorMatrix in="SourceAlpha" type="matrix" values="0 0 0 0 0 0 0 0 0 0 0 0 0 0 0 0 0 0 127 0"/>
<feOffset/>
<feGaussianBlur stdDeviation="2"/>
<feColorMatrix type="matrix" values="0 0 0 0 0 0 0 0 0 0.545098 0 0 0 0 0.862745 0 0 0 1 0"/>
<feBlend mode="normal" in2="BackgroundImageFix" result="effect1_dropShadow"/>
<feBlend mode="normal" in="SourceGraphic" in2="effect1_dropShadow" result="shape"/>
</filter>
</defs>
</svg>
