{
  "packages": {
    "NetworkManager": {
      "evra": "1:1.50.3-1.fc41.x86_64",
      "metadata": {
        "sourcerpm": "NetworkManager"
      }
    },
    "NetworkManager-cloud-setup": {
      "evra": "1:1.50.3-1.fc41.x86_64",
      "metadata": {
        "sourcerpm": "NetworkManager"
      }
    },
    "NetworkManager-libnm": {
      "evra": "1:1.50.3-1.fc41.x86_64",
      "metadata": {
        "sourcerpm": "NetworkManager"
      }
    },
    "NetworkManager-team": {
      "evra": "1:1.50.3-1.fc41.x86_64",
      "metadata": {
        "sourcerpm": "NetworkManager"
      }
    },
    "NetworkManager-tui": {
      "evra": "1:1.50.3-1.fc41.x86_64",
      "metadata": {
        "sourcerpm": "NetworkManager"
      }
    },
    "WALinuxAgent-udev": {
      "evra": "2.12.0.4-1.fc41.noarch",
      "metadata": {
        "sourcerpm": "WALinuxAgent"
      }
    },
    "aardvark-dns": {
      "evra": "2:1.14.0-1.fc41.x86_64",
      "metadata": {
        "sourcerpm": "aardvark-dns"
      }
    },
    "acl": {
      "evra": "2.3.2-2.fc41.x86_64",
      "metadata": {
        "sourcerpm": "acl"
      }
    },
    "adcli": {
      "evra": "0.9.2-7.fc41.x86_64",
      "metadata": {
        "sourcerpm": "adcli"
      }
    },
    "afterburn": {
      "evra": "5.7.0-3.fc41.x86_64",
      "metadata": {
        "sourcerpm": "rust-afterburn"
      }
    },
    "afterburn-dracut": {
      "evra": "5.7.0-3.fc41.x86_64",
      "metadata": {
        "sourcerpm": "rust-afterburn"
      }
    },
    "alternatives": {
      "evra": "1.31-1.fc41.x86_64",
      "metadata": {
        "sourcerpm": "chkconfig"
      }
    },
    "amd-gpu-firmware": {
      "evra": "20241210-1.fc41.noarch",
      "metadata": {
        "sourcerpm": "linux-firmware"
      }
    },
    "amd-ucode-firmware": {
      "evra": "20241210-1.fc41.noarch",
      "metadata": {
        "sourcerpm": "linux-firmware"
      }
    },
    "attr": {
      "evra": "2.5.2-4.fc41.x86_64",
      "metadata": {
        "sourcerpm": "attr"
      }
    },
    "audit": {
      "evra": "4.0.3-1.fc41.x86_64",
      "metadata": {
        "sourcerpm": "audit"
      }
    },
    "audit-libs": {
      "evra": "4.0.3-1.fc41.x86_64",
      "metadata": {
        "sourcerpm": "audit"
      }
    },
    "audit-rules": {
      "evra": "4.0.3-1.fc41.x86_64",
      "metadata": {
        "sourcerpm": "audit"
      }
    },
    "authselect": {
      "evra": "1.5.0-8.fc41.x86_64",
      "metadata": {
        "sourcerpm": "authselect"
      }
    },
    "authselect-libs": {
      "evra": "1.5.0-8.fc41.x86_64",
      "metadata": {
        "sourcerpm": "authselect"
      }
    },
    "avahi-libs": {
      "evra": "0.8-29.fc41.x86_64",
      "metadata": {
        "sourcerpm": "avahi"
      }
    },
    "azure-vm-utils": {
      "evra": "0.5.1-1.fc41.x86_64",
      "metadata": {
        "sourcerpm": "azure-vm-utils"
      }
    },
    "basesystem": {
      "evra": "11-21.fc41.noarch",
      "metadata": {
        "sourcerpm": "basesystem"
      }
    },
    "bash": {
      "evra": "5.2.32-1.fc41.x86_64",
      "metadata": {
        "sourcerpm": "bash"
      }
    },
    "bash-color-prompt": {
      "evra": "0.5-2.fc41.noarch",
      "metadata": {
        "sourcerpm": "shell-color-prompt"
      }
    },
    "bash-completion": {
      "evra": "1:2.16-1.fc41.noarch",
      "metadata": {
        "sourcerpm": "bash-completion"
      }
    },
    "bind-libs": {
      "evra": "32:9.18.33-1.fc41.x86_64",
      "metadata": {
        "sourcerpm": "bind"
      }
    },
    "bind-utils": {
      "evra": "32:9.18.33-1.fc41.x86_64",
      "metadata": {
        "sourcerpm": "bind"
      }
    },
    "bootc": {
      "evra": "1.1.5-1.fc41.x86_64",
      "metadata": {
        "sourcerpm": "bootc"
      }
    },
    "bootupd": {
      "evra": "0.2.26-1.fc41.x86_64",
      "metadata": {
        "sourcerpm": "rust-bootupd"
      }
    },
    "bsdtar": {
      "evra": "3.7.4-4.fc41.x86_64",
      "metadata": {
        "sourcerpm": "libarchive"
      }
    },
    "btrfs-progs": {
      "evra": "6.12-1.fc41.x86_64",
      "metadata": {
        "sourcerpm": "btrfs-progs"
      }
    },
    "bubblewrap": {
      "evra": "0.10.0-1.fc41.x86_64",
      "metadata": {
        "sourcerpm": "bubblewrap"
      }
    },
    "bzip2": {
      "evra": "1.0.8-19.fc41.x86_64",
      "metadata": {
        "sourcerpm": "bzip2"
      }
    },
    "bzip2-libs": {
      "evra": "1.0.8-19.fc41.x86_64",
      "metadata": {
        "sourcerpm": "bzip2"
      }
    },
    "c-ares": {
      "evra": "1.34.4-3.fc41.x86_64",
      "metadata": {
        "sourcerpm": "c-ares"
      }
    },
    "ca-certificates": {
      "evra": "2024.2.69_v8.0.401-1.0.fc41.noarch",
      "metadata": {
        "sourcerpm": "ca-certificates"
      }
    },
    "catatonit": {
      "evra": "0.2.1-1.fc41.x86_64",
      "metadata": {
        "sourcerpm": "catatonit"
      }
    },
    "chrony": {
      "evra": "4.6.1-1.fc41.x86_64",
      "metadata": {
        "sourcerpm": "chrony"
      }
    },
    "cifs-utils": {
      "evra": "7.1-2.fc41.x86_64",
      "metadata": {
        "sourcerpm": "cifs-utils"
      }
    },
    "clevis": {
      "evra": "21-8.fc41.x86_64",
      "metadata": {
        "sourcerpm": "clevis"
      }
    },
    "clevis-dracut": {
      "evra": "21-8.fc41.x86_64",
      "metadata": {
        "sourcerpm": "clevis"
      }
    },
    "clevis-luks": {
      "evra": "21-8.fc41.x86_64",
      "metadata": {
        "sourcerpm": "clevis"
      }
    },
    "clevis-pin-tpm2": {
      "evra": "0.5.3-9.fc41.x86_64",
      "metadata": {
        "sourcerpm": "clevis-pin-tpm2"
      }
    },
    "clevis-systemd": {
      "evra": "21-8.fc41.x86_64",
      "metadata": {
        "sourcerpm": "clevis"
      }
    },
    "cloud-utils-growpart": {
      "evra": "0.33-9.fc41.noarch",
      "metadata": {
        "sourcerpm": "cloud-utils"
      }
    },
    "composefs": {
      "evra": "1.0.8-1.fc41.x86_64",
      "metadata": {
        "sourcerpm": "composefs"
      }
    },
    "composefs-libs": {
      "evra": "1.0.8-1.fc41.x86_64",
      "metadata": {
        "sourcerpm": "composefs"
      }
    },
    "conmon": {
      "evra": "2:2.1.13-1.fc41.x86_64",
      "metadata": {
        "sourcerpm": "conmon"
      }
    },
    "console-login-helper-messages": {
      "evra": "0.21.3-9.fc41.noarch",
      "metadata": {
        "sourcerpm": "console-login-helper-messages"
      }
    },
    "console-login-helper-messages-issuegen": {
      "evra": "0.21.3-9.fc41.noarch",
      "metadata": {
        "sourcerpm": "console-login-helper-messages"
      }
    },
    "console-login-helper-messages-motdgen": {
      "evra": "0.21.3-9.fc41.noarch",
      "metadata": {
        "sourcerpm": "console-login-helper-messages"
      }
    },
    "console-login-helper-messages-profile": {
      "evra": "0.21.3-9.fc41.noarch",
      "metadata": {
        "sourcerpm": "console-login-helper-messages"
      }
    },
    "container-selinux": {
      "evra": "4:2.235.0-2.fc41.noarch",
      "metadata": {
        "sourcerpm": "container-selinux"
      }
    },
    "containerd": {
      "evra": "1.7.25-1.fc41.x86_64",
      "metadata": {
        "sourcerpm": "containerd"
      }
    },
    "containers-common": {
      "evra": "5:0.62.0-1.fc41.noarch",
      "metadata": {
        "sourcerpm": "containers-common"
      }
    },
    "containers-common-extra": {
      "evra": "5:0.62.0-1.fc41.noarch",
      "metadata": {
        "sourcerpm": "containers-common"
      }
    },
    "coreos-installer": {
      "evra": "0.23.0-3.fc41.x86_64",
      "metadata": {
        "sourcerpm": "rust-coreos-installer"
      }
    },
    "coreos-installer-bootinfra": {
      "evra": "0.23.0-3.fc41.x86_64",
      "metadata": {
        "sourcerpm": "rust-coreos-installer"
      }
    },
    "coreutils": {
      "evra": "9.5-11.fc41.x86_64",
      "metadata": {
        "sourcerpm": "coreutils"
      }
    },
    "coreutils-common": {
      "evra": "9.5-11.fc41.x86_64",
      "metadata": {
        "sourcerpm": "coreutils"
      }
    },
    "cpio": {
      "evra": "2.15-2.fc41.x86_64",
      "metadata": {
        "sourcerpm": "cpio"
      }
    },
    "cracklib": {
      "evra": "2.9.11-6.fc41.x86_64",
      "metadata": {
        "sourcerpm": "cracklib"
      }
    },
    "criu": {
      "evra": "4.0-4.fc41.x86_64",
      "metadata": {
        "sourcerpm": "criu"
      }
    },
    "criu-libs": {
      "evra": "4.0-4.fc41.x86_64",
      "metadata": {
        "sourcerpm": "criu"
      }
    },
    "crun": {
      "evra": "1.20-2.fc41.x86_64",
      "metadata": {
        "sourcerpm": "crun"
      }
    },
    "crun-wasm": {
      "evra": "1.20-2.fc41.x86_64",
      "metadata": {
        "sourcerpm": "crun"
      }
    },
    "crypto-policies": {
      "evra": "20250124-1.git4d262e7.fc41.noarch",
      "metadata": {
        "sourcerpm": "crypto-policies"
      }
    },
    "cryptsetup": {
      "evra": "2.7.5-1.fc41.x86_64",
      "metadata": {
        "sourcerpm": "cryptsetup"
      }
    },
    "cryptsetup-libs": {
      "evra": "2.7.5-1.fc41.x86_64",
      "metadata": {
        "sourcerpm": "cryptsetup"
      }
    },
    "curl": {
      "evra": "8.9.1-3.fc41.x86_64",
      "metadata": {
        "sourcerpm": "curl"
      }
    },
    "cyrus-sasl-gssapi": {
      "evra": "2.1.28-27.fc41.x86_64",
      "metadata": {
        "sourcerpm": "cyrus-sasl"
      }
    },
    "cyrus-sasl-lib": {
      "evra": "2.1.28-27.fc41.x86_64",
      "metadata": {
        "sourcerpm": "cyrus-sasl"
      }
    },
    "dbus": {
      "evra": "1:1.14.10-4.fc41.x86_64",
      "metadata": {
        "sourcerpm": "dbus"
      }
    },
    "dbus-broker": {
      "evra": "36-4.fc41.x86_64",
      "metadata": {
        "sourcerpm": "dbus-broker"
      }
    },
    "dbus-common": {
      "evra": "1:1.14.10-4.fc41.noarch",
      "metadata": {
        "sourcerpm": "dbus"
      }
    },
    "dbus-libs": {
      "evra": "1:1.14.10-4.fc41.x86_64",
      "metadata": {
        "sourcerpm": "dbus"
      }
    },
    "device-mapper": {
      "evra": "1.02.199-4.fc41.x86_64",
      "metadata": {
        "sourcerpm": "lvm2"
      }
    },
    "device-mapper-event": {
      "evra": "1.02.199-4.fc41.x86_64",
      "metadata": {
        "sourcerpm": "lvm2"
      }
    },
    "device-mapper-event-libs": {
      "evra": "1.02.199-4.fc41.x86_64",
      "metadata": {
        "sourcerpm": "lvm2"
      }
    },
    "device-mapper-libs": {
      "evra": "1.02.199-4.fc41.x86_64",
      "metadata": {
        "sourcerpm": "lvm2"
      }
    },
    "device-mapper-multipath": {
      "evra": "0.9.9-3.fc41.x86_64",
      "metadata": {
        "sourcerpm": "device-mapper-multipath"
      }
    },
    "device-mapper-multipath-libs": {
      "evra": "0.9.9-3.fc41.x86_64",
      "metadata": {
        "sourcerpm": "device-mapper-multipath"
      }
    },
    "device-mapper-persistent-data": {
      "evra": "1.0.12-3.fc41.x86_64",
      "metadata": {
        "sourcerpm": "device-mapper-persistent-data"
      }
    },
    "diffutils": {
      "evra": "3.10-8.fc41.x86_64",
      "metadata": {
        "sourcerpm": "diffutils"
      }
    },
    "dnf5": {
      "evra": "5.2.10.0-2.fc41.x86_64",
      "metadata": {
        "sourcerpm": "dnf5"
      }
    },
    "dnsmasq": {
      "evra": "2.90-4.fc41.x86_64",
      "metadata": {
        "sourcerpm": "dnsmasq"
      }
    },
    "docker-cli": {
      "evra": "27.3.1-2.fc41.x86_64",
      "metadata": {
        "sourcerpm": "moby-engine"
      }
    },
    "dosfstools": {
      "evra": "4.2-13.fc41.x86_64",
      "metadata": {
        "sourcerpm": "dosfstools"
      }
    },
    "dracut": {
      "evra": "103-3.fc41.x86_64",
      "metadata": {
        "sourcerpm": "dracut"
      }
    },
    "dracut-network": {
      "evra": "103-3.fc41.x86_64",
      "metadata": {
        "sourcerpm": "dracut"
      }
    },
    "dracut-squash": {
      "evra": "103-3.fc41.x86_64",
      "metadata": {
        "sourcerpm": "dracut"
      }
    },
    "duktape": {
      "evra": "2.7.0-8.fc41.x86_64",
      "metadata": {
        "sourcerpm": "duktape"
      }
    },
    "e2fsprogs": {
      "evra": "1.47.1-6.fc41.x86_64",
      "metadata": {
        "sourcerpm": "e2fsprogs"
      }
    },
    "e2fsprogs-libs": {
      "evra": "1.47.1-6.fc41.x86_64",
      "metadata": {
        "sourcerpm": "e2fsprogs"
      }
    },
    "efi-filesystem": {
      "evra": "5-13.fc41.noarch",
      "metadata": {
        "sourcerpm": "efi-rpm-macros"
      }
    },
    "efibootmgr": {
      "evra": "18-7.fc41.x86_64",
      "metadata": {
        "sourcerpm": "efibootmgr"
      }
    },
    "efivar-libs": {
      "evra": "39-6.fc41.x86_64",
      "metadata": {
        "sourcerpm": "efivar"
      }
    },
    "elfutils-default-yama-scope": {
      "evra": "0.192-9.fc41.noarch",
      "metadata": {
        "sourcerpm": "elfutils"
      }
    },
    "elfutils-libelf": {
      "evra": "0.192-9.fc41.x86_64",
      "metadata": {
        "sourcerpm": "elfutils"
      }
    },
    "elfutils-libs": {
      "evra": "0.192-9.fc41.x86_64",
      "metadata": {
        "sourcerpm": "elfutils"
      }
    },
    "ethtool": {
      "evra": "2:6.11-1.fc41.x86_64",
      "metadata": {
        "sourcerpm": "ethtool"
      }
    },
    "expat": {
      "evra": "2.6.4-1.fc41.x86_64",
      "metadata": {
        "sourcerpm": "expat"
      }
    },
    "fedora-gpg-keys": {
      "evra": "41-1.noarch",
      "metadata": {
        "sourcerpm": "fedora-repos"
      }
    },
    "fedora-release-common": {
      "evra": "41-31.noarch",
      "metadata": {
        "sourcerpm": "fedora-release"
      }
    },
    "fedora-release-coreos": {
      "evra": "41-31.noarch",
      "metadata": {
        "sourcerpm": "fedora-release"
      }
    },
    "fedora-release-identity-coreos": {
      "evra": "41-31.noarch",
      "metadata": {
        "sourcerpm": "fedora-release"
      }
    },
    "fedora-repos": {
      "evra": "41-1.noarch",
      "metadata": {
        "sourcerpm": "fedora-repos"
      }
    },
    "fedora-repos-archive": {
      "evra": "41-1.noarch",
      "metadata": {
        "sourcerpm": "fedora-repos"
      }
    },
    "fedora-repos-ostree": {
      "evra": "41-1.noarch",
      "metadata": {
        "sourcerpm": "fedora-repos"
      }
    },
    "file": {
      "evra": "5.45-7.fc41.x86_64",
      "metadata": {
        "sourcerpm": "file"
      }
    },
    "file-libs": {
      "evra": "5.45-7.fc41.x86_64",
      "metadata": {
        "sourcerpm": "file"
      }
    },
    "filesystem": {
      "evra": "3.18-23.fc41.x86_64",
      "metadata": {
        "sourcerpm": "filesystem"
      }
    },
    "findutils": {
      "evra": "1:4.10.0-4.fc41.x86_64",
      "metadata": {
        "sourcerpm": "findutils"
      }
    },
    "flatpak-session-helper": {
      "evra": "1.16.0-1.fc41.x86_64",
      "metadata": {
        "sourcerpm": "flatpak"
      }
    },
    "fmt": {
      "evra": "11.0.2-2.fc41.x86_64",
      "metadata": {
        "sourcerpm": "fmt"
      }
    },
    "fstrm": {
      "evra": "0.6.1-11.fc41.x86_64",
      "metadata": {
        "sourcerpm": "fstrm"
      }
    },
    "fuse-common": {
      "evra": "3.16.2-4.fc41.x86_64",
      "metadata": {
        "sourcerpm": "fuse3"
      }
    },
    "fuse-overlayfs": {
      "evra": "1.13-2.fc41.x86_64",
      "metadata": {
        "sourcerpm": "fuse-overlayfs"
      }
    },
    "fuse-sshfs": {
      "evra": "3.7.3-10.fc41.x86_64",
      "metadata": {
        "sourcerpm": "fuse-sshfs"
      }
    },
    "fuse3": {
      "evra": "3.16.2-4.fc41.x86_64",
      "metadata": {
        "sourcerpm": "fuse3"
      }
    },
    "fuse3-libs": {
      "evra": "3.16.2-4.fc41.x86_64",
      "metadata": {
        "sourcerpm": "fuse3"
      }
    },
    "fwupd": {
      "evra": "1.9.28-1.fc41.x86_64",
      "metadata": {
        "sourcerpm": "fwupd"
      }
    },
    "gawk": {
      "evra": "5.3.0-4.fc41.x86_64",
      "metadata": {
        "sourcerpm": "gawk"
      }
    },
    "gdbm": {
      "evra": "1:1.23-7.fc41.x86_64",
      "metadata": {
        "sourcerpm": "gdbm"
      }
    },
    "gdbm-libs": {
      "evra": "1:1.23-7.fc41.x86_64",
      "metadata": {
        "sourcerpm": "gdbm"
      }
    },
    "gdisk": {
      "evra": "1.0.10-2.fc41.x86_64",
      "metadata": {
        "sourcerpm": "gdisk"
      }
    },
    "gettext-envsubst": {
      "evra": "0.22.5-6.fc41.x86_64",
      "metadata": {
        "sourcerpm": "gettext"
      }
    },
    "gettext-libs": {
      "evra": "0.22.5-6.fc41.x86_64",
      "metadata": {
        "sourcerpm": "gettext"
      }
    },
    "gettext-runtime": {
      "evra": "0.22.5-6.fc41.x86_64",
      "metadata": {
        "sourcerpm": "gettext"
      }
    },
    "git-core": {
      "evra": "2.48.1-1.fc41.x86_64",
      "metadata": {
        "sourcerpm": "git"
      }
    },
    "glib2": {
      "evra": "2.82.2-1.fc41.x86_64",
      "metadata": {
        "sourcerpm": "glib2"
      }
    },
    "glibc": {
      "evra": "2.40-21.fc41.x86_64",
      "metadata": {
        "sourcerpm": "glibc"
      }
    },
    "glibc-common": {
      "evra": "2.40-21.fc41.x86_64",
      "metadata": {
        "sourcerpm": "glibc"
      }
    },
    "glibc-gconv-extra": {
      "evra": "2.40-21.fc41.x86_64",
      "metadata": {
        "sourcerpm": "glibc"
      }
    },
    "glibc-minimal-langpack": {
      "evra": "2.40-21.fc41.x86_64",
      "metadata": {
        "sourcerpm": "glibc"
      }
    },
    "gmp": {
      "evra": "1:6.3.0-2.fc41.x86_64",
      "metadata": {
        "sourcerpm": "gmp"
      }
    },
    "gnupg2": {
      "evra": "2.4.5-3.fc41.x86_64",
      "metadata": {
        "sourcerpm": "gnupg2"
      }
    },
    "gnutls": {
      "evra": "3.8.9-2.fc41.x86_64",
      "metadata": {
        "sourcerpm": "gnutls"
      }
    },
    "google-compute-engine-guest-configs-udev": {
      "evra": "20240905.00-2.fc41.noarch",
      "metadata": {
        "sourcerpm": "google-compute-engine-guest-configs"
      }
    },
    "gpgme": {
      "evra": "1.23.2-5.fc41.x86_64",
      "metadata": {
        "sourcerpm": "gpgme"
      }
    },
    "grep": {
      "evra": "3.11-9.fc41.x86_64",
      "metadata": {
        "sourcerpm": "grep"
      }
    },
    "grub2-common": {
      "evra": "1:2.12-15.fc41.noarch",
      "metadata": {
        "sourcerpm": "grub2"
      }
    },
    "grub2-efi-x64": {
      "evra": "1:2.12-15.fc41.x86_64",
      "metadata": {
        "sourcerpm": "grub2"
      }
    },
    "grub2-pc": {
      "evra": "1:2.12-15.fc41.x86_64",
      "metadata": {
        "sourcerpm": "grub2"
      }
    },
    "grub2-pc-modules": {
      "evra": "1:2.12-15.fc41.noarch",
      "metadata": {
        "sourcerpm": "grub2"
      }
    },
    "grub2-tools": {
      "evra": "1:2.12-15.fc41.x86_64",
      "metadata": {
        "sourcerpm": "grub2"
      }
    },
    "grub2-tools-minimal": {
      "evra": "1:2.12-15.fc41.x86_64",
      "metadata": {
        "sourcerpm": "grub2"
      }
    },
    "gzip": {
      "evra": "1.13-2.fc41.x86_64",
      "metadata": {
        "sourcerpm": "gzip"
      }
    },
    "hostname": {
      "evra": "3.23-13.fc41.x86_64",
      "metadata": {
        "sourcerpm": "hostname"
      }
    },
    "hwdata": {
      "evra": "0.393-1.fc41.noarch",
      "metadata": {
        "sourcerpm": "hwdata"
      }
    },
    "ignition": {
      "evra": "2.20.0-5.fc41.x86_64",
      "metadata": {
        "sourcerpm": "ignition"
      }
    },
    "inih": {
      "evra": "58-2.fc41.x86_64",
      "metadata": {
        "sourcerpm": "inih"
      }
    },
    "intel-gpu-firmware": {
      "evra": "20241210-1.fc41.noarch",
      "metadata": {
        "sourcerpm": "linux-firmware"
      }
    },
    "ipcalc": {
      "evra": "1.0.3-10.fc41.x86_64",
      "metadata": {
        "sourcerpm": "ipcalc"
      }
    },
    "iproute": {
      "evra": "6.10.0-1.fc41.x86_64",
      "metadata": {
        "sourcerpm": "iproute"
      }
    },
    "iproute-tc": {
      "evra": "6.10.0-1.fc41.x86_64",
      "metadata": {
        "sourcerpm": "iproute"
      }
    },
    "iptables-legacy": {
      "evra": "1.8.10-15.fc41.x86_64",
      "metadata": {
        "sourcerpm": "iptables"
      }
    },
    "iptables-legacy-libs": {
      "evra": "1.8.10-15.fc41.x86_64",
      "metadata": {
        "sourcerpm": "iptables"
      }
    },
    "iptables-libs": {
      "evra": "1.8.10-15.fc41.x86_64",
      "metadata": {
        "sourcerpm": "iptables"
      }
    },
    "iptables-nft": {
      "evra": "1.8.10-15.fc41.x86_64",
      "metadata": {
        "sourcerpm": "iptables"
      }
    },
    "iptables-services": {
      "evra": "1.8.10-15.fc41.noarch",
      "metadata": {
        "sourcerpm": "iptables"
      }
    },
    "iptables-utils": {
      "evra": "1.8.10-15.fc41.x86_64",
      "metadata": {
        "sourcerpm": "iptables"
      }
    },
    "iputils": {
      "evra": "20240905-1.fc41.x86_64",
      "metadata": {
        "sourcerpm": "iputils"
      }
    },
    "irqbalance": {
      "evra": "2:1.9.4-4.fc41.x86_64",
      "metadata": {
        "sourcerpm": "irqbalance"
      }
    },
    "iscsi-initiator-utils": {
      "evra": "6.2.1.10-0.gitd0f04ae.fc41.1.x86_64",
      "metadata": {
        "sourcerpm": "iscsi-initiator-utils"
      }
    },
    "iscsi-initiator-utils-iscsiuio": {
      "evra": "6.2.1.10-0.gitd0f04ae.fc41.1.x86_64",
      "metadata": {
        "sourcerpm": "iscsi-initiator-utils"
      }
    },
    "isns-utils-libs": {
      "evra": "0.101-10.fc41.x86_64",
      "metadata": {
        "sourcerpm": "isns-utils"
      }
    },
    "jansson": {
      "evra": "2.13.1-10.fc41.x86_64",
      "metadata": {
        "sourcerpm": "jansson"
      }
    },
    "jemalloc": {
      "evra": "5.3.0-7.fc41.x86_64",
      "metadata": {
        "sourcerpm": "jemalloc"
      }
    },
    "jose": {
      "evra": "14-2.fc41.x86_64",
      "metadata": {
        "sourcerpm": "jose"
      }
    },
    "jq": {
      "evra": "1.7.1-8.fc41.x86_64",
      "metadata": {
        "sourcerpm": "jq"
      }
    },
    "json-c": {
      "evra": "0.17-4.fc41.x86_64",
      "metadata": {
        "sourcerpm": "json-c"
      }
    },
    "json-glib": {
      "evra": "1.10.0-1.fc41.x86_64",
      "metadata": {
        "sourcerpm": "json-glib"
      }
    },
    "kbd": {
      "evra": "2.6.4-4.fc41.x86_64",
      "metadata": {
        "sourcerpm": "kbd"
      }
    },
    "kbd-legacy": {
      "evra": "2.6.4-4.fc41.noarch",
      "metadata": {
        "sourcerpm": "kbd"
      }
    },
    "kbd-misc": {
      "evra": "2.6.4-4.fc41.noarch",
      "metadata": {
        "sourcerpm": "kbd"
      }
    },
    "kdump-utils": {
      "evra": "1.0.52-1.fc41.x86_64",
      "metadata": {
        "sourcerpm": "kdump-utils"
      }
    },
    "kernel": {
      "evra": "6.13.5-200.fc41.x86_64",
      "metadata": {
        "sourcerpm": "kernel"
      }
    },
    "kernel-core": {
      "evra": "6.13.5-200.fc41.x86_64",
      "metadata": {
        "sourcerpm": "kernel"
      }
    },
    "kernel-modules": {
      "evra": "6.13.5-200.fc41.x86_64",
      "metadata": {
        "sourcerpm": "kernel"
      }
    },
    "kernel-modules-core": {
      "evra": "6.13.5-200.fc41.x86_64",
      "metadata": {
        "sourcerpm": "kernel"
      }
    },
    "kexec-tools": {
      "evra": "2.0.30-1.fc41.x86_64",
      "metadata": {
        "sourcerpm": "kexec-tools"
      }
    },
    "keyutils": {
      "evra": "1.6.3-4.fc41.x86_64",
      "metadata": {
        "sourcerpm": "keyutils"
      }
    },
    "keyutils-libs": {
      "evra": "1.6.3-4.fc41.x86_64",
      "metadata": {
        "sourcerpm": "keyutils"
      }
    },
    "kmod": {
      "evra": "33-1.fc41.x86_64",
      "metadata": {
        "sourcerpm": "kmod"
      }
    },
    "kmod-libs": {
      "evra": "33-1.fc41.x86_64",
      "metadata": {
        "sourcerpm": "kmod"
      }
    },
    "kpartx": {
      "evra": "0.9.9-3.fc41.x86_64",
      "metadata": {
        "sourcerpm": "device-mapper-multipath"
      }
    },
    "krb5-libs": {
      "evra": "1.21.3-4.fc41.x86_64",
      "metadata": {
        "sourcerpm": "krb5"
      }
    },
    "less": {
      "evra": "668-1.fc41.x86_64",
      "metadata": {
        "sourcerpm": "less"
      }
    },
    "libacl": {
      "evra": "2.3.2-2.fc41.x86_64",
      "metadata": {
        "sourcerpm": "acl"
      }
    },
    "libaio": {
      "evra": "0.3.111-20.fc41.x86_64",
      "metadata": {
        "sourcerpm": "libaio"
      }
    },
    "libarchive": {
      "evra": "3.7.4-4.fc41.x86_64",
      "metadata": {
        "sourcerpm": "libarchive"
      }
    },
    "libassuan": {
      "evra": "2.5.7-2.fc41.x86_64",
      "metadata": {
        "sourcerpm": "libassuan"
      }
    },
    "libattr": {
      "evra": "2.5.2-4.fc41.x86_64",
      "metadata": {
        "sourcerpm": "attr"
      }
    },
    "libbasicobjects": {
      "evra": "0.1.1-57.fc41.x86_64",
      "metadata": {
        "sourcerpm": "ding-libs"
      }
    },
    "libblkid": {
      "evra": "2.40.4-1.fc41.x86_64",
      "metadata": {
        "sourcerpm": "util-linux"
      }
    },
    "libbpf": {
      "evra": "2:1.4.7-1.fc41.x86_64",
      "metadata": {
        "sourcerpm": "libbpf"
      }
    },
    "libbsd": {
      "evra": "0.12.2-4.fc41.x86_64",
      "metadata": {
        "sourcerpm": "libbsd"
      }
    },
    "libcap": {
      "evra": "2.70-4.fc41.x86_64",
      "metadata": {
        "sourcerpm": "libcap"
      }
    },
    "libcap-ng": {
      "evra": "0.8.5-3.fc41.x86_64",
      "metadata": {
        "sourcerpm": "libcap-ng"
      }
    },
    "libcbor": {
      "evra": "0.11.0-2.fc41.x86_64",
      "metadata": {
        "sourcerpm": "libcbor"
      }
    },
    "libcollection": {
      "evra": "0.7.0-57.fc41.x86_64",
      "metadata": {
        "sourcerpm": "ding-libs"
      }
    },
    "libcom_err": {
      "evra": "1.47.1-6.fc41.x86_64",
      "metadata": {
        "sourcerpm": "e2fsprogs"
      }
    },
    "libcurl-minimal": {
      "evra": "8.9.1-3.fc41.x86_64",
      "metadata": {
        "sourcerpm": "curl"
      }
    },
    "libdaemon": {
      "evra": "0.14-30.fc41.x86_64",
      "metadata": {
        "sourcerpm": "libdaemon"
      }
    },
    "libdhash": {
      "evra": "0.5.0-57.fc41.x86_64",
      "metadata": {
        "sourcerpm": "ding-libs"
      }
    },
    "libdnf5": {
      "evra": "5.2.10.0-2.fc41.x86_64",
      "metadata": {
        "sourcerpm": "dnf5"
      }
    },
    "libdnf5-cli": {
      "evra": "5.2.10.0-2.fc41.x86_64",
      "metadata": {
        "sourcerpm": "dnf5"
      }
    },
    "libeconf": {
      "evra": "0.6.2-3.fc41.x86_64",
      "metadata": {
        "sourcerpm": "libeconf"
      }
    },
    "libedit": {
      "evra": "3.1-54.20250104cvs.fc41.x86_64",
      "metadata": {
        "sourcerpm": "libedit"
      }
    },
    "libevent": {
      "evra": "2.1.12-14.fc41.x86_64",
      "metadata": {
        "sourcerpm": "libevent"
      }
    },
    "libfdisk": {
      "evra": "2.40.4-1.fc41.x86_64",
      "metadata": {
        "sourcerpm": "util-linux"
      }
    },
    "libffi": {
      "evra": "3.4.6-3.fc41.x86_64",
      "metadata": {
        "sourcerpm": "libffi"
      }
    },
    "libfido2": {
      "evra": "1.15.0-2.fc41.x86_64",
      "metadata": {
        "sourcerpm": "libfido2"
      }
    },
    "libgcc": {
      "evra": "14.2.1-7.fc41.x86_64",
      "metadata": {
        "sourcerpm": "gcc"
      }
    },
    "libgcrypt": {
      "evra": "1.11.0-3.fc41.x86_64",
      "metadata": {
        "sourcerpm": "libgcrypt"
      }
    },
    "libgpg-error": {
      "evra": "1.50-2.fc41.x86_64",
      "metadata": {
        "sourcerpm": "libgpg-error"
      }
    },
    "libgudev": {
      "evra": "238-6.fc41.x86_64",
      "metadata": {
        "sourcerpm": "libgudev"
      }
    },
    "libgusb": {
      "evra": "0.4.9-2.fc41.x86_64",
      "metadata": {
        "sourcerpm": "libgusb"
      }
    },
    "libibverbs": {
      "evra": "51.0-5.fc41.x86_64",
      "metadata": {
        "sourcerpm": "rdma-core"
      }
    },
    "libicu": {
      "evra": "74.2-2.fc41.x86_64",
      "metadata": {
        "sourcerpm": "icu"
      }
    },
    "libidn2": {
      "evra": "2.3.7-2.fc41.x86_64",
      "metadata": {
        "sourcerpm": "libidn2"
      }
    },
    "libini_config": {
      "evra": "1.3.1-57.fc41.x86_64",
      "metadata": {
        "sourcerpm": "ding-libs"
      }
    },
    "libipa_hbac": {
      "evra": "2.10.2-1.fc41.x86_64",
      "metadata": {
        "sourcerpm": "sssd"
      }
    },
    "libjcat": {
      "evra": "0.2.2-1.fc41.x86_64",
      "metadata": {
        "sourcerpm": "libjcat"
      }
    },
    "libjose": {
      "evra": "14-2.fc41.x86_64",
      "metadata": {
        "sourcerpm": "jose"
      }
    },
    "libkcapi": {
      "evra": "1.5.0-4.fc41.x86_64",
      "metadata": {
        "sourcerpm": "libkcapi"
      }
    },
    "libkcapi-hasher": {
      "evra": "1.5.0-4.fc41.x86_64",
      "metadata": {
        "sourcerpm": "libkcapi"
      }
    },
    "libkcapi-hmaccalc": {
      "evra": "1.5.0-4.fc41.x86_64",
      "metadata": {
        "sourcerpm": "libkcapi"
      }
    },
    "libksba": {
      "evra": "1.6.7-2.fc41.x86_64",
      "metadata": {
        "sourcerpm": "libksba"
      }
    },
    "libldb": {
      "evra": "2:4.21.4-1.fc41.x86_64",
      "metadata": {
        "sourcerpm": "samba"
      }
    },
    "libluksmeta": {
      "evra": "9-23.fc41.x86_64",
      "metadata": {
        "sourcerpm": "luksmeta"
      }
    },
    "libmaxminddb": {
      "evra": "1.12.2-1.fc41.x86_64",
      "metadata": {
        "sourcerpm": "libmaxminddb"
      }
    },
    "libmd": {
      "evra": "1.1.0-5.fc41.x86_64",
      "metadata": {
        "sourcerpm": "libmd"
      }
    },
    "libmnl": {
      "evra": "1.0.5-6.fc41.x86_64",
      "metadata": {
        "sourcerpm": "libmnl"
      }
    },
    "libmodulemd": {
      "evra": "2.15.0-14.fc41.x86_64",
      "metadata": {
        "sourcerpm": "libmodulemd"
      }
    },
    "libmount": {
      "evra": "2.40.4-1.fc41.x86_64",
      "metadata": {
        "sourcerpm": "util-linux"
      }
    },
    "libndp": {
      "evra": "1.9-2.fc41.x86_64",
      "metadata": {
        "sourcerpm": "libndp"
      }
    },
    "libnet": {
      "evra": "1.3-4.fc41.x86_64",
      "metadata": {
        "sourcerpm": "libnet"
      }
    },
    "libnetfilter_conntrack": {
      "evra": "1.0.9-6.fc41.x86_64",
      "metadata": {
        "sourcerpm": "libnetfilter_conntrack"
      }
    },
    "libnfnetlink": {
      "evra": "1.0.1-28.fc41.x86_64",
      "metadata": {
        "sourcerpm": "libnfnetlink"
      }
    },
    "libnfsidmap": {
      "evra": "1:2.8.1-7.rc2.fc41.x86_64",
      "metadata": {
        "sourcerpm": "nfs-utils"
      }
    },
    "libnftnl": {
      "evra": "1.2.7-2.fc41.x86_64",
      "metadata": {
        "sourcerpm": "libnftnl"
      }
    },
    "libnghttp2": {
      "evra": "1.62.1-2.fc41.x86_64",
      "metadata": {
        "sourcerpm": "nghttp2"
      }
    },
    "libnl3": {
      "evra": "3.11.0-1.fc41.x86_64",
      "metadata": {
        "sourcerpm": "libnl3"
      }
    },
    "libnl3-cli": {
      "evra": "3.11.0-1.fc41.x86_64",
      "metadata": {
        "sourcerpm": "libnl3"
      }
    },
    "libnsl2": {
      "evra": "2.0.1-2.fc41.x86_64",
      "metadata": {
        "sourcerpm": "libnsl2"
      }
    },
    "libnvme": {
      "evra": "1.10-1.fc41.x86_64",
      "metadata": {
        "sourcerpm": "libnvme"
      }
    },
    "libpath_utils": {
      "evra": "0.2.1-57.fc41.x86_64",
      "metadata": {
        "sourcerpm": "ding-libs"
      }
    },
    "libpcap": {
      "evra": "14:1.10.5-1.fc41.x86_64",
      "metadata": {
        "sourcerpm": "libpcap"
      }
    },
    "libpkgconf": {
      "evra": "2.3.0-1.fc41.x86_64",
      "metadata": {
        "sourcerpm": "pkgconf"
      }
    },
    "libpsl": {
      "evra": "0.21.5-4.fc41.x86_64",
      "metadata": {
        "sourcerpm": "libpsl"
      }
    },
    "libpwquality": {
      "evra": "1.4.5-11.fc41.x86_64",
      "metadata": {
        "sourcerpm": "libpwquality"
      }
    },
    "libref_array": {
      "evra": "0.1.5-57.fc41.x86_64",
      "metadata": {
        "sourcerpm": "ding-libs"
      }
    },
    "librepo": {
      "evra": "1.19.0-1.fc41.x86_64",
      "metadata": {
        "sourcerpm": "librepo"
      }
    },
    "libreport-filesystem": {
      "evra": "2.17.15-3.fc41.noarch",
      "metadata": {
        "sourcerpm": "libreport"
      }
    },
    "libseccomp": {
      "evra": "2.5.5-2.fc41.x86_64",
      "metadata": {
        "sourcerpm": "libseccomp"
      }
    },
    "libselinux": {
      "evra": "3.7-5.fc41.x86_64",
      "metadata": {
        "sourcerpm": "libselinux"
      }
    },
    "libselinux-utils": {
      "evra": "3.7-5.fc41.x86_64",
      "metadata": {
        "sourcerpm": "libselinux"
      }
    },
    "libsemanage": {
      "evra": "3.7-2.fc41.x86_64",
      "metadata": {
        "sourcerpm": "libsemanage"
      }
    },
    "libsepol": {
      "evra": "3.7-2.fc41.x86_64",
      "metadata": {
        "sourcerpm": "libsepol"
      }
    },
    "libslirp": {
      "evra": "4.8.0-2.fc41.x86_64",
      "metadata": {
        "sourcerpm": "libslirp"
      }
    },
    "libsmartcols": {
      "evra": "2.40.4-1.fc41.x86_64",
      "metadata": {
        "sourcerpm": "util-linux"
      }
    },
    "libsmbclient": {
      "evra": "2:4.21.4-1.fc41.x86_64",
      "metadata": {
        "sourcerpm": "samba"
      }
    },
    "libsolv": {
      "evra": "0.7.31-1.fc41.x86_64",
      "metadata": {
        "sourcerpm": "libsolv"
      }
    },
    "libss": {
      "evra": "1.47.1-6.fc41.x86_64",
      "metadata": {
        "sourcerpm": "e2fsprogs"
      }
    },
    "libsss_certmap": {
      "evra": "2.10.2-1.fc41.x86_64",
      "metadata": {
        "sourcerpm": "sssd"
      }
    },
    "libsss_idmap": {
      "evra": "2.10.2-1.fc41.x86_64",
      "metadata": {
        "sourcerpm": "sssd"
      }
    },
    "libsss_nss_idmap": {
      "evra": "2.10.2-1.fc41.x86_64",
      "metadata": {
        "sourcerpm": "sssd"
      }
    },
    "libsss_sudo": {
      "evra": "2.10.2-1.fc41.x86_64",
      "metadata": {
        "sourcerpm": "sssd"
      }
    },
    "libstdc++": {
      "evra": "14.2.1-7.fc41.x86_64",
      "metadata": {
        "sourcerpm": "gcc"
      }
    },
    "libtalloc": {
      "evra": "2.4.2-4.fc41.x86_64",
      "metadata": {
        "sourcerpm": "libtalloc"
      }
    },
    "libtasn1": {
      "evra": "4.20.0-1.fc41.x86_64",
      "metadata": {
        "sourcerpm": "libtasn1"
      }
    },
    "libtdb": {
      "evra": "1.4.12-3.fc41.x86_64",
      "metadata": {
        "sourcerpm": "libtdb"
      }
    },
    "libteam": {
      "evra": "1.32-9.fc41.x86_64",
      "metadata": {
        "sourcerpm": "libteam"
      }
    },
    "libtevent": {
      "evra": "0.16.1-4.fc41.x86_64",
      "metadata": {
        "sourcerpm": "libtevent"
      }
    },
    "libtextstyle": {
      "evra": "0.22.5-6.fc41.x86_64",
      "metadata": {
        "sourcerpm": "gettext"
      }
    },
    "libtirpc": {
      "evra": "1.3.6-1.rc3.fc41.x86_64",
      "metadata": {
        "sourcerpm": "libtirpc"
      }
    },
    "libtool-ltdl": {
      "evra": "2.4.7-12.fc41.x86_64",
      "metadata": {
        "sourcerpm": "libtool"
      }
    },
    "libunistring": {
      "evra": "1.1-8.fc41.x86_64",
      "metadata": {
        "sourcerpm": "libunistring"
      }
    },
    "libusb1": {
      "evra": "1.0.27-9.fc41.x86_64",
      "metadata": {
        "sourcerpm": "libusb1"
      }
    },
    "libutempter": {
      "evra": "1.2.1-15.fc41.x86_64",
      "metadata": {
        "sourcerpm": "libutempter"
      }
    },
    "libuuid": {
      "evra": "2.40.4-1.fc41.x86_64",
      "metadata": {
        "sourcerpm": "util-linux"
      }
    },
    "libuv": {
      "evra": "1:1.50.0-1.fc41.x86_64",
      "metadata": {
        "sourcerpm": "libuv"
      }
    },
    "libverto": {
      "evra": "0.3.2-9.fc41.x86_64",
      "metadata": {
        "sourcerpm": "libverto"
      }
    },
    "libwbclient": {
      "evra": "2:4.21.4-1.fc41.x86_64",
      "metadata": {
        "sourcerpm": "samba"
      }
    },
    "libxcrypt": {
      "evra": "4.4.38-6.fc41.x86_64",
      "metadata": {
        "sourcerpm": "libxcrypt"
      }
    },
    "libxml2": {
      "evra": "2.12.9-1.fc41.x86_64",
      "metadata": {
        "sourcerpm": "libxml2"
      }
    },
    "libxmlb": {
      "evra": "0.3.21-1.fc41.x86_64",
      "metadata": {
        "sourcerpm": "libxmlb"
      }
    },
    "libyaml": {
      "evra": "0.2.5-15.fc41.x86_64",
      "metadata": {
        "sourcerpm": "libyaml"
      }
    },
    "libzstd": {
      "evra": "1.5.7-1.fc41.x86_64",
      "metadata": {
        "sourcerpm": "zstd"
      }
    },
    "linux-firmware": {
      "evra": "20241210-1.fc41.noarch",
      "metadata": {
        "sourcerpm": "linux-firmware"
      }
    },
    "linux-firmware-whence": {
      "evra": "20241210-1.fc41.noarch",
      "metadata": {
        "sourcerpm": "linux-firmware"
      }
    },
    "lld18-libs": {
      "evra": "18.1.8-6.fc41.x86_64",
      "metadata": {
        "sourcerpm": "lld18"
      }
    },
    "llvm18-libs": {
      "evra": "18.1.8-4.fc41.x86_64",
      "metadata": {
        "sourcerpm": "llvm18"
      }
    },
    "lmdb-libs": {
      "evra": "0.9.33-2.fc41.x86_64",
      "metadata": {
        "sourcerpm": "lmdb"
      }
    },
    "logrotate": {
      "evra": "3.22.0-2.fc41.x86_64",
      "metadata": {
        "sourcerpm": "logrotate"
      }
    },
    "lsof": {
      "evra": "4.98.0-5.fc41.x86_64",
      "metadata": {
        "sourcerpm": "lsof"
      }
    },
    "lua-libs": {
      "evra": "5.4.7-3.fc41.x86_64",
      "metadata": {
        "sourcerpm": "lua"
      }
    },
    "luksmeta": {
      "evra": "9-23.fc41.x86_64",
      "metadata": {
        "sourcerpm": "luksmeta"
      }
    },
    "lvm2": {
      "evra": "2.03.25-4.fc41.x86_64",
      "metadata": {
        "sourcerpm": "lvm2"
      }
    },
    "lvm2-libs": {
      "evra": "2.03.25-4.fc41.x86_64",
      "metadata": {
        "sourcerpm": "lvm2"
      }
    },
    "lz4-libs": {
      "evra": "1.10.0-1.fc41.x86_64",
      "metadata": {
        "sourcerpm": "lz4"
      }
    },
    "lzo": {
      "evra": "2.10-13.fc41.x86_64",
      "metadata": {
        "sourcerpm": "lzo"
      }
    },
    "makedumpfile": {
      "evra": "1.7.6-1.fc41.x86_64",
      "metadata": {
        "sourcerpm": "makedumpfile"
      }
    },
    "mdadm": {
      "evra": "4.3-4.fc41.x86_64",
      "metadata": {
        "sourcerpm": "mdadm"
      }
    },
    "microcode_ctl": {
      "evra": "2:2.1-67.1.fc41.x86_64",
      "metadata": {
        "sourcerpm": "microcode_ctl"
      }
    },
    "moby-engine": {
      "evra": "27.3.1-2.fc41.x86_64",
      "metadata": {
        "sourcerpm": "moby-engine"
      }
    },
    "moby-filesystem": {
      "evra": "27.3.1-2.fc41.noarch",
      "metadata": {
        "sourcerpm": "moby-engine"
      }
    },
    "mokutil": {
      "evra": "2:0.7.1-2.fc41.x86_64",
      "metadata": {
        "sourcerpm": "mokutil"
      }
    },
    "mpfr": {
      "evra": "4.2.1-5.fc41.x86_64",
      "metadata": {
        "sourcerpm": "mpfr"
      }
    },
    "nano": {
      "evra": "8.1-1.fc41.x86_64",
      "metadata": {
        "sourcerpm": "nano"
      }
    },
    "nano-default-editor": {
      "evra": "8.1-1.fc41.noarch",
      "metadata": {
        "sourcerpm": "nano"
      }
    },
    "ncurses": {
      "evra": "6.5-2.20240629.fc41.x86_64",
      "metadata": {
        "sourcerpm": "ncurses"
      }
    },
    "ncurses-base": {
      "evra": "6.5-2.20240629.fc41.noarch",
      "metadata": {
        "sourcerpm": "ncurses"
      }
    },
    "ncurses-libs": {
      "evra": "6.5-2.20240629.fc41.x86_64",
      "metadata": {
        "sourcerpm": "ncurses"
      }
    },
    "net-tools": {
      "evra": "2.0-0.71.20160912git.fc41.x86_64",
      "metadata": {
        "sourcerpm": "net-tools"
      }
    },
    "netavark": {
      "evra": "2:1.14.0-1.fc41.x86_64",
      "metadata": {
        "sourcerpm": "netavark"
      }
    },
    "nettle": {
      "evra": "3.10-3.fc41.x86_64",
      "metadata": {
        "sourcerpm": "nettle"
      }
    },
    "newt": {
      "evra": "0.52.24-5.fc41.x86_64",
      "metadata": {
        "sourcerpm": "newt"
      }
    },
    "nfs-utils-coreos": {
      "evra": "1:2.8.1-7.rc2.fc41.x86_64",
      "metadata": {
        "sourcerpm": "nfs-utils"
      }
    },
    "nftables": {
      "evra": "1:1.0.9-7.fc41.x86_64",
      "metadata": {
        "sourcerpm": "nftables"
      }
    },
    "nmstate": {
      "evra": "2.2.41-3.fc41.x86_64",
      "metadata": {
        "sourcerpm": "nmstate"
      }
    },
    "npth": {
      "evra": "1.7-2.fc41.x86_64",
      "metadata": {
        "sourcerpm": "npth"
      }
    },
    "nss-altfiles": {
      "evra": "2.23.0-5.fc41.x86_64",
      "metadata": {
        "sourcerpm": "nss-altfiles"
      }
    },
    "numactl-libs": {
      "evra": "2.0.19-1.fc41.x86_64",
      "metadata": {
        "sourcerpm": "numactl"
      }
    },
    "nvidia-gpu-firmware": {
      "evra": "20241210-1.fc41.noarch",
      "metadata": {
        "sourcerpm": "linux-firmware"
      }
    },
    "nvme-cli": {
      "evra": "2.10.2-2.fc41.x86_64",
      "metadata": {
        "sourcerpm": "nvme-cli"
      }
    },
    "oniguruma": {
      "evra": "6.9.10-1.fc41.x86_64",
      "metadata": {
        "sourcerpm": "oniguruma"
      }
    },
    "openldap": {
      "evra": "2.6.8-7.fc41.x86_64",
      "metadata": {
        "sourcerpm": "openldap"
      }
    },
    "openssh": {
      "evra": "9.9p1-3.fc41.x86_64",
      "metadata": {
        "sourcerpm": "openssh"
      }
    },
    "openssh-clients": {
      "evra": "9.9p1-3.fc41.x86_64",
      "metadata": {
        "sourcerpm": "openssh"
      }
    },
    "openssh-server": {
      "evra": "9.9p1-3.fc41.x86_64",
      "metadata": {
        "sourcerpm": "openssh"
      }
    },
    "openssl": {
      "evra": "1:3.2.4-1.fc41.x86_64",
      "metadata": {
        "sourcerpm": "openssl"
      }
    },
    "openssl-libs": {
      "evra": "1:3.2.4-1.fc41.x86_64",
      "metadata": {
        "sourcerpm": "openssl"
      }
    },
    "os-prober": {
      "evra": "1.81-8.fc41.x86_64",
      "metadata": {
        "sourcerpm": "os-prober"
      }
    },
    "ostree": {
      "evra": "2025.1-1.fc41.x86_64",
      "metadata": {
        "sourcerpm": "ostree"
      }
    },
    "ostree-libs": {
      "evra": "2025.1-1.fc41.x86_64",
      "metadata": {
        "sourcerpm": "ostree"
      }
    },
    "p11-kit": {
      "evra": "0.25.5-3.fc41.x86_64",
      "metadata": {
        "sourcerpm": "p11-kit"
      }
    },
    "p11-kit-trust": {
      "evra": "0.25.5-3.fc41.x86_64",
      "metadata": {
        "sourcerpm": "p11-kit"
      }
    },
    "pam": {
      "evra": "1.6.1-7.fc41.x86_64",
      "metadata": {
        "sourcerpm": "pam"
      }
    },
    "pam-libs": {
      "evra": "1.6.1-7.fc41.x86_64",
      "metadata": {
        "sourcerpm": "pam"
      }
    },
    "passim-libs": {
      "evra": "0.1.8-2.fc41.x86_64",
      "metadata": {
        "sourcerpm": "passim"
      }
    },
    "passt": {
      "evra": "0^20250217.ga1e48a0-2.fc41.x86_64",
      "metadata": {
        "sourcerpm": "passt"
      }
    },
    "passt-selinux": {
      "evra": "0^20250217.ga1e48a0-2.fc41.noarch",
      "metadata": {
        "sourcerpm": "passt"
      }
    },
    "pciutils": {
      "evra": "3.13.0-5.fc41.x86_64",
      "metadata": {
        "sourcerpm": "pciutils"
      }
    },
    "pciutils-libs": {
      "evra": "3.13.0-5.fc41.x86_64",
      "metadata": {
        "sourcerpm": "pciutils"
      }
    },
    "pcre2": {
      "evra": "10.44-1.fc41.1.x86_64",
      "metadata": {
        "sourcerpm": "pcre2"
      }
    },
    "pcre2-syntax": {
      "evra": "10.44-1.fc41.1.noarch",
      "metadata": {
        "sourcerpm": "pcre2"
      }
    },
    "pigz": {
      "evra": "2.8-5.fc41.x86_64",
      "metadata": {
        "sourcerpm": "pigz"
      }
    },
    "pkgconf": {
      "evra": "2.3.0-1.fc41.x86_64",
      "metadata": {
        "sourcerpm": "pkgconf"
      }
    },
    "pkgconf-m4": {
      "evra": "2.3.0-1.fc41.noarch",
      "metadata": {
        "sourcerpm": "pkgconf"
      }
    },
    "pkgconf-pkg-config": {
      "evra": "2.3.0-1.fc41.x86_64",
      "metadata": {
        "sourcerpm": "pkgconf"
      }
    },
    "podman": {
      "evra": "5:5.4.0-1.fc41.x86_64",
      "metadata": {
        "sourcerpm": "podman"
      }
    },
    "policycoreutils": {
      "evra": "3.7-7.fc41.x86_64",
      "metadata": {
        "sourcerpm": "policycoreutils"
      }
    },
    "polkit": {
      "evra": "125-1.fc41.1.x86_64",
      "metadata": {
        "sourcerpm": "polkit"
      }
    },
    "polkit-libs": {
      "evra": "125-1.fc41.1.x86_64",
      "metadata": {
        "sourcerpm": "polkit"
      }
    },
    "popt": {
      "evra": "1.19-7.fc41.x86_64",
      "metadata": {
        "sourcerpm": "popt"
      }
    },
    "procps-ng": {
      "evra": "4.0.4-4.fc41.x86_64",
      "metadata": {
        "sourcerpm": "procps-ng"
      }
    },
    "protobuf-c": {
      "evra": "1.5.0-4.fc41.x86_64",
      "metadata": {
        "sourcerpm": "protobuf-c"
      }
    },
    "psmisc": {
      "evra": "23.7-3.fc41.x86_64",
      "metadata": {
        "sourcerpm": "psmisc"
      }
    },
    "publicsuffix-list-dafsa": {
      "evra": "20250116-1.fc41.noarch",
      "metadata": {
        "sourcerpm": "publicsuffix-list"
      }
    },
    "qed-firmware": {
      "evra": "20241210-1.fc41.noarch",
      "metadata": {
        "sourcerpm": "linux-firmware"
      }
    },
    "readline": {
      "evra": "8.2-10.fc41.x86_64",
      "metadata": {
        "sourcerpm": "readline"
      }
    },
    "rpcbind": {
      "evra": "1.2.7-1.rc1.fc41.x86_64",
      "metadata": {
        "sourcerpm": "rpcbind"
      }
    },
    "rpm": {
      "evra": "4.20.0-1.fc41.x86_64",
      "metadata": {
        "sourcerpm": "rpm"
      }
    },
    "rpm-libs": {
      "evra": "4.20.0-1.fc41.x86_64",
      "metadata": {
        "sourcerpm": "rpm"
      }
    },
    "rpm-ostree": {
      "evra": "2025.5-2.fc41.x86_64",
      "metadata": {
        "sourcerpm": "rpm-ostree"
      }
    },
    "rpm-ostree-libs": {
      "evra": "2025.5-2.fc41.x86_64",
      "metadata": {
        "sourcerpm": "rpm-ostree"
      }
    },
    "rpm-plugin-selinux": {
      "evra": "4.20.0-1.fc41.x86_64",
      "metadata": {
        "sourcerpm": "rpm"
      }
    },
    "rpm-sequoia": {
      "evra": "1.7.0-5.fc41.x86_64",
      "metadata": {
        "sourcerpm": "rust-rpm-sequoia"
      }
    },
    "rsync": {
      "evra": "3.4.1-1.fc41.x86_64",
      "metadata": {
        "sourcerpm": "rsync"
      }
    },
    "runc": {
      "evra": "2:1.2.5-1.fc41.x86_64",
      "metadata": {
        "sourcerpm": "runc"
      }
    },
    "samba-client-libs": {
      "evra": "2:4.21.4-1.fc41.x86_64",
      "metadata": {
        "sourcerpm": "samba"
      }
    },
    "samba-common": {
      "evra": "2:4.21.4-1.fc41.noarch",
      "metadata": {
        "sourcerpm": "samba"
      }
    },
    "samba-common-libs": {
      "evra": "2:4.21.4-1.fc41.x86_64",
      "metadata": {
        "sourcerpm": "samba"
      }
    },
    "sdbus-cpp": {
      "evra": "1.5.0-3.fc41.x86_64",
      "metadata": {
        "sourcerpm": "sdbus-cpp"
      }
    },
    "sed": {
      "evra": "4.9-3.fc41.x86_64",
      "metadata": {
        "sourcerpm": "sed"
      }
    },
    "selinux-policy": {
      "evra": "41.33-1.fc41.noarch",
      "metadata": {
        "sourcerpm": "selinux-policy"
      }
    },
    "selinux-policy-targeted": {
      "evra": "41.33-1.fc41.noarch",
      "metadata": {
        "sourcerpm": "selinux-policy"
      }
    },
    "setup": {
      "evra": "2.15.0-8.fc41.noarch",
      "metadata": {
        "sourcerpm": "setup"
      }
    },
    "sg3_utils": {
      "evra": "1.48-4.fc41.x86_64",
      "metadata": {
        "sourcerpm": "sg3_utils"
      }
    },
    "sg3_utils-libs": {
      "evra": "1.48-4.fc41.x86_64",
      "metadata": {
        "sourcerpm": "sg3_utils"
      }
    },
    "shadow-utils": {
      "evra": "2:4.15.1-12.fc41.x86_64",
      "metadata": {
        "sourcerpm": "shadow-utils"
      }
    },
    "shadow-utils-subid": {
      "evra": "2:4.15.1-12.fc41.x86_64",
      "metadata": {
        "sourcerpm": "shadow-utils"
      }
    },
    "shared-mime-info": {
      "evra": "2.3-6.fc41.x86_64",
      "metadata": {
        "sourcerpm": "shared-mime-info"
      }
    },
    "shim-x64": {
      "evra": "15.8-3.x86_64",
      "metadata": {
        "sourcerpm": "shim"
      }
    },
    "skopeo": {
      "evra": "1:1.18.0-1.fc41.x86_64",
      "metadata": {
        "sourcerpm": "skopeo"
      }
    },
    "slang": {
      "evra": "2.3.3-6.fc41.x86_64",
      "metadata": {
        "sourcerpm": "slang"
      }
    },
    "slirp4netns": {
      "evra": "1.3.1-1.fc41.x86_64",
      "metadata": {
        "sourcerpm": "slirp4netns"
      }
    },
    "snappy": {
      "evra": "1.2.1-2.fc41.x86_64",
      "metadata": {
        "sourcerpm": "snappy"
      }
    },
    "socat": {
      "evra": "1.8.0.0-4.fc41.x86_64",
      "metadata": {
        "sourcerpm": "socat"
      }
    },
    "spdlog": {
      "evra": "1.14.1-3.fc41.x86_64",
      "metadata": {
        "sourcerpm": "spdlog"
      }
    },
    "sqlite-libs": {
      "evra": "3.46.1-2.fc41.x86_64",
      "metadata": {
        "sourcerpm": "sqlite"
      }
    },
    "squashfs-tools": {
      "evra": "4.6.1-5.fc41.x86_64",
      "metadata": {
        "sourcerpm": "squashfs-tools"
      }
    },
    "ssh-key-dir": {
      "evra": "0.1.5-1.fc41.x86_64",
      "metadata": {
        "sourcerpm": "rust-ssh-key-dir"
      }
    },
    "sssd-ad": {
      "evra": "2.10.2-1.fc41.x86_64",
      "metadata": {
        "sourcerpm": "sssd"
      }
    },
    "sssd-client": {
      "evra": "2.10.2-1.fc41.x86_64",
      "metadata": {
        "sourcerpm": "sssd"
      }
    },
    "sssd-common": {
      "evra": "2.10.2-1.fc41.x86_64",
      "metadata": {
        "sourcerpm": "sssd"
      }
    },
    "sssd-common-pac": {
      "evra": "2.10.2-1.fc41.x86_64",
      "metadata": {
        "sourcerpm": "sssd"
      }
    },
    "sssd-ipa": {
      "evra": "2.10.2-1.fc41.x86_64",
      "metadata": {
        "sourcerpm": "sssd"
      }
    },
    "sssd-krb5": {
      "evra": "2.10.2-1.fc41.x86_64",
      "metadata": {
        "sourcerpm": "sssd"
      }
    },
    "sssd-krb5-common": {
      "evra": "2.10.2-1.fc41.x86_64",
      "metadata": {
        "sourcerpm": "sssd"
      }
    },
    "sssd-ldap": {
      "evra": "2.10.2-1.fc41.x86_64",
      "metadata": {
        "sourcerpm": "sssd"
      }
    },
    "sssd-nfs-idmap": {
      "evra": "2.10.2-1.fc41.x86_64",
      "metadata": {
        "sourcerpm": "sssd"
      }
    },
    "stalld": {
      "evra": "1.19.8-2.fc41.x86_64",
      "metadata": {
        "sourcerpm": "stalld"
      }
    },
    "sudo": {
      "evra": "1.9.15-5.p5.fc41.x86_64",
      "metadata": {
        "sourcerpm": "sudo"
      }
    },
    "systemd": {
      "evra": "256.11-1.fc41.x86_64",
      "metadata": {
        "sourcerpm": "systemd"
      }
    },
    "systemd-container": {
      "evra": "256.11-1.fc41.x86_64",
      "metadata": {
        "sourcerpm": "systemd"
      }
    },
    "systemd-libs": {
      "evra": "256.11-1.fc41.x86_64",
      "metadata": {
        "sourcerpm": "systemd"
      }
    },
    "systemd-pam": {
      "evra": "256.11-1.fc41.x86_64",
      "metadata": {
        "sourcerpm": "systemd"
      }
    },
    "systemd-resolved": {
      "evra": "256.11-1.fc41.x86_64",
      "metadata": {
        "sourcerpm": "systemd"
      }
    },
    "systemd-udev": {
      "evra": "256.11-1.fc41.x86_64",
      "metadata": {
        "sourcerpm": "systemd"
      }
    },
    "tar": {
      "evra": "2:1.35-4.fc41.x86_64",
      "metadata": {
        "sourcerpm": "tar"
      }
    },
    "teamd": {
      "evra": "1.32-9.fc41.x86_64",
      "metadata": {
        "sourcerpm": "libteam"
      }
    },
    "tini-static": {
      "evra": "0.19.0-9.fc41.x86_64",
      "metadata": {
        "sourcerpm": "tini"
      }
    },
    "toolbox": {
      "evra": "0.1.1-1.fc41.x86_64",
      "metadata": {
        "sourcerpm": "toolbox"
      }
    },
    "tpm2-tools": {
      "evra": "5.7-2.fc41.x86_64",
      "metadata": {
        "sourcerpm": "tpm2-tools"
      }
    },
    "tpm2-tss": {
      "evra": "4.1.3-3.fc41.x86_64",
      "metadata": {
        "sourcerpm": "tpm2-tss"
      }
    },
    "tpm2-tss-fapi": {
      "evra": "4.1.3-3.fc41.x86_64",
      "metadata": {
        "sourcerpm": "tpm2-tss"
      }
    },
    "tzdata": {
      "evra": "2025a-1.fc41.noarch",
      "metadata": {
        "sourcerpm": "tzdata"
      }
    },
    "userspace-rcu": {
      "evra": "0.14.0-5.fc41.x86_64",
      "metadata": {
        "sourcerpm": "userspace-rcu"
      }
    },
    "util-linux": {
      "evra": "2.40.4-1.fc41.x86_64",
      "metadata": {
        "sourcerpm": "util-linux"
      }
    },
    "util-linux-core": {
      "evra": "2.40.4-1.fc41.x86_64",
      "metadata": {
        "sourcerpm": "util-linux"
      }
    },
    "vim-data": {
      "evra": "2:9.1.1169-1.fc41.noarch",
      "metadata": {
        "sourcerpm": "vim"
      }
    },
    "vim-minimal": {
      "evra": "2:9.1.1169-1.fc41.x86_64",
      "metadata": {
        "sourcerpm": "vim"
      }
    },
    "wasmedge-rt": {
      "evra": "0.14.1-1.fc41.x86_64",
      "metadata": {
        "sourcerpm": "wasmedge"
      }
    },
    "which": {
      "evra": "2.21-42.fc41.x86_64",
      "metadata": {
        "sourcerpm": "which"
      }
    },
    "wireguard-tools": {
      "evra": "1.0.20210914-7.fc41.x86_64",
      "metadata": {
        "sourcerpm": "wireguard-tools"
      }
    },
    "xfsprogs": {
      "evra": "6.9.0-1.fc41.x86_64",
      "metadata": {
        "sourcerpm": "xfsprogs"
      }
    },
    "xxhash-libs": {
      "evra": "0.8.3-1.fc41.x86_64",
      "metadata": {
        "sourcerpm": "xxhash"
      }
    },
    "xz": {
      "evra": "1:5.6.2-2.fc41.x86_64",
      "metadata": {
        "sourcerpm": "xz"
      }
    },
    "xz-libs": {
      "evra": "1:5.6.2-2.fc41.x86_64",
      "metadata": {
        "sourcerpm": "xz"
      }
    },
    "yajl": {
      "evra": "2.1.0-24.fc41.x86_64",
      "metadata": {
        "sourcerpm": "yajl"
      }
    },
    "zchunk-libs": {
      "evra": "1.5.1-1.fc41.x86_64",
      "metadata": {
        "sourcerpm": "zchunk"
      }
    },
    "zincati": {
      "evra": "0.0.29-1.fc41.x86_64",
      "metadata": {
        "sourcerpm": "rust-zincati"
      }
    },
    "zlib-ng-compat": {
      "evra": "2.2.3-2.fc41.x86_64",
      "metadata": {
        "sourcerpm": "zlib-ng"
      }
    },
    "zram-generator": {
      "evra": "1.1.2-12.fc41.x86_64",
      "metadata": {
        "sourcerpm": "rust-zram-generator"
      }
    },
    "zstd": {
      "evra": "1.5.7-1.fc41.x86_64",
      "metadata": {
        "sourcerpm": "zstd"
      }
    }
  },
  "metadata": {
    "generated": "2025-03-06T00:00:00Z",
    "rpmmd_repos": {
      "fedora": {
        "generated": "2024-10-24T13:55:59Z"
      },
      "fedora-coreos-pool": {
        "generated": "2025-03-06T10:50:28Z"
      },
      "fedora-updates": {
        "generated": "2025-03-06T02:14:22Z"
      }
    }
  }
}
