<?xml version="1.0" encoding="utf-8"?>
<!-- Generator: Adobe Illustrator 24.0.0, SVG Export Plug-In . SVG Version: 6.00 Build 0)  -->
<svg version="1.1" id="Слой_1" xmlns="http://www.w3.org/2000/svg" xmlns:xlink="http://www.w3.org/1999/xlink" x="0px" y="0px"
	 viewBox="0 0 100 100" style="enable-background:new 0 0 100 100;" xml:space="preserve">
<style type="text/css">
	.st0{fill:#62A3D9;stroke:#000000;stroke-width:4.715;stroke-miterlimit:10;}
	.st1{fill:#FFFFFF;stroke:#000000;stroke-width:4.715;stroke-miterlimit:10;}
	.st2{fill:#98C6E5;}
	.st3{fill:#FFFFFF;}
	.st4{fill:#FFFFFF;stroke:#000000;stroke-width:4.7153;stroke-miterlimit:10;}
	.st5{clip-path:url(#SVGID_2_);}
</style>
<circle class="st0" cx="46.6" cy="48.4" r="34.3"/>
<path d="M46.6,85.1c-20.2,0-36.7-16.4-36.7-36.7c0-20.2,16.4-36.7,36.7-36.7s36.7,16.4,36.7,36.7C83.3,68.6,66.8,85.1,46.6,85.1z
	 M46.6,16.5c-17.6,0-31.9,14.3-31.9,31.9C14.7,66,29,80.3,46.6,80.3S78.5,66,78.5,48.4S64.2,16.5,46.6,16.5z"/>
<circle class="st1" cx="20" cy="26.7" r="8.1"/>
<g>
	<path d="M-365.7,24.2c2.9,0,5.6,0,8.4,0c0,2.9,0,5.8,0,8.8c1.1-0.1,2-0.2,3-0.4c0.1,0,0.3-0.4,0.3-0.6c0-1,0-2.1,0-3.1
		c0-0.4,0.3-0.8,0.5-1c2-1.4,4.6-1.4,6.5,0c0.3,0.2,0.5,0.6,0.5,1c0.1,1.1,0,2.1,0,3.2c0,0.2,0.2,0.5,0.4,0.6
		c0.9,0.2,1.9,0.2,2.9,0.4c0-2.9,0-5.8,0-8.8c2.8,0,5.6,0,8.5,0c0,0.3,0,0.6,0,0.9c0,8.2,0,16.4,0,24.6c0,0.5,0.1,0.9,0.5,1.3
		c1.4,1.3,2.7,2.7,4,4c0.2,0.2,0.4,0.5,0.4,0.8c0,3.1,0,6.2,0,9.4c-13.7,0-27.3,0-41.1,0c0-0.2,0-0.4,0-0.7c0-2.8,0-5.6,0-8.4
		c0-0.4,0.2-0.8,0.5-1.1c1.2-1.3,2.5-2.6,3.8-3.8c0.5-0.5,0.7-1,0.7-1.7c0-8.1,0-16.2,0-24.2C-365.7,24.9-365.7,24.6-365.7,24.2z
		 M-337,37.1c-0.1-0.1-0.1-0.1-0.2-0.1c-8.5-2.8-17.1-2.8-25.7-0.1c-0.2,0.1-0.4,0.4-0.4,0.7c0,2.1,0,4.2,0,6.3
		c0,2.4,1.6,4.5,3.9,4.8c1.7,0.3,3.4,0.1,5.2,0.1c0-1.4,0-2.7,0-4.2c2.7,0,5.2,0,7.9,0c0,1.4,0,2.8,0,4.3c1.5,0,2.8,0,4.1,0
		c2.7,0,4.9-2.1,5-4.8C-336.9,41.8-337,39.4-337,37.1z M-363.2,62.8c8.8,0,17.5,0,26.2,0c0-4.5,0-8.9,0-13.5c-2.7,2.6-6,1.8-9.1,2
		c0,1.8,0,3.5,0,5.2c0,0.3,0,0.7-0.2,0.8c-1.2,1.3-2.5,2.5-3.8,3.8c-0.9-1-1.8-1.9-2.7-2.7c-1-0.8-1.3-1.7-1.2-3
		c0.1-1.4,0-2.8,0-4.2c-3.2-0.1-6.5,0.6-9.2-2C-363.2,54-363.2,58.3-363.2,62.8z M-363.2,34.5c1.1-0.3,2.2-0.6,3.3-0.9
		c0.1,0,0.3-0.3,0.3-0.4c0-2.2,0-4.4,0-6.6c-1.2,0-2.4,0-3.6,0C-363.2,29.2-363.2,31.8-363.2,34.5z M-340.6,26.6c0,2.2,0,4.4,0,6.5
		c0,0.2,0.2,0.4,0.3,0.5c1.1,0.3,2.1,0.6,3.3,0.9c0-2.7,0-5.2,0-7.9C-338.2,26.6-339.3,26.6-340.6,26.6z M-365.7,54
		c-0.2,0.2-0.3,0.3-0.5,0.4c-1.7,1.2-2.4,2.8-2.1,4.9c0.2,1.1,0,2.3,0,3.5c0.9,0,1.7,0,2.5,0C-365.7,59.9-365.7,57-365.7,54z
		 M-332,62.8c0-2.1,0-4.1,0-6.1c0-0.1-0.1-0.3-0.2-0.4c-0.7-0.8-1.5-1.6-2.4-2.5c0,3.2,0,6.1,0,9C-333.7,62.8-332.9,62.8-332,62.8z
		 M-351.7,51.4c0,1.2,0.1,2.4,0,3.6c-0.2,1.4,0.8,2,1.6,2.7c1.3-0.8,1.8-1.8,1.6-3.3c-0.1-1,0-2.1,0-3.1
		C-349.7,51.4-350.6,51.4-351.7,51.4z M-351.5,32.3c1,0,1.8,0,2.7,0c0-0.6,0-1.1,0-1.6c0-1.2-0.2-1.5-1.5-1.4c-0.3,0-0.6,0-0.9,0.2
		c-0.2,0.1-0.4,0.3-0.4,0.5C-351.5,30.7-351.5,31.5-351.5,32.3z M-348.6,47.1c-1.1,0-2,0-3,0c0,0.6,0,1.2,0,1.8c1,0,2,0,3,0
		C-348.6,48.2-348.6,47.7-348.6,47.1z"/>
	<path class="st2" d="M-337,37.1c0,2.4,0.1,4.7,0,7.1c-0.1,2.7-2.3,4.7-5,4.8c-1.3,0-2.7,0-4.1,0c0-1.4,0-2.8,0-4.3
		c-2.7,0-5.3,0-7.9,0c0,1.4,0,2.8,0,4.2c-1.8,0-3.6,0.2-5.2-0.1c-2.3-0.4-3.9-2.5-3.9-4.8c0-2.1,0-4.2,0-6.3c0-0.2,0.2-0.6,0.4-0.7
		C-354.1,34.3-345.6,34.3-337,37.1C-337.1,37-337.1,37-337,37.1z M-346.3,38.2c-2.6,0-5.1,0-7.6,0c0,0.8,0,1.6,0,2.3
		c2.6,0,5.1,0,7.6,0C-346.3,39.7-346.3,39-346.3,38.2z"/>
	<path class="st2" d="M-363.2,62.8c0-4.5,0-8.9,0-13.5c2.7,2.6,5.9,1.9,9.2,2c0,1.4,0.1,2.8,0,4.2c-0.1,1.3,0.3,2.2,1.2,3
		c1,0.8,1.8,1.8,2.7,2.7c1.3-1.3,2.6-2.6,3.8-3.8c0.2-0.2,0.2-0.5,0.2-0.8c0-1.7,0-3.4,0-5.2c3.1-0.2,6.4,0.6,9.1-2
		c0,4.6,0,9,0,13.5C-345.8,62.8-354.5,62.8-363.2,62.8z"/>
	<path class="st3" d="M-363.2,34.5c0-2.7,0-5.2,0-7.9c1.2,0,2.4,0,3.6,0c0,2.2,0,4.4,0,6.6c0,0.1-0.2,0.4-0.3,0.4
		C-361,33.9-362.1,34.2-363.2,34.5z"/>
	<path class="st3" d="M-340.6,26.6c1.3,0,2.4,0,3.6,0c0,2.6,0,5.2,0,7.9c-1.1-0.3-2.2-0.6-3.3-0.9c-0.1,0-0.3-0.3-0.3-0.5
		C-340.6,31-340.6,28.8-340.6,26.6z"/>
	<path class="st3" d="M-365.7,54c0,3,0,5.9,0,8.8c-0.8,0-1.6,0-2.5,0c0-1.1,0.1-2.3,0-3.5c-0.3-2.1,0.4-3.7,2.1-4.9
		C-366.1,54.3-365.9,54.2-365.7,54z"/>
	<path class="st3" d="M-332,62.8c-0.9,0-1.7,0-2.5,0c0-2.9,0-5.8,0-9c0.9,0.9,1.6,1.7,2.4,2.5c0.1,0.1,0.2,0.3,0.2,0.4
		C-332,58.8-332,60.8-332,62.8z"/>
	<path class="st3" d="M-351.7,51.4c1.1,0,2,0,3.1,0c0,1-0.1,2.1,0,3.1c0.2,1.4-0.3,2.5-1.6,3.3c-0.8-0.7-1.7-1.3-1.6-2.7
		C-351.6,53.8-351.7,52.6-351.7,51.4z"/>
	<path class="st3" d="M-351.5,32.3c0-0.8,0-1.6,0-2.4c0-0.2,0.2-0.4,0.4-0.5c0.3-0.1,0.6-0.1,0.9-0.2c1.2-0.1,1.5,0.2,1.5,1.4
		c0,0.5,0,1.1,0,1.6C-349.7,32.3-350.5,32.3-351.5,32.3z"/>
	<path class="st3" d="M-348.6,47.1c0,0.6,0,1.1,0,1.8c-1,0-2,0-3,0c0-0.6,0-1.1,0-1.8C-350.6,47.1-349.7,47.1-348.6,47.1z"/>
	<path d="M-346.3,38.2c0,0.8,0,1.5,0,2.3c-2.5,0-5.1,0-7.6,0c0-0.8,0-1.5,0-2.3C-351.4,38.2-348.9,38.2-346.3,38.2z"/>
</g>
<g>
	<path d="M-294,46.6c0.8,0.1,1.4,0.1,1.9,0.4c1.6,0.6,2.4,1.8,2.5,3.4c0.1,2.6,0.1,5.2,0,7.8c-0.1,2.2-1.6,3.7-3.9,3.7
		c-0.7,0-1.2,0.1-1.7,0.8c-1,1.4-2.5,2.1-4.2,2.1c-4.8,0-9.5,0-14.3,0c-1.8,0-3.3-0.8-4.3-2.2c-0.4-0.5-0.8-0.7-1.4-0.6
		c-1.2,0.1-2.2-0.3-3.1-1.1c-0.7-0.7-1-1.7-1-2.7c0-2.5,0-4.9,0-7.4c0-2.3,1.5-3.8,3.9-3.9c0.1,0,0.2,0,0.5,0c0-2.8,0-5.7,0-8.6
		c-0.9,0-2,0-3.1,0c0-3.4,0-6.8,0-10.2c10.4,0,20.7,0,31.1,0c0,3.4,0,6.7,0,10.1c-1.1,0-2.1,0-3.1,0C-294,41-294,43.8-294,46.6z
		 M-296.1,50c0-0.3,0-0.5,0-0.7c0-3.1,0-6.1,0-9.2c0-2.3-1.3-3.6-3.5-3.6c-4.5,0-9.1,0-13.6,0c-2.3,0-3.5,1.3-3.6,3.6
		c0,3.1,0,6.1,0,9.2c0,0.2,0,0.5,0,0.7c1,0,2,0,3.1,0c0-1.4,0-2.8,0-4.2c0.8,0,1.4,0,2.2,0c0,1.4,0,2.8,0,4.2c3.4,0,6.7,0,10.1,0
		c0-1.4,0-2.8,0-4.2c0.8,0,1.4,0,2.2,0c0,1.4,0,2.8,0,4.3C-298.1,50-297.2,50-296.1,50z M-311.5,52.2c0,3.5,0,6.9,0,10.3
		c3.4,0,6.7,0,10,0c0-3.4,0-6.8,0-10.3C-304.8,52.2-308.1,52.2-311.5,52.2z M-301,30.1c-3.7,0-7.2,0-10.8,0c0,1.4,0,2.8,0,4.1
		c3.6,0,7.2,0,10.8,0C-301,32.8-301,31.5-301,30.1z M-314.1,30.1c-2,0-3.9,0-5.8,0c0,1.9,0,3.8,0,5.8c0.6,0,1.2,0,1.8,0
		c0.3,0,0.6,0,0.8-0.2c0.9-0.8,2-1.3,3.2-1.4C-314.1,32.9-314.1,31.5-314.1,30.1z M-293,30.1c-2,0-3.9,0-5.8,0c0,1.4,0,2.8,0,4.2
		c1.2,0.2,2.3,0.6,3.2,1.4c0.1,0.1,0.2,0.2,0.4,0.2c0.7,0,1.5,0,2.2,0C-293,33.9-293,32-293,30.1z M-316.8,52.2c0,2.5-0.1,5,0,7.5
		c0,1.6,1.6,2.9,3,2.8c0-3.4,0-6.8,0-10.2C-314.8,52.2-315.7,52.2-316.8,52.2z M-299.2,62.5c1.7-0.1,3.1-1.4,3.1-3.1
		c0-2.3,0-4.5,0-6.8c0-0.1,0-0.2-0.1-0.3c-1,0-2,0-3,0C-299.2,55.6-299.2,59-299.2,62.5z M-319,48.9c-1.5-0.1-2.2,0.4-2.2,1.8
		c0,2.4,0,4.7,0,7.1c0,1.4,0.8,2,2.2,1.7C-319,56-319,52.5-319,48.9z M-293.9,59.6c1.4,0.1,2.2-0.4,2.2-1.7c0-2.4,0-4.9,0-7.3
		c0-1.3-0.9-1.9-2.2-1.6C-293.9,52.5-293.9,56-293.9,59.6z"/>
	<path class="st3" d="M-296.1,50c-1.1,0-2.1,0-3.1,0c0-1.4,0-2.8,0-4.3c-0.7,0-1.4,0-2.2,0c0,1.4,0,2.8,0,4.2c-3.4,0-6.7,0-10.1,0
		c0-1.4,0-2.8,0-4.2c-0.8,0-1.4,0-2.2,0c0,1.4,0,2.8,0,4.2c-1.1,0-2.1,0-3.1,0c0-0.2,0-0.5,0-0.7c0-3.1,0-6.1,0-9.2
		c0-2.3,1.3-3.6,3.6-3.6c4.5,0,9.1,0,13.6,0c2.2,0,3.5,1.3,3.5,3.6c0,3.1,0,6.1,0,9.2C-296.1,49.5-296.1,49.7-296.1,50z
		 M-310.2,42.3c0,2.1,1.7,3.8,3.7,3.8c2.1,0,3.7-1.7,3.8-3.7c0-2.1-1.6-3.8-3.7-3.8C-308.5,38.6-310.2,40.3-310.2,42.3z"/>
	<path class="st2" d="M-311.5,52.2c3.4,0,6.7,0,10,0c0,3.4,0,6.8,0,10.3c-3.3,0-6.7,0-10,0C-311.5,59.1-311.5,55.7-311.5,52.2z"/>
	<path class="st2" d="M-301,30.1c0,1.4,0,2.7,0,4.1c-3.6,0-7.2,0-10.8,0c0-1.4,0-2.7,0-4.1C-308.3,30.1-304.7,30.1-301,30.1z"/>
	<path class="st2" d="M-314.1,30.1c0,1.4,0,2.8,0,4.2c-1.2,0.2-2.3,0.6-3.2,1.4c-0.2,0.2-0.5,0.2-0.8,0.2c-0.6,0-1.2,0-1.8,0
		c0-2,0-3.9,0-5.8C-317.9,30.1-316,30.1-314.1,30.1z"/>
	<path class="st2" d="M-293,30.1c0,1.9,0,3.8,0,5.8c-0.8,0-1.5,0-2.2,0c-0.1,0-0.3-0.1-0.4-0.2c-0.9-0.8-2-1.3-3.2-1.4
		c0-1.4,0-2.8,0-4.2C-296.9,30.1-295,30.1-293,30.1z"/>
	<path class="st2" d="M-316.8,52.2c1.1,0,2,0,3.1,0c0,3.4,0,6.8,0,10.2c-1.4,0.1-3-1.2-3-2.8C-316.8,57.2-316.8,54.7-316.8,52.2z"/>
	<path class="st2" d="M-299.2,62.5c0-3.4,0-6.8,0-10.3c1,0,2,0,3,0c0,0.1,0.1,0.2,0.1,0.3c0,2.3,0,4.5,0,6.8
		C-296.1,61.1-297.4,62.4-299.2,62.5z"/>
	<path class="st3" d="M-319,48.9c0,3.6,0,7.1,0,10.6c-1.4,0.3-2.2-0.4-2.2-1.7c0-2.4,0-4.7,0-7.1C-321.2,49.3-320.5,48.8-319,48.9z"
		/>
	<path class="st3" d="M-293.9,59.6c0-3.6,0-7.1,0-10.6c1.3-0.3,2.2,0.3,2.2,1.6c0,2.4,0,4.9,0,7.3
		C-291.7,59.2-292.4,59.7-293.9,59.6z"/>
	<path d="M-310.2,42.3c0-2.1,1.7-3.7,3.8-3.7c2.1,0,3.8,1.7,3.7,3.8c0,2.1-1.7,3.7-3.8,3.7C-308.5,46.1-310.2,44.4-310.2,42.3z
		 M-306.4,40.8c-0.9,0-1.6,0.7-1.6,1.6c0,0.9,0.7,1.7,1.6,1.6c0.9,0,1.6-0.7,1.6-1.6S-305.5,40.8-306.4,40.8z"/>
	<path class="st3" d="M-306.4,40.8c0.9,0,1.6,0.7,1.6,1.6c0,0.9-0.7,1.6-1.6,1.6s-1.6-0.7-1.6-1.6C-308,41.4-307.3,40.8-306.4,40.8z
		"/>
</g>
<circle class="st4" cx="80.9" cy="46.8" r="8.1"/>
<g>
	<defs>
		<circle id="SVGID_1_" cx="46.6" cy="48.4" r="31.9"/>
	</defs>
	<clipPath id="SVGID_2_">
		<use xlink:href="#SVGID_1_"  style="overflow:visible;"/>
	</clipPath>
	<g class="st5">
		<path d="M19.2,72.2c0-1.5,0-3,0-4.4c0-2.2,0.5-2.7,2.7-2.7c0.2,0,0.5,0,0.8,0c0-5.3,0-10.5,0-15.8c-2.1-0.5-2.3-0.8-2.3-2.9
			c0-1.4,0-2.9,0-4.5c-0.7,0-1.3,0-1.9,0c-1.1-0.1-1.8-0.7-1.8-1.8c0-2.4,0-4.7,0-7.1c0-1,0.5-1.6,1.4-1.9
			c9.6-3.2,19.1-6.4,28.7-9.5c0.5-0.2,1.1-0.1,1.6,0c9.5,3.1,19,6.3,28.5,9.4c1.1,0.4,1.6,1.1,1.6,2.3c0,2.1,0,4.2,0,6.3
			c0,1.7-0.6,2.3-2.3,2.3c-0.4,0-0.9,0-1.4,0c0,1.7,0,3.2,0,4.8c0,1.8-0.4,2.3-2.3,2.5c0,5.2,0,10.5,0,15.9c0.5,0,0.9,0,1.3,0
			c1.5,0,2.2,0.6,2.2,2.2c0,1.6,0,3.2,0,4.9c0.2,0.1,0.4,0.1,0.6,0.1c1.4,0.2,1.9,0.8,1.9,2.1c0,2.2,0,4.3,0,6.5
			c0,1.6-0.7,2.2-2.3,2.2c-7.6,0-15.1,0-22.7,0c-11.4,0-22.8,0-34.2,0c-2.1,0-2.7-0.5-2.7-2.6c0-1.8,0-3.6,0-5.4
			C16.6,72.9,16.9,72.6,19.2,72.2z M74.7,38.3c0-1.2,0-2.3,0-3.5c-18.2,0-36.3,0-54.4,0c0,1.2,0,2.4,0,3.5
			C38.5,38.3,56.5,38.3,74.7,38.3z M20.3,79.5c18.2,0,36.3,0,54.4,0c0-1.2,0-2.4,0-3.4c-18.2,0-36.3,0-54.4,0
			C20.3,77.2,20.3,78.3,20.3,79.5z M72.3,68.8c-16.6,0-33,0-49.4,0c0,1.2,0,2.3,0,3.4c16.5,0,32.9,0,49.4,0c0-0.5,0-0.9,0-1.3
			C72.3,70.3,72.3,69.6,72.3,68.8z M42,49.3c-2.1-0.4-2.4-0.8-2.4-2.8c0-1.5,0-2.9,0-4.5c-1.3,0-2.4,0-3.4,0
			c-0.1,0.1-0.1,0.2-0.1,0.3c0,1.4,0,2.7,0,4.1c0,2.2-0.3,2.5-2.3,3c0,5.2,0,10.5,0,15.7c2.8,0,5.5,0,8.3,0C42,59.7,42,54.6,42,49.3
			z M53,65c2.8,0,5.6,0,8.3,0c0-5.3,0-10.5,0-15.7c-2-0.4-2.3-0.8-2.3-2.9c0-1.5,0-2.9,0-4.4c-1.3,0-2.4,0-3.5,0
			c0,0.2-0.1,0.3-0.1,0.4c0,1.3,0,2.7,0,4c0,2.2-0.2,2.5-2.4,3C53,54.5,53,59.7,53,65z M30.4,30.8c0,0.1,0,0.1,0,0.2
			c11.4,0,22.9,0,34.5,0c-0.2-0.1-0.3-0.2-0.4-0.2c-5.4-1.8-10.9-3.6-16.3-5.4c-0.4-0.1-0.8-0.1-1.2,0C41.5,27.1,35.9,29,30.4,30.8z
			 M26.5,49.2c0,5.3,0,10.6,0,15.8c1.2,0,2.3,0,3.4,0c0-5.3,0-10.5,0-15.8C28.8,49.2,27.7,49.2,26.5,49.2z M45.8,49.2
			c0,5.3,0,10.6,0,15.8c1.2,0,2.3,0,3.4,0c0-5.3,0-10.5,0-15.8C48.1,49.2,47,49.2,45.8,49.2z M68.6,65c0-5.3,0-10.6,0-15.8
			c-1.2,0-2.3,0-3.4,0c0,5.3,0,10.5,0,15.8C66.3,65,67.4,65,68.6,65z M32.4,42c-2.9,0-5.6,0-8.3,0c0,1.2,0,2.3,0,3.4
			c2.8,0,5.6,0,8.3,0C32.4,44.3,32.4,43.2,32.4,42z M51.7,45.5c0-1.2,0-2.3,0-3.5c-2.8,0-5.5,0-8.3,0c0,1.2,0,2.3,0,3.5
			C46.1,45.5,48.8,45.5,51.7,45.5z M71,42c-2.9,0-5.6,0-8.3,0c0,1.2,0,2.3,0,3.4c2.8,0,5.5,0,8.3,0C71,44.3,71,43.2,71,42z"/>
		<path class="st3" d="M74.7,38.3c-18.2,0-36.2,0-54.4,0c0-1.2,0-2.3,0-3.5c18.1,0,36.2,0,54.4,0C74.7,35.9,74.7,37.1,74.7,38.3z"/>
		<path class="st3" d="M20.3,79.5c0-1.2,0-2.3,0-3.4c18.1,0,36.2,0,54.4,0c0,1.1,0,2.2,0,3.4C56.6,79.5,38.5,79.5,20.3,79.5z"/>
		<path class="st3" d="M72.3,68.8c0,0.8,0,1.5,0,2.2c0,0.4,0,0.8,0,1.3c-16.5,0-32.9,0-49.4,0c0-1.1,0-2.2,0-3.4
			C39.3,68.8,55.7,68.8,72.3,68.8z"/>
		<path class="st3" d="M30.4,30.8c5.5-1.8,11-3.7,16.6-5.5c0.4-0.1,0.8-0.1,1.2,0c5.5,1.8,10.9,3.6,16.3,5.4c0.1,0,0.2,0.1,0.4,0.2
			c-11.6,0-23,0-34.5,0C30.4,30.9,30.4,30.9,30.4,30.8z"/>
		<path class="st3" d="M26.5,49.2c1.2,0,2.2,0,3.4,0c0,5.3,0,10.5,0,15.8c-1.1,0-2.2,0-3.4,0C26.5,59.8,26.5,54.5,26.5,49.2z"/>
		<path class="st3" d="M45.8,49.2c1.2,0,2.3,0,3.4,0c0,5.3,0,10.5,0,15.8c-1.1,0-2.2,0-3.4,0C45.8,59.8,45.8,54.5,45.8,49.2z"/>
		<path class="st3" d="M68.6,65c-1.2,0-2.3,0-3.4,0c0-5.3,0-10.5,0-15.8c1.1,0,2.2,0,3.4,0C68.6,54.5,68.6,59.7,68.6,65z"/>
		<path class="st3" d="M32.4,42c0,1.2,0,2.2,0,3.4c-2.8,0-5.5,0-8.3,0c0-1.1,0-2.2,0-3.4C26.8,42,29.5,42,32.4,42z"/>
		<path class="st3" d="M51.7,45.5c-2.8,0-5.5,0-8.3,0c0-1.2,0-2.3,0-3.5c2.8,0,5.5,0,8.3,0C51.7,43.2,51.7,44.3,51.7,45.5z"/>
		<path class="st3" d="M71,42c0,1.2,0,2.3,0,3.4c-2.8,0-5.5,0-8.3,0c0-1.1,0-2.2,0-3.4C65.4,42,68.2,42,71,42z"/>
	</g>
</g>
</svg>
