<?xml version="1.0" encoding="utf-8"?>
<!-- Generator: Adobe Illustrator 28.1.0, SVG Export Plug-In . SVG Version: 6.00 Build 0)  -->
<svg version="1.1" id="Layer_1" xmlns="http://www.w3.org/2000/svg" xmlns:xlink="http://www.w3.org/1999/xlink" x="0px" y="0px"
	 viewBox="0 0 382.2 384" style="enable-background:new 0 0 382.2 384;" xml:space="preserve">
<style type="text/css">
	.st0{fill:#030303;}
	.st1{fill:#040708;}
	.st2{fill:#E23434;}
</style>
<path class="st0" d="M310.5,352.7c-34.6,0-69.1,0-103.7,0c-0.1-2.1-0.1-4.1-0.2-6.2c-0.4-3,0.5-4.9,3.9-4.5
	c5.1,0.1,10.2,0.1,15.3,0.3c1.5,0,1.7-0.8,1.7-1.9c0-5.6-0.1-11.3,0-16.9c0-1.3-0.3-1.9-1.7-1.9c-4.7,0.2-9.3-0.3-14,0.3
	c-0.8-0.1-1.4-0.2-2.2-0.2c-11,0-22,0-33,0c-37.5,0-74.9,0-112.4,0c-9.7,0-13.3-3.6-13.3-13.3c0-36.4,0-72.8,0-109.3
	c0-8.6,3.8-12.4,12.4-12.4c35.5,0,71,0,106.5,0c5.5,0,5.5,0,5.8,5.2c0,0.5-0.2,1.1-0.1,1.6c0.6,3.2-0.9,3.7-3.8,3.6
	c-8.1-0.2-16.1,0-24.2-0.1c-2.4,0-3.3,0.4-3.2,3c0.2,11.9,0.1,23.8,0,35.8c0,2.1,0.4,2.9,2.7,2.9c8.6-0.2,17.1-0.2,25.7,0
	c2.4,0,2.7-0.8,2.7-2.9c-0.1-8.8,0.1-17.6-0.1-26.4c-0.1-4.8,1.5-8.6,5.5-11.2c2.4-0.9,4.8-1.2,7.4-1.2c7.8,0,15.7-0.1,23.5-0.1
	c0.6,0.1,1.3,0,1.8,0.2c2.9,0.6,3.4-0.8,3.4-3.4c-0.3-4.6,0.1-9.2-0.1-13.8c-0.1-2.7,0.4-4,3.5-3.7c2.7,0.3,5.5,0.1,8.1,0.1
	c3.6-0.1,4.9-2,3.3-5.4c-1.5-3.1-3-6.2-4.6-9.2c-0.8-1.4-0.7-2.4,0.5-3.4c2.7-2.5,5.2-5.2,7.8-7.7c2.2-2.1,3.9-5.6,6.6-5.9
	c2.4-0.3,5.3,2,7.8,3.5c7,4,9.1,2.8,8.6-5.5c-0.2-2.5-0.8-5.8,0.4-7.3c1.5-1.8,4.9-0.3,7.5-0.6c0.2,0,0.4,0,0.6,0
	c1.5,0.2,2-0.3,1.9-1.9c-0.1-5.6-0.1-11.3,0-17c0-1.6-0.5-1.9-2-1.9c-9.1,0.1-18.2,0-27.3,0c-1.2,0-1.8,0.1-2.1,1.6
	c-1.3,6-5,8.8-11.1,8.9c-2.4,0.1-4.8,0.1-7.2,0c-1.8-0.1-2.4,0.5-2.4,2.3c0.1,4.3,0,8.6,0,12.8c0,5.4,0,5.4-5.1,5.8
	c-5.1-0.3-5.1-0.3-5.1-5.5c0-30.2,0-60.5,0-90.8c0-6.1-1.4-7.6-7.6-7.6c-50.3,0-100.5,0-150.8,0c-6.5,0-7.6,1.3-7.6,7.7
	c0,95.1,0,190.2,0,285.3c0,6.6,1.2,7.8,7.9,7.8c47.4,0,94.6,0,142,0c5.5,0,5.5,0,5.7,5.5c-0.1,1.7-0.2,3.3-0.2,5
	c-51.3,0-102.6,0-153.9,0c-5.7-2.2-9.7-6.2-11.9-11.9c0-99.3,0-198.5,0-297.9c0.2-0.1,0.4-0.2,0.5-0.3C34.5,33.7,38.6,31,48.3,31
	c24.4,0,48.8,0,73.2,0c26.5,0,53,0,79.4,0c7.8,0,13.9,4.7,15.7,11.9c0.6,2.3,0.4,4.6,0.3,6.9c-0.1,1.5,0.4,2,1.9,1.9
	c2.9-0.1,5.6-0.1,8.5,0c5.1,0.2,9.2,3.3,10.1,8.2c0.3,2,1.3,2.2,2.9,2.2c5,0,10.1-0.2,15,0.2c12.8,0.8,23.1,11.3,23.7,24.1
	c0.3,4.9,0.2,9.8,0.1,14.8c0,1.8,0.4,2.8,2.4,2.5c1-0.1,2.1,0,3.1,0c14.3,0.6,25.1,11.1,25.6,24.9c0.3,6,0.3,6-5.9,6
	c-0.4,0-0.8-0.1-1.3,0c-2.5,0.4-3.5-0.4-3.3-3.1c0.9-10.1-6.3-18.6-18.9-17.6c-1.6,0.1-1.9,0.7-1.8,2.1c0.1,5.5,0.1,11.1,0,16.6
	c0,1.7,0.6,2.2,2.2,2.1c2.1-0.1,4.2,0.1,6.3-0.1c1.7-0.1,2.1,0.5,2.1,2.2c-0.1,3.1-0.1,6.3,0,9.4c0.1,3.6,2.1,5,5.3,3.4
	c3.1-1.5,6.2-3,9.2-4.6c1.3-0.7,2.3-0.8,3.4,0.4c4.2,4.4,8.5,8.6,12.8,12.8c1.2,1.1,1.2,1.9,0.5,3.2c-1.7,3.1-3.3,6.3-4.8,9.5
	c-1.4,3.1-0.2,5.1,3.3,5.2c3.1,0.1,6.3,0.1,9.4,0c1.8-0.1,2.4,0.4,2.4,2.3c-0.2,3.4-0.1,6.7,0,10.1c0.1,2.8-1.3,6.5,0.6,8.1
	c1.5,1.3,5.2,0.4,7.9,0.4c8.4,0,12.3,3.9,12.3,12.3c0,33.3,0,66.6,0,99.8c0,8.6-3.9,12.3-12.5,12.3c-15.5,0-31,0.1-46.5-0.1
	c-2.4,0-3.5,0.3-3.4,3.1c0.3,5,0.2,10.1,0,15c-0.1,1.9,0.3,2.7,2.5,2.6c5.4-0.2,10.7,0,16-0.1c1.8,0,2.4,0.5,2.3,2.3
	C310.4,347.3,310.5,350,310.5,352.7z M264,207.5c-24.9,0-49.9,0-74.7-0.1c-2.4,0-3.4,0.3-3.4,3.1c0.1,25.6,0.1,51.3,0,76.9
	c0,2.2,0.3,3.2,2.9,3c4.2-0.3,8.4-0.1,12.6-0.1c21.6,0,43.2,0,64.7,0c1.8,0,3.2,0,3-2.5c-0.3-3.4-0.1-6.9-0.1-10.3
	c0-8.2,0-8.2,8.2-7.9c1.6,0.1,2.2,0.4,2.2,2.1c-0.1,3.5,0,7.1,0,10.7c0,8.2,0,8.1,8.1,8.1c2.1,0,2.4-0.8,2.4-2.5
	c-0.1-10.5,0-20.9,0-31.4c0-7.6,0-7.6,7.6-7.6c2.5-0.1,2.9,0.9,2.9,3c-0.1,10.2-0.1,20.5-0.1,30.8c0,7.8,0,7.7,7.8,7.8
	c2.3,0,2.7-0.8,2.7-2.9c-0.1-17.5-0.1-34.9-0.1-52.5c0-7.1,0-6.9,7.1-7.1c2.7-0.1,3.3,0.7,3.3,3.3c-0.1,18.6,0,37.3-0.1,55.9
	c0,2.4,0.4,3.4,3,3.2c4.9-0.3,9.8-0.3,14.8,0c2.5,0.1,3.1-0.8,3.1-3.1c-0.1-25.6-0.1-51.3,0-76.9c0-2.6-0.8-3-3.2-3
	C313.6,207.5,288.8,207.5,264,207.5z M118.2,290.5c-18.1,0-36,0-54.1-0.1c-2.2,0-2.9,0.6-2.8,2.8c0.2,5.2,0.1,10.5,0,15.7
	c0,1.8,0.5,2.4,2.3,2.4c5.2-0.1,10.5-0.2,15.7,0c2.2,0.1,2.9-0.6,2.9-2.8c0-8.1,0.1-8.1,8.1-7.7c0.1,0,0.3,0,0.3,0
	c1.3-0.2,1.8,0.5,1.8,1.8c-0.1,2.1,0.1,4.2-0.1,6.3c-0.2,2,0.7,2.4,2.5,2.4c5.1-0.1,10.2-0.2,15.4,0c2.4,0.1,2.9-0.6,2.9-2.9
	c-0.1-8.1,0-8.1,8.2-7.6c1.6,0.1,2.3,0.5,2.2,2.2c-0.1,2.1,0.1,4.2-0.1,6.3c-0.1,1.7,0.6,2.1,2.2,2.1c3.5-0.1,7.1,0,10.7,0
	c2.5,0,5.7,0.8,7.3-0.4c1.8-1.3,0.3-4.7,0.6-7.1c0-0.4,0-0.8,0-1.3c0-1,0.3-1.6,1.4-1.6c2.8,0.1,6-1,8.2,0.5
	c1.6,1.1,0.3,4.3,0.6,6.6c0,0.3,0.1,0.7,0,0.9c-0.3,1.8,0.3,2.6,2.4,2.5c5.4-0.2,10.7-0.2,16,0c2.1,0.1,2.4-0.8,2.4-2.5
	c-0.1-5.1-0.2-10.2,0-15.4c0.1-2.4-0.7-2.9-2.9-2.9C154.5,290.5,136.3,290.5,118.2,290.5z M310,197c1,0,2.1,0,3.1,0
	c7.8,0,7.8,0,7.6-7.8c0-0.2,0-0.4,0-0.6c0.2-1.3-0.3-1.8-1.8-1.8c-9.8,0.2-17.9-10.5-11.4-21.4c1.6-2.7,1.3-4.2-0.9-6.3
	c-1.8-1.8-3.3-2.3-5.5-0.8c-1.3,0.8-2.8,1.4-4.3,1.9c-7.2,2.4-15-1.9-17.1-9.2c-0.5-1.8,0.4-4.5-1.3-5.5c-1.7-0.8-4.1-0.3-6.2-0.3
	c-0.3,0-0.7,0.1-0.9,0c-1.9-0.3-2.4,0.5-2.4,2.4c-0.4,8.6-7.6,14.3-16,12.8c-2.5-0.4-4.6-1.8-6.9-2.9c-0.8-0.3-1.4-0.9-2.5-0.2
	c-3.9,2.9-4.4,4.2-2.2,8.6c0.4,0.9,0.9,1.9,1.3,2.9c2.4,7.5-2,15.5-9.6,17.4c-1.8,0.4-4.2-0.6-5,1.3c-0.7,1.6-0.2,3.7-0.2,5.5
	c0,0.2,0,0.4,0,0.6c-0.4,2.5,0.3,3.4,3.1,3.4c4.9-0.3,9.8-0.3,14.8,0c2.6,0.1,3.2-0.5,3-3.2c-1-18.1,14.9-31.4,32.2-27.1
	c12,2.9,20.2,14.2,19.2,27c-0.3,2.9,0.6,3.6,3.3,3.4C305.4,196.8,307.7,197,310,197z M243,311.2c16.6,0,33.3,0,49.9,0
	c7.1,0,7.1,0,7.2-7.1c0.1-2.8-0.7-3.4-3.4-3.4c-34.4,0.1-68.9,0.1-103.3,0.1c-7.5,0-7.4,0-7.5,7.5c-0.1,2.5,0.7,3.1,3.1,3
	C207.1,311.2,225,311.2,243,311.2z M253.4,103.7c4.5,0,9-0.1,13.5,0c1.6,0,2.2-0.4,2.2-2.1c-0.1-4.7,0.1-9.4-0.1-14.1
	c-0.3-8.1-6.8-14.6-14.9-14.9c-4.8-0.2-9.7-0.1-14.4,0c-0.8,0-1.5-0.3-1.9,0.9c-3,8.1-4.9,9.5-13.1,9.5c-7.7,0-7.6,0-7.6,8
	c0,2,0.6,2.5,2.5,2.4c2.6-0.2,5.2-0.1,7.8,0c5.3,0.2,9.3,3.3,10.2,8.4c0.3,1.9,1.2,2.1,2.7,2.1C244.6,103.7,249,103.7,253.4,103.7z
	 M118.2,249c-16.6,0-33.3,0-49.9,0c-6.9,0-6.7,0-7,6.8c-0.1,3.1,1,3.5,3.7,3.5c34.4-0.1,68.9-0.1,103.3-0.1c7.1,0,7,0,7.2-7.1
	c0.1-2.8-0.9-3.2-3.4-3.2C154.2,249,136.2,249,118.2,249z M102.9,217.9c0,6,0.1,11.9,0,17.9c0,1.8,0.3,2.8,2.5,2.8
	c8.8-0.2,17.6-0.1,26.4,0c1.8,0,2.3-0.5,2.3-2.3c-0.1-12.3-0.1-24.7,0-37c0-1.8-0.5-2.4-2.3-2.3c-8.8,0.1-17.6,0.1-26.4,0
	c-1.9,0-2.5,0.6-2.4,2.4C103,205.6,102.9,211.7,102.9,217.9z M92.5,217.8c0-6.1-0.1-12.3,0-18.5c0-1.8-0.5-2.4-2.3-2.3
	c-8.9,0.1-17.8,0.1-26.7,0c-1.6,0-2.2,0.5-2.2,2.1c0.1,12.4,0.1,24.9,0,37.4c0,1.7,0.6,2.1,2.2,2.1c8.9-0.1,17.8-0.1,26.7,0
	c1.8,0,2.4-0.4,2.3-2.3C92.4,230.1,92.5,223.9,92.5,217.8z M258.7,342.3c6,0,12.2,0,18.2,0c1.7,0,2.4-0.3,2.4-2.2
	c-0.1-5.5-0.1-10.9,0-16.3c0-1.8-0.7-2.3-2.4-2.3c-12.3,0.1-24.5,0.1-36.8,0c-1.9,0-2.5,0.7-2.4,2.5c0.1,5.2,0.2,10.5,0,15.7
	c-0.1,2.2,0.8,2.6,2.8,2.6C246.5,342.2,252.6,342.3,258.7,342.3z M274.1,197c4.2,0,8.4-0.1,12.5,0.1c1.8,0.1,2.5-0.7,2.9-2.4
	c1.2-5.8-1.5-12.3-6.7-15.8c-5.3-3.5-12.2-3.4-17.4,0.1c-5.2,3.6-7.8,10.2-6.5,16.2c0.3,1.7,1.3,1.8,2.7,1.8
	C265.8,197,270,197,274.1,197z M336.4,311.2c5.2,0,5.2,0,5.2-5.2c0-0.1,0-0.2,0-0.3c0-4.9,0-4.9-5-4.9c-5.4,0-5.4,0-5.4,5.5
	C331.3,311.2,331.3,311.2,336.4,311.2z M222.2,72.5c5.3,0,5.3,0,5.3-5.1c0-5.3,0-5.3-5.2-5.3c-5.3,0-5.3,0-5.3,5.1
	C217,72.5,217,72.5,222.2,72.5z M315.8,311.2c5,0,5,0,5-5.1c0-5.3,0-5.3-5.2-5.3c-5.1,0-5.1,0-5.1,5
	C310.5,311.2,310.5,311.2,315.8,311.2z M222.2,114c5.3,0,5.3,0,5.3-4.9c0-5.5,0-5.5-5.4-5.5c-5.1,0-5.1,0-5.1,5
	C217,114,217,114,222.2,114z M66.6,280c5.1,0,5.1,0,5.1-5c0-5.2,0-5.2-5.2-5.2c-5.1,0-5.1,0-5.1,5C61.4,280,61.4,280,66.6,280z
	 M92.5,275.1c0-5.4,0-5.4-5.4-5.4c-5,0-5,0-5,4.9c0,5.4,0,5.4,5.4,5.4C92.5,280,92.5,280,92.5,275.1z M123.8,274.6
	c0,5.4,0,5.4,5.5,5.4c4.9,0,4.9,0,4.9-5c0-5.3,0-5.3-5.4-5.3C123.8,269.8,123.8,269.8,123.8,274.6z M154.7,275c0-5.2,0-5.2-5.2-5.2
	c-5,0-5,0-5,5c0,5.2,0,5.2,5.2,5.2C154.7,280,154.7,280,154.7,275z M170.6,269.8c-5.4,0-5.4,0-5.4,5.3c0,5,0,5,4.9,5
	c5.4,0,5.4,0,5.4-5.4C175.5,269.8,175.5,269.8,170.6,269.8z M113.3,274.9c0-5.2,0-5.2-5.2-5.2c-5,0-5,0-5,5c0,5.2,0,5.2,5.3,5.2
	C113.3,280,113.3,280,113.3,274.9z"/>
<path d="M123.8,134.7c-20.3,0-40.6,0-61,0c-7.8,0-11.8-4-11.8-11.8c0-3-0.1-6,0-9.1c0.2-5.7,4.3-9.9,10-10.1c3.9-0.2,8-0.1,11.9-0.1
	c36.9,0,73.7,0,110.6,0c9.2,0,12.7,3.5,12.7,12.7c0,2.5,0,5,0,7.6c-0.1,6.6-4.3,10.7-10.9,10.7C164.8,134.7,144.3,134.7,123.8,134.7
	z M107.9,114c-2.5,0-5,0-7.6,0c-8.1,0-8.1,0-7.9,8.3c0.1,1.8,0.6,2.3,2.4,2.3c7.1-0.1,14,0,21.1,0c8.2,0,8.1,0,8-8.3
	c-0.1-1.8-0.7-2.3-2.4-2.3C116.9,114.1,112.3,114,107.9,114z M71.8,114c-0.8,0-1.7,0-2.5,0c-8.5,0-8.5,0-7.9,8.6c0,0.1,0,0.2,0,0.3
	c-0.1,1.2,0.4,1.7,1.7,1.7c5.9,0,11.7,0,17.6,0c1,0,1.6-0.3,1.6-1.4c-0.1-2.9,1-6.3-0.5-8.6c-1.1-1.7-4.5-0.3-6.8-0.5
	C73.8,113.9,72.8,114,71.8,114z M180.7,114c-5.2,0-5.2,0-5.2,4.9c0,5.6,0,5.6,5.5,5.6c5,0,5,0,5-5.1C186,114,186,114,180.7,114z
	 M154.7,119.3c0,5.2,0,5.2,5,5.2c5.6,0,5.6,0,5.6-5.5c0-5,0-5-5.1-5C154.7,114,154.7,114,154.7,119.3z M144.5,119.1
	c0-5.1,0-5.1-5-5.1c-5.5,0-5.5,0-5.5,5.5c0,5,0,5,5.1,5C144.5,124.5,144.5,124.5,144.5,119.1z"/>
<path d="M123.6,93.2c-20.3,0-40.6,0-60.9,0c-7.6,0-11.7-4.1-11.7-11.6c0-3-0.1-6,0-9.1c0.2-5.9,4.2-10,10.1-10.3
	c2.7-0.2,5.5-0.1,8.1-0.1c38.3,0,76.6,0,114.9,0c4.1,0,7.6,0.8,10.2,4.4c2.8,3.9,2.9,18.6,0,22.4c-2.3,3.1-5.4,4.4-9.2,4.4
	C164.6,93.2,144.1,93.2,123.6,93.2z M108,83c2.6,0,5.2,0,7.8,0c8.1,0,8,0,8-8c0-2.2-0.8-2.5-2.8-2.5c-6.9,0.1-13.9,0-20.7,0
	c-8.1,0-8.1,0-7.9,8.2c0.1,1.8,0.7,2.3,2.4,2.3C99.2,82.9,103.6,83,108,83z M71.7,83c0.9,0,1.8,0,2.9,0c7.8,0,7.7,0,7.7-7.8
	c0-2.3-0.8-2.8-2.9-2.7c-3.4,0.2-6.9,0.1-10.3,0.1c-8.2,0-8.1,0-7.7,8.4c0.1,1.7,0.6,2.2,2.2,2.1C66.2,82.9,69,83,71.7,83z
	 M175.5,77.6c0,5.4,0,5.4,5.2,5.4c0.1,0,0.2,0,0.3,0c5,0,5,0,5-4.9c0-5.6,0-5.6-5.5-5.6C175.5,72.5,175.5,72.5,175.5,77.6z
	 M165.2,77.8c0-5.3,0-5.3-5.5-5.3c-5,0-5,0-5,5.1c0,5.4,0,5.4,5.5,5.4C165.2,83,165.2,83,165.2,77.8z M139,83c5.5,0,5.5,0,5.5-5.4
	c0-5.1,0-5.1-5-5.1c-5.5,0-5.5,0-5.5,5.4C134,83,134,83,139,83z"/>
<path d="M123.9,145.2c20.1,0,40.2,0,60.3,0c8.2,0,12,3.8,12,12.1c0,2.3,0,4.6,0,6.9c0,8.1-3.9,11.9-11.8,11.9c-22.8,0-45.7,0-68.5,0
	c-17.7,0-35.4,0-53.1,0c-7.8,0-11.8-4-11.8-11.8c0-2.6,0-5.2,0-7.9c0.1-7.1,4.1-11.3,11.3-11.3C82.9,145.2,103.3,145.2,123.9,145.2z
	 M108,155.5c-2.6,0-5.2,0-7.8,0c-7.8,0-7.7,0-7.7,7.7c0,2.1,0.5,2.9,2.8,2.9c6.9-0.2,13.8-0.1,20.7-0.1c8.2,0,8.1,0,8-8.2
	c-0.1-1.8-0.5-2.4-2.3-2.4C116.9,155.6,112.5,155.5,108,155.5z M71.8,166c0.8,0,1.7,0,2.5,0c8.6,0,8.5,0,8-8.6c-0.1-1.5-0.5-2-2-1.9
	c-3.7,0.1-7.3,0-11,0c-8.5,0-8.5,0-7.9,8.6c0.1,1.4,0.5,2,2,2C66.1,165.9,69,166,71.8,166z M181,155.5c-5.5,0-5.5,0-5.5,5.5
	c0,0.1,0,0.2,0,0.3c0,4.7,0,4.7,4.8,4.7c5.7,0,5.7,0,5.7-5.7C186,155.5,186,155.5,181,155.5z M154.7,160.8c0,5.3,0,5.3,5.2,5.3
	c0.1,0,0.2,0,0.3,0c5,0,5,0,5-5.1c0-5.4,0-5.4-5.4-5.4C154.7,155.5,154.7,155.5,154.7,160.8z M144.5,160.8c0-5.3,0-5.3-5.2-5.3
	c-0.1,0-0.2,0-0.3,0c-5,0-5,0-5,5.1c0,5.5,0,5.5,5.3,5.5C144.5,166,144.5,166,144.5,160.8z"/>
<path class="st0" d="M232.7,269.7c-5,0-10.1,0.1-15,0c-6.6-0.1-10.7-4.3-10.9-10.8c0-1.2-0.1-2.4,0-3.4c0.4-3.8,0.3-6.6-4.6-7.8
	c-3.9-0.9-5.6-4.8-5.8-8.9c-0.2-3.5-0.2-7.1,0-10.7c0.3-5.8,4.4-10,10.2-10.3c3.6-0.2,7.3-0.2,11,0c5,0.3,8.5,3.3,9.6,8.1
	c0.5,2.2,1.4,2.5,3.4,2.4c5.7-0.2,11.5-0.1,17.3,0c6.6,0.1,10.7,4.1,10.8,10.7c0.1,6.7,0.1,13.4,0,20.1c-0.1,6.3-4.4,10.5-10.7,10.6
	C242.7,269.8,237.7,269.7,232.7,269.7z M232.9,259.3c4.3,0,8.6-0.1,12.8,0c1.8,0.1,2.6-0.4,2.5-2.4c-0.2-5.3-0.2-10.7,0-16
	c0.1-2-0.7-2.4-2.5-2.4c-5.1,0.1-10.2,0.2-15.4,0c-2-0.1-2.9,0.4-3.4,2.5c-0.6,3.3-2.6,6.2-5.7,6.9c-4.5,0.9-4.6,3.7-4.3,7.1
	c0.1,0.8,0.1,1.4,0,2.2c-0.2,1.6,0.5,2.2,2.1,2.2C223.7,259.2,228.3,259.3,232.9,259.3z M212.1,228.2c-5.3,0-5.3,0-5.3,5.4
	c0,4.9,0,4.9,5,4.9c5.4,0,5.4,0,5.3-5.5C217,228.2,217,228.2,212.1,228.2z"/>
<path class="st1" d="M165.2,217.9c0,2.7-0.1,5.5,0,8.1c0.1,1.6-0.3,2.2-2.1,2.2c-8.5,0.3-8.5,0.4-8.5-8c0-3.5,0.1-7.1,0-10.7
	c-0.1-1.6,0.3-2.1,2.1-2.2c8.5-0.3,8.5-0.4,8.5,8C165.2,216.3,165.2,217.1,165.2,217.9z"/>
<path class="st1" d="M123.8,218.2c0,2.6-0.1,5.2,0,7.8c0.1,1.5-0.3,2.2-2.1,2.3c-8.5,0.3-8.5,0.4-8.5-8c0-3.5,0.1-7.1,0-10.7
	c0-1.5,0.3-2.2,2-2.2c8.5-0.3,8.5-0.4,8.5,8C123.8,216.4,123.8,217.3,123.8,218.2z"/>
<path class="st1" d="M82.2,217.9c0,2.9-0.1,5.6,0,8.5c0.1,1.5-0.6,1.9-2,1.9c-8.5,0.4-8.5,0.5-8.5-8c0-3.6,0.1-7.3,0-10.9
	c0-1.5,0.5-1.8,1.9-1.9c8.6-0.4,8.6-0.4,8.6,7.9C82.2,216.2,82.2,217,82.2,217.9z"/>
<path class="st2" d="M108,83c-4.4,0-8.8-0.1-13.2,0c-1.7,0-2.4-0.4-2.4-2.3c-0.2-8.2-0.3-8.2,7.9-8.2c6.9,0,13.9,0.1,20.7,0
	c1.9,0,2.7,0.3,2.8,2.5c0,8,0.1,8-8,8C113.3,83,110.6,83,108,83z"/>
<path class="st2" d="M71.7,83c-2.7,0-5.5-0.1-8.1,0c-1.6,0.1-2.1-0.5-2.2-2.1c-0.4-8.4-0.4-8.4,7.7-8.4c3.4,0,6.9,0.1,10.3-0.1
	c2.1-0.1,2.9,0.4,2.9,2.7c0,7.8,0.1,7.8-7.7,7.8C73.5,83,72.6,83,71.7,83z"/>
<path class="st2" d="M175.5,77.6c0-5.1,0-5.1,5-5.1c5.5,0,5.5,0,5.5,5.6c0,4.9,0,4.9-5,4.9c-0.1,0-0.2,0-0.3,0
	C175.5,83,175.5,83,175.5,77.6z"/>
<path class="st2" d="M165.2,77.8c0,5.2,0,5.2-5,5.2c-5.5,0-5.5,0-5.5-5.4c0-5.1,0-5.1,5-5.1C165.2,72.5,165.2,72.5,165.2,77.8z"/>
<path class="st2" d="M139,83c-5,0-5,0-5-5.1c0-5.4,0-5.4,5.5-5.4c5,0,5,0,5,5.1C144.5,83,144.5,83,139,83z"/>
</svg>
