{
    "Test" : "Тест",
    "Tests" : "Тесты",
    "add question" : "Добавить вопрос",
    "finish" : "финиш",
    "New Test" : "Новый Тест",
    "Results": "Результаты",
    "Open Problem" : "Открытая задача"
}