<?xml version="1.0" encoding="utf-8"?>
<!-- Generator: Adobe Illustrator 24.0.0, SVG Export Plug-In . SVG Version: 6.00 Build 0)  -->
<svg version="1.1" id="Capa_1" xmlns="http://www.w3.org/2000/svg" xmlns:xlink="http://www.w3.org/1999/xlink" x="0px" y="0px"
	 viewBox="0 0 512 512" style="enable-background:new 0 0 512 512;" xml:space="preserve">
<g>
	<g>
		<path d="M391.6,149.6h-34c-3.1,0-5.6,2.5-5.6,5.6c0,3.1,2.5,5.6,5.6,5.6H386v141.9H174.6c-3.1,0-5.6,2.5-5.6,5.6
			c0,3.1,2.5,5.6,5.6,5.6h217c3.1,0,5.6-2.5,5.6-5.6V155.2C397.2,152.1,394.7,149.6,391.6,149.6z"/>
	</g>
</g>
<g>
	<g>
		<path d="M335.1,149.6H120.4c-3.1,0-5.6,2.5-5.6,5.6v153.1c0,3.1,2.5,5.6,5.6,5.6h31.7c3.1,0,5.6-2.5,5.6-5.6
			c0-3.1-2.5-5.6-5.6-5.6H126V160.8h209.1c3.1,0,5.6-2.5,5.6-5.6C340.7,152.1,338.2,149.6,335.1,149.6z"/>
	</g>
</g>
<g>
	<g>
		<circle cx="256" cy="138.9" r="5.5"/>
	</g>
</g>
<g>
	<g>
		<path d="M203.6,218.9c-3.1,0-5.6,2.5-5.6,5.6v9.5c0,3.1,2.5,5.6,5.6,5.6c3.1,0,5.6-2.5,5.6-5.6v-9.5
			C209.2,221.4,206.7,218.9,203.6,218.9z"/>
	</g>
</g>
<g>
	<g>
		<path d="M308.4,218.9c-3.1,0-5.6,2.5-5.6,5.6v9.5c0,3.1,2.5,5.6,5.6,5.6s5.6-2.5,5.6-5.6v-9.5
			C314.1,221.4,311.5,218.9,308.4,218.9z"/>
	</g>
</g>
<g>
	<g>
		<path d="M272.6,229.1c-2.3-2-5.9-1.8-7.9,0.5c-2.1,2.4-5.3,3.8-8.7,3.8c-3.4,0-6.6-1.4-8.7-3.8c-2-2.3-5.6-2.6-7.9-0.5
			c-2.3,2-2.6,5.6-0.5,7.9c4.2,4.9,10.5,7.6,17.2,7.6c6.7,0,12.9-2.8,17.2-7.6C275.2,234.7,275,231.1,272.6,229.1z"/>
	</g>
</g>
<g>
	<g>
		<path d="M442,335.4h-12.1V148.7c0-17.6-14.3-31.8-31.8-31.8H114c-17.6,0-31.8,14.3-31.8,31.8v186.7H70c-3.1,0-5.6,2.5-5.6,5.6
			v21.3c0,18.1,14.7,32.8,32.8,32.8h317.7c18.1,0,32.8-14.7,32.8-32.8V341C447.6,337.9,445.1,335.4,442,335.4z M93.3,148.7
			c0-11.4,9.2-20.6,20.6-20.6H398c11.4,0,20.6,9.2,20.6,20.6v186.7H93.3V148.7z M314.8,346.6v1.4c0,6.4-5.2,11.6-11.6,11.6h-94.4
			c-6.4,0-11.6-5.2-11.6-11.6v-1.4H314.8z M436.4,362.3c0,11.9-9.7,21.5-21.5,21.5H97.1c-11.9,0-21.5-9.7-21.5-21.5v-15.7H186v1.4
			c0,12.6,10.2,22.8,22.8,22.8h94.4c12.6,0,22.8-10.2,22.8-22.8v-1.4h110.4V362.3z"/>
	</g>
</g>
</svg>
