<?xml version="1.0" encoding="utf-8"?>
<!-- Generator: Adobe Illustrator 24.0.0, SVG Export Plug-In . SVG Version: 6.00 Build 0)  -->
<svg version="1.1" id="Слой_1" xmlns="http://www.w3.org/2000/svg" xmlns:xlink="http://www.w3.org/1999/xlink" x="0px" y="0px"
	 viewBox="0 0 100 100" style="enable-background:new 0 0 100 100;" xml:space="preserve">
<style type="text/css">
	.st0{fill:#62A3D9;stroke:#000000;stroke-width:4.715;stroke-miterlimit:10;}
	.st1{fill:#FFFFFF;stroke:#000000;stroke-width:4.7153;stroke-miterlimit:10;}
	.st2{fill:#FFFFFF;}
	.st3{fill:#FFFFFF;stroke:#000000;stroke-width:4.715;stroke-miterlimit:10;}
</style>
<circle class="st0" cx="46.6" cy="48.4" r="34.3"/>
<path d="M46.6,85.1c-20.2,0-36.7-16.4-36.7-36.7c0-20.2,16.4-36.7,36.7-36.7s36.7,16.4,36.7,36.7C83.3,68.6,66.8,85.1,46.6,85.1z
	 M46.6,16.5c-17.6,0-31.9,14.3-31.9,31.9C14.7,66,29,80.3,46.6,80.3S78.5,66,78.5,48.4S64.2,16.5,46.6,16.5z"/>
<image style="overflow:visible;enable-background:new    ;" width="243" height="292" xlink:href="A697232E.jpg"  transform="matrix(0.998 0 0 0.998 -7893.7544 -7770.3149)">
</image>
<circle class="st1" cx="80.9" cy="46.8" r="8.1"/>
<g>
	<path d="M56.5,79.6c0,2.3,0,4.3,0,6.3c0,2-0.7,2.7-2.8,2.7c-7.2,0-14.4,0-21.6,0c-2.1,0-2.7-0.7-2.7-2.8c0-6,0-11.9,0-17.9
		c0-0.7-0.3-1.5-0.8-2c-5.6-6.1-7.2-13.3-5.9-21.3c0.2-1.4,0.9-2,2.4-2c1.8,0,3.6,0,5.5,0c0-5.3,0-10.4,0-15.7c-1.3,0-2.6-0.1-3.9,0
		c-0.3,0-0.7,0.6-0.9,1c-1.4,2.2-4,3.4-6.4,2.9c-2.6-0.5-4.6-2.6-5-5.2c-0.4-2.7,0.9-5.2,3.3-6.4c2.9-1.5,6.5-0.5,8.1,2.5
		c0.4,0.8,0.9,1,1.7,1c1.5-0.1,3.1,0,4.6,0c2,0,2.7,0.7,2.7,2.7c0,5.1,0,10.2,0,15.3c0,0.5,0,1.1,0,1.7c2.8,0,5.4,0,8.1,0
		c0-0.6,0.1-1,0.1-1.5c0-2.5,0-4.9,0-7.4c0-1.7,0-3.1-1.9-4.1c-2.2-1.3-2.8-4.4-1.8-6.9c1-2.5,3.5-4.1,6.1-3.9
		c2.6,0.2,4.9,2.1,5.5,4.6c0.7,2.6-0.3,5.3-2.6,6.7c-1.1,0.6-1.3,1.3-1.3,2.5c0.1,3.3,0,6.6,0,10.1c2.7,0,5.3,0,8.2,0
		c0-0.5,0-1,0-1.5c0-5.1,0-10.2,0-15.3c0-2.2,0.6-2.8,2.8-2.8c1.4,0,2.7-0.1,4.1,0c1.1,0.1,1.7-0.2,2.2-1.2c1.5-2.6,4.7-3.6,7.5-2.4
		c2.8,1.2,4.4,4.1,3.7,7.1c-0.7,2.8-3.4,4.9-6.4,4.7c-2.6-0.2-4.3-1.7-5.4-4c-1.4,0-2.8,0-4.3,0c0,5.2,0,10.3,0,15.7
		c1.7,0,3.4,0,5.1,0c2.6,0,3.3,0.5,3.1,3.1c-0.3,4.1,0.6,7.6,3.1,10.9c0.6,0.8,1.1,1.8,1.6,2.7c2.3,3.8,0.1,7.8-4.3,8.1
		c-0.3,0-0.5,0-1,0.1c0,1.1,0,2.2,0,3.3c0,5.6-3.4,8.9-8.9,9C57.7,79.6,57.2,79.6,56.5,79.6z M52.5,84.4c0-2.2,0-4.4,0-6.5
		c0-1.8,0.8-2.4,2.6-2.5c1,0,2.1,0,3.1,0c3.3,0,4.8-1.5,4.8-4.9c0-1.5,0-3.1,0-4.6c0-2.1,0.6-2.8,2.7-2.8c0.6,0,1.3,0,1.9,0
		c1.6,0,1.9-0.7,1.1-2.1c-1.1-1.8-2.2-3.7-3.3-5.5c-1.2-2-1.8-4.1-1.8-6.5c0-0.8,0-1.6,0-2.4c-3.5,0-6.8,0-10.2,0
		c0.2,0.4,0.3,0.6,0.4,0.8c3.3,6,0.7,12.8-5.8,15c-0.8,0.3-1,0.7-1,1.5c0,6.3,0,12.7,0,19c0,0.4,0.1,0.9,0.1,1.4
		C48.9,84.4,50.5,84.4,52.5,84.4z M42.9,84.4c0-0.3,0.1-0.5,0.1-0.6c0-6.6,0-13.3,0-19.9c0-0.8-0.4-1-1.1-1.3c-6.3-2.1-9-9-5.8-14.9
		c0.2-0.3,0.3-0.6,0.5-1c-3.5,0-6.8,0-10.1,0c-0.8,6.6,1,12.3,5.7,17c0.9,0.9,1.3,1.8,1.3,3c0,5.4,0,10.8,0,16.2c0,0.5,0,1,0.1,1.5
		C36.7,84.4,39.7,84.4,42.9,84.4z M45.1,46.7c-3.4,0-6.2,2.7-6.2,6.1c0,3.4,2.8,6.2,6.2,6.2c3.3,0,6.1-2.7,6.1-6.1
		C51.2,49.5,48.5,46.7,45.1,46.7z M20.4,26.8c1.1,0,2-0.9,2-2c0-1.1-0.9-2.1-2-2.1c-1.1,0-2,0.9-2,2C18.4,25.8,19.3,26.8,20.4,26.8z
		 M47.1,24.7c0-1.1-0.9-2-2-2c-1.1,0-2.1,0.9-2,2.1c0,1.1,0.9,2,2,2C46.1,26.8,47.1,25.9,47.1,24.7z M71.7,24.8c0-1.1-0.9-2-2-2
		c-1.1,0-2.1,0.9-2.1,2c0,1.1,0.9,2,2,2C70.7,26.8,71.7,25.9,71.7,24.8z"/>
	<path class="st2" d="M52.5,84.4c-1.9,0-3.6,0-5.3,0c0-0.5-0.1-0.9-0.1-1.4c0-6.3,0-12.7,0-19c0-0.8,0.1-1.2,1-1.5
		c6.5-2.2,9.1-9,5.8-15c-0.1-0.2-0.2-0.5-0.4-0.8c3.4,0,6.7,0,10.2,0c0,0.8,0,1.6,0,2.4c0,2.3,0.6,4.5,1.8,6.5
		c1.1,1.8,2.2,3.6,3.3,5.5c0.8,1.4,0.5,2-1.1,2.1c-0.6,0-1.3,0-1.9,0c-2.1,0-2.7,0.6-2.7,2.8c0,1.5,0,3.1,0,4.6
		c0,3.3-1.5,4.9-4.8,4.9c-1,0-2.1,0-3.1,0c-1.8,0-2.5,0.7-2.6,2.5C52.4,80.1,52.5,82.2,52.5,84.4z"/>
	<path class="st2" d="M42.9,84.4c-3.2,0-6.2,0-9.3,0c0-0.5-0.1-1-0.1-1.5c0-5.4,0-10.8,0-16.2c0-1.2-0.4-2.1-1.3-3
		c-4.7-4.7-6.5-10.3-5.7-17c3.4,0,6.7,0,10.1,0c-0.2,0.4-0.3,0.7-0.5,1c-3.2,5.8-0.5,12.7,5.8,14.9c0.7,0.2,1.1,0.4,1.1,1.3
		c0,6.6,0,13.3,0,19.9C43,84,42.9,84.1,42.9,84.4z"/>
	<path class="st2" d="M45.1,46.7c3.4,0,6.1,2.8,6.1,6.2c0,3.3-2.8,6.1-6.1,6.1c-3.4,0-6.2-2.8-6.2-6.2
		C38.9,49.4,41.6,46.7,45.1,46.7z M47.1,53c0-1.1-0.9-2.1-2-2.1c-1.1,0-2,0.9-2,2c0,1.1,0.9,2.1,2,2.1C46.1,55,47,54.1,47.1,53z"/>
	<path class="st2" d="M20.4,26.8c-1.1,0-2-1-2-2.1c0-1.1,0.9-2,2-2c1.1,0,2,1,2,2.1C22.4,25.9,21.5,26.8,20.4,26.8z"/>
	<path class="st2" d="M47.1,24.7c0,1.1-0.9,2.1-2,2.1c-1.1,0-2-0.9-2-2c0-1.1,0.9-2.1,2-2.1C46.1,22.7,47,23.6,47.1,24.7z"/>
	<path class="st2" d="M71.7,24.8c0,1.1-1,2.1-2.1,2c-1.1,0-2-0.9-2-2c0-1.1,1-2.1,2.1-2C70.8,22.8,71.7,23.7,71.7,24.8z"/>
	<path d="M47.1,53c0,1.1-0.9,2-2,2c-1.1,0-2.1-1-2-2.1c0-1.1,0.9-2,2-2C46.2,50.9,47.1,51.8,47.1,53z"/>
</g>
<circle class="st1" cx="29.5" cy="79" r="8.1"/>
<circle class="st3" cx="20" cy="26.7" r="8.1"/>
</svg>
