<?xml version="1.0" encoding="utf-8"?>
<!-- Generator: Adobe Illustrator 24.0.0, SVG Export Plug-In . SVG Version: 6.00 Build 0)  -->
<svg version="1.1" id="dark" xmlns="http://www.w3.org/2000/svg" xmlns:xlink="http://www.w3.org/1999/xlink" x="0px" y="0px"
	 viewBox="0 0 2000 340" style="enable-background:new 0 0 2000 340;" xml:space="preserve">
<style type="text/css">
	.st0{fill:#4B485A;}
	.st1{fill:#E3E032;}
	.st2{fill:#D2E6F8;}
	.st3{fill:#F5EB79;}
</style>
<g>
	<rect y="0" class="st0" width="2005.2" height="26.9"/>
</g>
<g>
	<path class="st0" d="M1933.1,240.6h-1694v0c0-15.1,12.2-27.3,27.3-27.3h1666.7V240.6z"/>
</g>
<path class="st0" d="M1275.3,63.3h37.3V79l-14.6,43.6l17.6,51.1v15.7h-39.3l-10.6-48.8h-7v48.8h-39.4V63.3h39.4v45.7h7L1275.3,63.3z
	"/>
<path class="st0" d="M1365.9,150.1v39.3h-39.4V63.3h78.7c9.4,0,15.8,6.5,15.8,15.7v55.3c0,9.2-6.5,15.8-15.8,15.8H1365.9z
	 M1365.9,118.6h15.7V95h-15.7V118.6z"/>
<path class="st0" d="M1507.8,63.3l17.6,110.4v15.7H1486l-2.3-25.4h-17.3l-2.5,25.4h-39.3v-15.7l17.6-110.4H1507.8z M1480.8,132.5
	l-3.6-37.5h-4.3l-3.6,37.5H1480.8z"/>
<path class="st0" d="M1536.2,189.4V63.3h84.3V79l-6.3,16h-38.7v14h38.7v31.5h-38.7v17.3h45v31.5H1536.2z"/>
<path class="st0" d="M1631.3,189.4V63.3h78.7c9.4,0,15.8,6.5,15.8,15.7v29c0,9.2-7.6,15.1-16.2,15.1v3.4c8.6,0,16.2,5.9,16.2,15.3
	v31.9c0,9.2-6.5,15.7-15.8,15.7H1631.3z M1686.4,95h-15.7v14h15.7V95z M1670.8,157.9h15.7v-17.3h-15.7V157.9z"/>
<path class="st0" d="M1738.5,189.4V63.3h84.3V79l-6.3,16h-38.7v14h38.7v31.5h-38.7v17.3h45v31.5H1738.5z"/>
<path class="st0" d="M1828.1,157.9h11.7l19.3-94.5h75.6v94.5h10.4v31.5h-117.1V157.9z M1895.3,94.8h-5.6l-9.7,63h15.3V94.8z"/>
<g>
	<path class="st1" d="M270.4,285.6v-32.4h24.3v32.4h-10.1v-24.3h-4v24.3H270.4z"/>
	<path class="st2" d="M313.2,275.5v10.1H303v-32.4h20.2c2.4,0,4.1,1.7,4.1,4v14.2c0,2.4-1.7,4.1-4.1,4.1H313.2z M313.2,267.4h4v-6.1
		h-4V267.4z"/>
	<path class="st2" d="M339.3,285.6c-2.4,0-4.1-1.7-4.1-4v-24.4c0-2.4,1.7-4,4.1-4h16.2c2.4,0,4.1,1.7,4.1,4v24.4c0,2.4-1.7,4-4.1,4
		H339.3z M345.4,261.4v16.2h4v-16.2H345.4z"/>
	<path class="st2" d="M367.9,285.6v-32.4h21.7v4l-1.6,4.1h-10v3.6h10v8.1h-10v4.4h11.6v8.1H367.9z"/>
	<path class="st2" d="M411.4,253.2h9.6v4l-3.8,11.2l4.5,13.2v4h-10.1l-2.7-12.6h-1.8v12.6H397v-32.4h10.1V265h1.8L411.4,253.2z"/>
	<path class="st2" d="M427.8,261.4v-8.2h22.7v4l-1.6,4.1H444v24.3h-10.1v-24.3H427.8z"/>
	<path class="st2" d="M471.6,265v-11.8h10.1v32.4h-10.1v-12.6h-4.1v12.6h-10.1v-32.4h10.1V265H471.6z"/>
	<path class="st2" d="M494.1,285.6c-2.4,0-4.1-1.7-4.1-4v-24.4c0-2.4,1.7-4,4.1-4h16.2c2.4,0,4.1,1.7,4.1,4v24.4c0,2.4-1.7,4-4.1,4
		H494.1z M500.2,261.4v16.2h4v-16.2H500.2z"/>
	<path class="st2" d="M544.7,266.2v6.5h-22.9v-6.5H544.7z"/>
	<path class="st3" d="M566.3,253.2h10.1v32.4h-10.1v-4l1.5-10.4h-0.8l-4.8,11.2v3.2h-10.1v-32.4h10.1v4l-1.5,10.4h0.8l4.8-11.2
		V253.2z"/>
	<path class="st2" d="M606.4,253.2v4l-1.6,4.1h-10v16.2h11.5v8.1h-17.6c-2.4,0-4.1-1.7-4.1-4v-24.4c0-2.4,1.7-4,4.1-4H606.4z"/>
	<path class="st2" d="M635.5,253.2v4l-1.6,4.1h-10v16.2h11.5v8.1h-17.6c-2.4,0-4.1-1.7-4.1-4v-24.4c0-2.4,1.7-4,4.1-4H635.5z"/>
	<path class="st2" d="M656.9,285.6v-24.3h-1.4l-3.8,24.3h-10.2v-4l6.1-28.4H667v32.4H656.9z"/>
	<path class="st2" d="M675.3,285.6v-32.4H697v4l-1.6,4.1h-10v3.6h10v8.1h-10v4.4H697v8.1H675.3z"/>
	<path class="st2" d="M703,277.5h3l5-24.3h19.5v24.3h2.7v8.1H703V277.5z M720.3,261.3h-1.4l-2.5,16.2h3.9V261.3z"/>
	<path class="st2" d="M744.2,285.6c-2.4,0-4.1-1.7-4.1-4v-24.4c0-2.4,1.7-4,4.1-4h16.2c2.4,0,4.1,1.7,4.1,4v24.4c0,2.4-1.7,4-4.1,4
		H744.2z M750.2,261.4v16.2h4v-16.2H750.2z"/>
	<path class="st2" d="M772.8,285.6v-32.4H793c2.4,0,4.1,1.7,4.1,4v7.5c0,2.4-1.9,3.9-4.2,3.9v0.9c2.2,0,4.2,1.5,4.2,3.9v8.2
		c0,2.4-1.7,4-4.1,4H772.8z M786.9,261.4h-4v3.6h4V261.4z M782.9,277.5h4v-4.4h-4V277.5z"/>
	<path class="st2" d="M825.4,253.2l4.5,28.4v4h-10.1l-0.6-6.5h-4.4l-0.6,6.5H804v-4l4.5-28.4H825.4z M818.5,271l-0.9-9.6h-1.1
		l-0.9,9.6H818.5z"/>
	<path class="st2" d="M834.1,261.4v-8.2h22.7v4l-1.6,4.1h-4.9v24.3h-10.1v-24.3H834.1z"/>
	<path class="st2" d="M863.8,285.6v-32.4h21.7v4l-1.6,4.1h-10v3.6h10v8.1h-10v4.4h11.6v8.1H863.8z"/>
	<path class="st2" d="M906.9,285.6v-24.3h-1.4l-3.8,24.3h-10.2v-4l6.1-28.4H917v32.4H906.9z"/>
	<path class="st2" d="M949.7,267.4v14.2c0,2.4-1.7,4.1-4,4.1h-20.3v-32.4h10.1v10.1h10.1C948,263.4,949.7,265,949.7,267.4z
		 M939.5,277.5v-6.1h-4v6.1H939.5z"/>
	<path class="st2" d="M979.2,253.2v4l-1.6,4.1h-10v16.2h11.5v8.1h-17.6c-2.4,0-4.1-1.7-4.1-4v-24.4c0-2.4,1.7-4,4.1-4H979.2z"/>
	<path class="st2" d="M1001,253.2h9.6v4l-3.8,11.2l4.5,13.2v4h-10.1l-2.7-12.6h-1.8v12.6h-10.1v-32.4h10.1V265h1.8L1001,253.2z"/>
	<path class="st2" d="M1039.3,253.2l4.5,28.4v4h-10.1l-0.6-6.5h-4.4l-0.6,6.5h-10.1v-4l4.5-28.4H1039.3z M1032.4,271l-0.9-9.6h-1.1
		l-0.9,9.6H1032.4z"/>
	<path class="st2" d="M1075.1,285.6H1065v-10.1h-2l-2.7,10.1h-9.9v-4l3.1-8c-1.5-0.4-2.7-2.1-2.7-3.7v-12.6c0-2.4,1.7-4.1,4.1-4.1
		h20.2V285.6z M1060.9,267.4h4v-6.1h-4V267.4z"/>
	<path class="st3" d="M1110.8,285.6v-32.4h24.3v32.4H1125v-24.3h-4v24.3H1110.8z"/>
	<path class="st2" d="M1143.4,285.6v-32.4h21.7v4l-1.6,4.1h-10v3.6h10v8.1h-10v4.4h11.6v8.1H1143.4z"/>
	<path class="st2" d="M1171.1,277.5h3l5-24.3h19.5v24.3h2.7v8.1h-30.1V277.5z M1188.4,261.3h-1.4l-2.5,16.2h3.9V261.3z"/>
	<path class="st2" d="M1228.7,253.2l4.5,28.4v4h-10.1l-0.6-6.5h-4.4l-0.6,6.5h-10.1v-4l4.5-28.4H1228.7z M1221.7,271l-0.9-9.6h-1.1
		l-0.9,9.6H1221.7z"/>
	<path class="st2" d="M1250.8,285.6h-10.1v-32.4h21.7v4l-1.6,4.1h-10V285.6z"/>
	<path class="st2" d="M1273.3,285.6c-2.4,0-4.1-1.7-4.1-4v-24.4c0-2.4,1.7-4,4.1-4h16.2c2.4,0,4.1,1.7,4.1,4v24.4c0,2.4-1.7,4-4.1,4
		H1273.3z M1279.4,261.4v16.2h4v-16.2H1279.4z"/>
	<path class="st2" d="M1312.1,285.6h-10.1v-32.4h21.7v4l-1.6,4.1h-10V285.6z"/>
	<path class="st2" d="M1344.7,253.2h10.1v32.4h-10.1v-4l1.5-10.4h-0.8l-4.8,11.2v3.2h-10.1v-32.4h10.1v4l-1.5,10.4h0.8l4.8-11.2
		V253.2z"/>
	<path class="st2" d="M1362.7,270.6v-17.4h10.1v13.4h4.1v-13.4h10.1v32.4h-10.1v-10.9h-10.1C1364.4,274.7,1362.7,273,1362.7,270.6z"
		/>
	<path class="st2" d="M1395.3,285.6v-32.4h21.7v4l-1.6,4.1h-10v3.6h10v8.1h-10v4.4h11.6v8.1H1395.3z"/>
	<path class="st2" d="M1446.1,253.2v4l-1.6,4.1h-10v16.2h11.5v8.1h-17.6c-2.4,0-4.1-1.7-4.1-4v-24.4c0-2.4,1.7-4,4.1-4H1446.1z"/>
	<path class="st2" d="M1467.9,253.2h9.6v4l-3.8,11.2l4.5,13.2v4h-10.1l-2.7-12.6h-1.8v12.6h-10.1v-32.4h10.1V265h1.8L1467.9,253.2z"
		/>
	<path class="st2" d="M1506.2,253.2l4.5,28.4v4h-10.1l-0.6-6.5h-4.4l-0.6,6.5h-10.1v-4l4.5-28.4H1506.2z M1499.2,271l-0.9-9.6h-1.1
		l-0.9,9.6H1499.2z"/>
	<path class="st2" d="M1542,285.6h-10.1v-10.1h-2l-2.7,10.1h-9.9v-4l3.2-8c-1.5-0.4-2.7-2.1-2.7-3.7v-12.6c0-2.4,1.7-4.1,4.1-4.1
		h20.2V285.6z M1527.8,267.4h4v-6.1h-4V267.4z"/>
	<path class="st3" d="M1591.7,285.6v-24.3h-1.4l-3.8,24.3h-10.2v-4l6.1-28.4h19.4v32.4H1591.7z"/>
	<path class="st2" d="M1630.6,253.2l4.5,28.4v4H1625l-0.6-6.5h-4.4l-0.6,6.5h-10.1v-4l4.5-28.4H1630.6z M1623.6,271l-0.9-9.6h-1.1
		l-0.9,9.6H1623.6z"/>
	<path class="st2" d="M1666.8,269v12.6c0,2.4-1.7,4.1-4,4.1h-20.2v-32.4h24.1v4l-1.6,4.1h-12.4v3.7h10.1
		C1665.1,265,1666.8,266.7,1666.8,269z M1656.7,277.5v-4.4h-4.1v4.4H1656.7z"/>
	<path class="st2" d="M1678.8,285.6c-2.4,0-4.1-1.7-4.1-4v-24.4c0-2.4,1.7-4,4.1-4h16.2c2.4,0,4.1,1.7,4.1,4v24.4c0,2.4-1.7,4-4.1,4
		H1678.8z M1684.8,261.4v16.2h4v-16.2H1684.8z"/>
	<path class="st2" d="M1717.5,275.5v10.1h-10.1v-32.4h20.2c2.4,0,4.1,1.7,4.1,4v14.2c0,2.4-1.7,4.1-4.1,4.1H1717.5z M1717.5,267.4h4
		v-6.1h-4V267.4z"/>
	<path class="st2" d="M1758.6,253.2l4.5,28.4v4H1753l-0.6-6.5h-4.4l-0.6,6.5h-10.1v-4l4.5-28.4H1758.6z M1751.7,271l-0.9-9.6h-1.1
		l-0.9,9.6H1751.7z"/>
	<path class="st2" d="M1767.3,261.4v-8.2h22.7v4l-1.6,4.1h-4.9v24.3h-10.1v-24.3H1767.3z"/>
	<path class="st2" d="M1801,285.6c-2.4,0-4.1-1.7-4.1-4v-24.4c0-2.4,1.7-4,4.1-4h16.2c2.4,0,4.1,1.7,4.1,4v24.4c0,2.4-1.7,4-4.1,4
		H1801z M1807.1,261.4v16.2h4v-16.2H1807.1z"/>
	<path class="st2" d="M1839.8,275.5v10.1h-10.1v-32.4h20.2c2.4,0,4.1,1.7,4.1,4v14.2c0,2.4-1.7,4.1-4.1,4.1H1839.8z M1839.8,267.4h4
		v-6.1h-4V267.4z"/>
	<path class="st2" d="M1876,253.2h10.1v32.4H1876v-4l1.5-10.4h-0.8l-4.8,11.2v3.2h-10.1v-32.4h10.1v4l-1.5,10.4h0.8l4.8-11.2V253.2z
		"/>
	<path class="st2" d="M1918.3,285.6h-10.1v-10.1h-2l-2.7,10.1h-9.9v-4l3.2-8c-1.5-0.4-2.7-2.1-2.7-3.7v-12.6c0-2.4,1.7-4.1,4.1-4.1
		h20.2V285.6z M1904.1,267.4h4v-6.1h-4V267.4z"/>
</g>
</svg>
