{
    "masks": [
        {
            "src" 	: "brush1",
            "title" : "Brush 1",
            "id":1,
            "groups":[1]
        },
        {
            "src" 	: "brush2",
            "title" : "Brush 2",
            "id":2,
            "groups":[1]
        },
        {
            "src" 	: "brush3",
            "title" : "Brush 3",
            "id":3,
            "groups":[1]
        },
        {
            "src" 	: "brush4",
            "title" : "Brush 4",
            "id":4,
            "groups":[1]
        },
        {
            "src" 	: "brush5",
            "title" : "Brush 5",
            "id":5,
            "groups":[1]
        },
        {
            "src" 	: "brush6",
            "title" : "Brush 6",
            "id":6,
            "groups":[1]
        },
        {
            "src" 	: "brush7",
            "title" : "Brush 7",
            "id":7,
            "groups":[1]
        },
        {
            "src" 	: "brush8",
            "title" : "Brush 8",
            "id":8,
            "groups":[1]
        },
        {
            "src" 	: "brush9",
            "title" : "Brush 9",
            "id":9,
            "groups":[1]
        },
        {
            "src" 	: "brush10",
            "title" : "Brush 10",
            "id":10,
            "groups":[1]
        },
        {
            "src" 	: "brush11",
            "title" : "Brush 11",
            "id":11,
            "groups":[1]
        },
        {
            "src" 	: "brush12",
            "title" : "Brush 12",
            "id":12,
            "groups":[1]
        },
        {
            "src" 	: "brush13",
            "title" : "Brush 13",
            "id":13,
            "groups":[1]
        },
        {
            "src" 	: "brush14",
            "title" : "Brush 14",
            "id":14,
            "groups":[1]
        },
        {
            "src" 	: "brush15",
            "title" : "Brush 15",
            "id": 15,
            "groups":[1]
        },
        {
            "src" 	: "romb1",
            "title" : "Romb 1",
            "id": 201,
            "groups":[2]
        },
        {
            "src" 	: "treegg",
            "title" : "Egg",
            "id": 201,
            "groups":[2]
        },
        {
            "src" 	: "window1",
            "title" : "Window 1",
            "id": 301,
            "groups":[3]
        },
        {
            "src" 	: "window2",
            "title" : "Window 2",
            "id": 302,
            "groups":[3]
        },
        {
            "src" 	: "window3",
            "title" : "Window 3",
            "id": 303,
            "groups":[3]
        }
    ], 
    "groups": [
        {
            "id":1,
            "title": "Brushes"
        },
        {
            "id":2,
            "title": "Primitives"
        },
        {
            "id":3,
            "title": "Windows"
        }
    ]
}