<?xml version="1.0" encoding="utf-8"?>
<!-- Generator: Adobe Illustrator 24.0.0, SVG Export Plug-In . SVG Version: 6.00 Build 0)  -->
<svg version="1.1" id="Слой_1" xmlns="http://www.w3.org/2000/svg" xmlns:xlink="http://www.w3.org/1999/xlink" x="0px" y="0px"
	 viewBox="0 0 3200 430" style="enable-background:new 0 0 3200 430;" xml:space="preserve">
<style type="text/css">
	.st0{fill:#000102;}
	.st1{display:none;}
	.st2{display:inline;fill:#6DA3B2;}
	.st3{display:inline;fill:#567884;}
	.st4{display:inline;opacity:0.75;fill:#FFFFFF;enable-background:new    ;}
	.st5{display:inline;fill:#EAF42C;}
	.st6{display:inline;fill:#F4EA78;}
	.st7{display:inline;opacity:0.69;fill:#FFFFFF;enable-background:new    ;}
	.st8{font-family:'MyriadPro-Regular';}
	.st9{font-size:34.6581px;}
	.st10{display:inline;fill:#2691BF;}
	.st11{font-family:'Troika';}
	.st12{font-size:97.33px;}
	.st13{letter-spacing:8;}
	.st14{font-size:39.8125px;}
	.st15{letter-spacing:2;}
</style>
<g id="Слой_6">
	<path class="st0" d="M1240.1,68.2l-62.4,36.1c0,0-2.7,8.6,1,37.2c3.9,30.3,5.9,34.3,7.8,44c2.2,10.8,5.9,23.5,5.9,24
		C1238.4,152.2,1241.4,162,1240.1,68.2z"/>
	<path class="st0" d="M208.1,272l-19.5,2.6l-8.2-62.5l41.8-5.5l1,7.8l-2,8.2l-19.2,2.5L208.1,272z"/>
	<path class="st0" d="M242.7,267.5c-4.6,0.6-8.3-2.2-8.9-6.7l-6.1-46.9c-0.6-4.6,2.2-8.2,6.8-8.8l31.1-4.1c4.6-0.6,8.3,2.2,8.9,6.7
		l6.1,46.9c0.6,4.5-2.2,8.2-6.8,8.8L242.7,267.5z M248.2,219.2l4.1,31.1l7.8-1l-4.1-31.1L248.2,219.2z"/>
	<path class="st0" d="M288.8,261.4l-8.2-62.5l39-5.1c4.6-0.6,8.3,2.2,8.9,6.7l1.9,14.4c0.6,4.6-2.8,8-7,8.5l0.2,1.7
		c4.3-0.6,8.4,1.9,9,6.5l2.1,15.8c0.6,4.5-2.2,8.2-6.8,8.8L288.8,261.4z M310,211.1l-7.8,1l0.9,7l7.8-1L310,211.1z M306.3,243.2
		l7.8-1l-1.1-8.6l-7.8,1L306.3,243.2z"/>
	<path class="st0" d="M349.7,253.4c-4.6,0.6-8.3-2.2-8.9-6.7l-6.1-46.9c-0.6-4.6,2.2-8.2,6.8-8.8l31.1-4.1c4.6-0.6,8.3,2.2,8.9,6.7
		l6.1,46.9c0.6,4.5-2.2,8.2-6.8,8.8L349.7,253.4z M355.3,205.2l4.1,31.1l7.8-1l-4.1-31.1L355.3,205.2z"/>
	<path class="st0" d="M412.8,225.4l2.5,19.5l-19.5,2.6l-8.2-62.5l39-5.1c4.6-0.6,8.3,2.2,8.9,6.7l3.6,27.4c0.6,4.6-2.2,8.3-6.8,8.9
		L412.8,225.4z M410.8,209.8l7.8-1l-1.5-11.7l-7.8,1L410.8,209.8z"/>
	<path class="st0" d="M470.2,197.2l-1.9-14.8c-0.6-4.5,2.2-8.3,6.7-8.9l30.4-4c4.6-0.6,8.3,2.3,8.9,6.8l6.1,46.8
		c0.6,4.6-2.2,8.3-6.8,8.9l-30.3,4c-4.6,0.6-8.3-2.3-8.9-6.8l-2.1-16.3l-7,0.9l3.2,24.2l-19.5,2.5l-8.2-62.5l19.5-2.5l3,22.7
		L470.2,197.2z M488.8,187.6l4.1,31.2l7-0.9l-4.1-31.2L488.8,187.6z"/>
	<path class="st0" d="M656.6,149.7l15.9,53.5l1,7.8l-19.5,2.6l-2.8-12.4l-8.6,1.1L643,215l-19.4,2.5l-1-7.8l1.6-55.8L656.6,149.7z
		 M647.7,185.8l-4.2-18.3l-2.1,0.3l0.6,18.8L647.7,185.8z"/>
	<path class="st0" d="M698.5,144.3l18.5-2.4l1,7.8l-4.4,22.5l12.1,24.2l1,7.8l-19.5,2.5l-8.4-23.5l-3.5,0.5l3.2,24.2l-19.5,2.6
		l-8.2-62.5l19.5-2.6l3,22.7l3.5-0.5L698.5,144.3z"/>
	<g>
		<path class="st0" d="M1223.3,330.6c-17-27.1-33.3-57.9-46.2-92.8l-721.3,92.8H1223.3z"/>
		<path class="st0" d="M1368.4,330.6h115.2l-16.7-130l-42,5.4C1411.3,254.2,1390.4,295.5,1368.4,330.6z"/>
	</g>
</g>
<g id="Слой_10" class="st1">
	<path class="st2" d="M1352.2,68.2l62.4,36.1c0,0,2.7,8.6-1,37.2c-3.9,30.3-5.9,34.3-7.8,44c-2.2,10.8-5.9,23.5-5.9,24
		C1353.9,152.2,1350.9,162,1352.2,68.2z"/>
	<polygon class="st2" points="578.5,68.5 513.8,68.5 521.9,131.7 585.6,123.5 	"/>
	
		<rect x="530" y="152.6" transform="matrix(0.9918 -0.1276 0.1276 0.9918 -19.8152 74.8522)" class="st2" width="88.6" height="79"/>
	<polygon class="st2" points="0,305.7 171.5,283.7 161.4,205.4 0,226.1 	"/>
</g>
<g id="Слой_11" class="st1">
	<path class="st3" d="M1459.5,143.1l-22.2,2.9c-1.5,11.7-3.5,23-5.9,34.1l32.3-4.2L1459.5,143.1z"/>
	<path class="st3" d="M388.5,68.5H367c-6.5,17.9-23.6,30.7-43.7,30.7S286,86.4,279.6,68.5h-20.3c-6.6,17.7-23.6,30.3-43.6,30.3
		s-37-12.6-43.6-30.3h-18.5c-6.5,17.9-23.6,30.7-43.7,30.7S72.6,86.4,66.2,68.5H0v130.3l436.5-56.1l-5.6-43.5
		C411.3,98.7,394.8,86.1,388.5,68.5z"/>
	<path class="st3" d="M1160.7,181.5L0,330.8v33.3l1169.1-150.4C1165.9,203.3,1163.1,192.6,1160.7,181.5z"/>
</g>
<g id="light_texts" class="st1">
	<path class="st4" d="M591.9,158.2l18.5-2.4l1,7.8l-4.4,22.5l12.1,24.2l1,7.8l-19.5,2.5l-8.4-23.5l-3.5,0.5l3.2,24.2l-19.5,2.6
		l-8.2-62.5l19.5-2.6l3,22.7l3.5-0.5L591.9,158.2z"/>
	<path class="st5" d="M193.6,331l-2.4-18.6l14-1.8l2.4,18.6l-5.8,0.7l-1.8-14l-2.3,0.3l1.8,14L193.6,331z"/>
	<path class="st4" d="M217.5,322l0.7,5.8l-5.8,0.7L210,310l11.6-1.5c1.4-0.2,2.5,0.7,2.6,2l1,8.2c0.2,1.4-0.7,2.5-2,2.6L217.5,322z
		 M216.9,317.4l2.3-0.3l-0.4-3.5l-2.3,0.3L216.9,317.4z"/>
	<path class="st4" d="M233.3,325.9c-1.4,0.2-2.5-0.7-2.6-2l-1.8-14c-0.2-1.4,0.7-2.4,2-2.6l9.3-1.2c1.4-0.2,2.5,0.7,2.6,2l1.8,14
		c0.2,1.4-0.7,2.4-2,2.6L233.3,325.9z M235,311.5l1.2,9.3l2.3-0.3l-1.2-9.3L235,311.5z"/>
	<path class="st4" d="M249.7,323.8l-2.4-18.6l12.5-1.6l0.3,2.3l-0.6,2.5l-5.7,0.7l0.3,2.1l5.7-0.7l0.6,4.7l-5.7,0.7l0.3,2.6l6.7-0.9
		l0.6,4.7L249.7,323.8z"/>
	<path class="st4" d="M272.3,302l5.5-0.7l0.3,2.3l-1.3,6.7l3.6,7.2l0.3,2.3l-5.8,0.7l-2.5-7l-1,0.1l0.9,7.2l-5.8,0.7L264,303
		l5.8-0.7l0.9,6.8l1-0.1L272.3,302z"/>
	<path class="st4" d="M282.3,305.5l-0.6-4.7l13-1.7l0.3,2.3l-0.6,2.5l-2.8,0.4l1.8,14l-5.8,0.7l-1.8-14L282.3,305.5z"/>
	<path class="st4" d="M307.8,304.3l-0.9-6.8l5.8-0.7l2.4,18.6l-5.8,0.7l-0.9-7.2l-2.3,0.3l0.9,7.2l-5.8,0.7l-2.4-18.6l5.8-0.7
		l0.9,6.8L307.8,304.3z"/>
	<path class="st4" d="M322.2,314.5c-1.4,0.2-2.5-0.7-2.6-2l-1.8-14c-0.2-1.4,0.7-2.4,2-2.6l9.3-1.2c1.4-0.2,2.5,0.7,2.6,2l1.8,14
		c0.2,1.4-0.7,2.4-2,2.6L322.2,314.5z M323.9,300.1l1.2,9.3l2.3-0.3l-1.2-9.3L323.9,300.1z"/>
	<path class="st4" d="M349.9,299.6l0.5,3.8l-13.2,1.7l-0.5-3.8L349.9,299.6z"/>
	<path class="st4" d="M361.3,290.6l5.8-0.7l2.4,18.6l-5.8,0.7l-0.3-2.3l0.1-6.1l-0.5,0.1l-1.9,6.8l0.2,1.9l-5.8,0.7l-2.4-18.6
		l5.8-0.7l0.3,2.3l-0.1,6.1l0.5-0.1l1.9-6.8L361.3,290.6z"/>
	<path class="st4" d="M384.4,287.6l0.3,2.3l-0.6,2.5l-5.7,0.7l1.2,9.3l6.6-0.8l0.6,4.7l-10.1,1.3c-1.4,0.2-2.5-0.7-2.6-2l-1.8-14
		c-0.2-1.4,0.7-2.4,2-2.6L384.4,287.6z"/>
	<path class="st4" d="M401.1,285.5l0.3,2.3l-0.6,2.5l-5.7,0.7l1.2,9.3l6.6-0.8l0.6,4.7l-10.1,1.3c-1.4,0.2-2.5-0.7-2.6-2l-1.8-14
		c-0.2-1.4,0.7-2.4,2-2.6L401.1,285.5z"/>
	<path class="st4" d="M415.8,302.5l-1.8-14l-0.8,0.1l-0.4,14.3l-5.9,0.8l-0.3-2.3l1.4-16.8l11.2-1.4l2.4,18.6L415.8,302.5z"/>
	<path class="st4" d="M426.4,301.2l-2.4-18.6l12.5-1.6l0.3,2.3l-0.6,2.5l-5.7,0.7l0.3,2.1l5.7-0.7l0.6,4.7l-5.7,0.7l0.3,2.6l6.7-0.9
		l0.6,4.7L426.4,301.2z"/>
	<path class="st4" d="M441.7,294.5l1.7-0.2l1.1-14.3l11.2-1.4l1.8,14l1.5-0.2l0.6,4.7l-17.3,2.2L441.7,294.5z M450.5,283.9l-0.8,0.1
		l-0.2,9.5l2.3-0.3L450.5,283.9z"/>
	<path class="st4" d="M466,296.1c-1.4,0.2-2.5-0.7-2.6-2l-1.8-14c-0.2-1.4,0.7-2.4,2-2.6l9.3-1.2c1.4-0.2,2.5,0.7,2.6,2l1.8,14
		c0.2,1.4-0.7,2.4-2,2.6L466,296.1z M467.7,281.7l1.2,9.3l2.3-0.3l-1.2-9.3L467.7,281.7z"/>
	<path class="st4" d="M482.4,294l-2.4-18.6l11.6-1.5c1.4-0.2,2.5,0.7,2.6,2l0.5,4.3c0.2,1.4-0.8,2.4-2.1,2.5l0.1,0.5
		c1.3-0.2,2.5,0.6,2.7,2l0.6,4.7c0.2,1.4-0.7,2.4-2,2.6L482.4,294z M488.8,279l-2.3,0.3l0.3,2.1l2.3-0.3L488.8,279z M487.6,288.6
		l2.3-0.3l-0.3-2.6l-2.3,0.3L487.6,288.6z"/>
	<path class="st4" d="M510.3,271.5l4.7,16l0.3,2.3l-5.8,0.7l-0.8-3.7l-2.6,0.3l0.1,3.8l-5.8,0.7l-0.3-2.3l0.5-16.7L510.3,271.5z
		 M507.6,282.2l-1.2-5.5l-0.6,0.1l0.2,5.6L507.6,282.2z"/>
	<path class="st4" d="M515.9,275.5l-0.6-4.7l13-1.7l0.3,2.3L528,274l-2.8,0.4l1.8,14l-5.8,0.7l-1.8-14L515.9,275.5z"/>
	<path class="st4" d="M534.7,287.3l-2.4-18.6l12.5-1.6l0.3,2.3l-0.6,2.5l-5.7,0.7l0.3,2.1l5.7-0.7l0.6,4.7l-5.7,0.7l0.3,2.6l6.7-0.9
		l0.6,4.7L534.7,287.3z"/>
	<path class="st4" d="M559.5,284.1l-1.8-14l-0.8,0.1l-0.4,14.3l-5.9,0.8l-0.3-2.3l1.4-16.8l11.2-1.4l2.4,18.6L559.5,284.1z"/>
	<path class="st4" d="M582.8,270.5l1,8.1c0.2,1.4-0.7,2.5-2,2.6l-11.7,1.5l-2.4-18.6l5.8-0.7l0.7,5.8l5.8-0.7
		C581.5,268.3,582.6,269.1,582.8,270.5z M577.7,277l-0.4-3.5l-2.3,0.3l0.4,3.5L577.7,277z"/>
	<path class="st4" d="M598.7,260.1l0.3,2.3l-0.6,2.5l-5.7,0.7l1.2,9.3l6.6-0.8l0.6,4.7l-10.1,1.3c-1.4,0.2-2.5-0.7-2.6-2l-1.8-14
		c-0.2-1.4,0.7-2.4,2-2.6L598.7,260.1z"/>
	<path class="st4" d="M611.2,258.5l5.5-0.7l0.3,2.3l-1.3,6.7l3.6,7.2l0.3,2.3l-5.8,0.7l-2.5-7l-1,0.1l0.9,7.2l-5.8,0.7l-2.4-18.6
		l5.8-0.7l0.9,6.8l1-0.1L611.2,258.5z"/>
	<path class="st4" d="M633.2,255.7l4.7,16l0.3,2.3l-5.8,0.7l-0.8-3.7l-2.6,0.3l0.1,3.8l-5.8,0.7l-0.3-2.3l0.5-16.7L633.2,255.7z
		 M630.5,266.5l-1.2-5.5l-0.6,0.1l0.2,5.6L630.5,266.5z"/>
	<path class="st4" d="M656.2,271.7l-5.8,0.7l-0.7-5.8l-1.2,0.2l-0.8,6l-5.7,0.7l-0.3-2.3l1.2-4.8c-0.9-0.1-1.7-1-1.8-1.9l-0.9-7.3
		c-0.2-1.4,0.7-2.5,2-2.6l11.6-1.5L656.2,271.7z M646.7,262.3l2.3-0.3l-0.4-3.5l-2.3,0.3L646.7,262.3z"/>
	<path class="st6" d="M676.7,269.1l-2.4-18.6l14-1.8l2.4,18.6l-5.8,0.7l-1.8-14l-2.3,0.3l1.8,14L676.7,269.1z"/>
	<path class="st4" d="M695.5,266.7l-2.4-18.6l12.5-1.6l0.3,2.3l-0.6,2.5l-5.7,0.7l0.3,2.1l5.7-0.7l0.6,4.7l-5.7,0.7l0.3,2.6l6.7-0.9
		l0.6,4.7L695.5,266.7z"/>
	<path class="st4" d="M710.8,260l1.7-0.2l1.1-14.3l11.2-1.4l1.8,14l1.5-0.2l0.6,4.7l-17.3,2.2L710.8,260z M719.5,249.4l-0.8,0.1
		l-0.2,9.5l2.3-0.3L719.5,249.4z"/>
	<path class="st4" d="M742.1,241.8l4.7,16l0.3,2.3l-5.8,0.7l-0.8-3.7l-2.6,0.3l0.1,3.8l-5.8,0.7l-0.3-2.3l0.5-16.7L742.1,241.8z
		 M739.4,252.5l-1.2-5.5l-0.6,0.1l0.2,5.6L739.4,252.5z"/>
	<path class="st4" d="M757.2,258.8l-5.8,0.7l-2.4-18.6l12.5-1.6l0.3,2.3l-0.6,2.5l-5.7,0.7L757.2,258.8z"/>
	<path class="st4" d="M770.1,257.1c-1.4,0.2-2.5-0.7-2.6-2l-1.8-14c-0.2-1.4,0.7-2.4,2-2.6l9.3-1.2c1.4-0.2,2.5,0.7,2.6,2l1.8,14
		c0.2,1.4-0.7,2.4-2,2.6L770.1,257.1z M771.8,242.7l1.2,9.3l2.3-0.3l-1.2-9.3L771.8,242.7z"/>
	<path class="st4" d="M792.4,254.3l-5.8,0.7l-2.4-18.6l12.5-1.6l0.3,2.3l-0.6,2.5l-5.7,0.7L792.4,254.3z"/>
	<path class="st4" d="M808.8,233.2l5.8-0.7l2.4,18.6l-5.8,0.7l-0.3-2.3l0.1-6.1l-0.5,0.1l-1.9,6.8l0.2,1.9l-5.8,0.7l-2.4-18.6
		l5.8-0.7l0.3,2.3l-0.1,6.1l0.5-0.1l1.9-6.8L808.8,233.2z"/>
	<path class="st4" d="M820.4,241.9l-1.3-10l5.8-0.7l1,7.7l2.3-0.3l-1-7.7l5.8-0.7l2.4,18.6l-5.8,0.7l-0.8-6.3l-5.8,0.7
		C821.7,244.1,820.6,243.3,820.4,241.9z"/>
	<path class="st4" d="M840.2,248.1l-2.4-18.6l12.5-1.6l0.3,2.3l-0.6,2.5l-5.7,0.7l0.3,2.1l5.7-0.7l0.6,4.7l-5.7,0.7l0.3,2.6l6.7-0.9
		l0.6,4.7L840.2,248.1z"/>
	<path class="st4" d="M867,225.7l0.3,2.3l-0.6,2.5l-5.7,0.7l1.2,9.3l6.6-0.8l0.6,4.7l-10.1,1.3c-1.4,0.2-2.5-0.7-2.6-2l-1.8-14
		c-0.2-1.4,0.7-2.4,2-2.6L867,225.7z"/>
	<path class="st4" d="M879.6,224.1l5.5-0.7l0.3,2.3l-1.3,6.7l3.6,7.2l0.3,2.3l-5.8,0.7l-2.5-7l-1,0.1l0.9,7.2l-5.8,0.7l-2.4-18.6
		l5.8-0.7l0.9,6.8l1-0.1L879.6,224.1z"/>
	<path class="st4" d="M901.6,221.3l4.7,16l0.3,2.3l-5.8,0.7l-0.8-3.7l-2.6,0.3l0.1,3.8l-5.8,0.7l-0.3-2.3l0.5-16.7L901.6,221.3z
		 M898.9,232.1l-1.2-5.5l-0.6,0.1l0.2,5.6L898.9,232.1z"/>
	<path class="st4" d="M924.5,237.3l-5.8,0.7l-0.7-5.8l-1.2,0.1l-0.8,6l-5.7,0.7l-0.3-2.3l1.2-4.8c-0.9-0.1-1.7-1-1.8-1.9l-0.9-7.3
		c-0.2-1.4,0.7-2.5,2-2.6l11.6-1.5L924.5,237.3z M915.1,227.9l2.3-0.3l-0.4-3.5l-2.3,0.3L915.1,227.9z"/>
	<path class="st6" d="M953.1,233.7l-1.8-14l-0.8,0.1l-0.4,14.3l-5.9,0.8l-0.3-2.3l1.4-16.8l11.2-1.4l2.4,18.6L953.1,233.7z"/>
	<path class="st4" d="M973.1,212.2l4.7,16l0.3,2.3l-5.8,0.7l-0.8-3.7l-2.6,0.3l0.1,3.8l-5.8,0.7l-0.3-2.3l0.5-16.7L973.1,212.2z
		 M970.4,222.9l-1.2-5.5l-0.6,0.1l0.2,5.6L970.4,222.9z"/>
	<path class="st4" d="M995.1,218.6l0.9,7.2c0.2,1.4-0.7,2.5-2,2.6l-11.6,1.5l-2.4-18.6l13.8-1.8l0.3,2.3l-0.6,2.5l-7.1,0.9l0.3,2.1
		l5.8-0.7C993.8,216.4,994.9,217.2,995.1,218.6z M989.9,224.2l-0.3-2.6l-2.3,0.3l0.3,2.6L989.9,224.2z"/>
	<path class="st4" d="M1003.2,227.2c-1.4,0.2-2.5-0.7-2.6-2l-1.8-14c-0.2-1.4,0.7-2.4,2-2.6l9.3-1.2c1.4-0.2,2.5,0.7,2.6,2l1.8,14
		c0.2,1.4-0.7,2.4-2,2.6L1003.2,227.2z M1004.9,212.8l1.2,9.3l2.3-0.3l-1.2-9.3L1004.9,212.8z"/>
	<path class="st4" d="M1024.7,218.6l0.7,5.8l-5.8,0.7l-2.4-18.6l11.6-1.5c1.4-0.2,2.5,0.7,2.6,2l1,8.2c0.2,1.4-0.7,2.5-2,2.6
		L1024.7,218.6z M1024.1,213.9l2.3-0.3l-0.4-3.5l-2.3,0.3L1024.1,213.9z"/>
	<path class="st4" d="M1046.7,202.7l4.7,16l0.3,2.3l-5.8,0.7l-0.8-3.7l-2.6,0.3l0.1,3.8l-5.8,0.7l-0.3-2.3l0.5-16.7L1046.7,202.7z
		 M1044,213.5l-1.2-5.5l-0.6,0.1l0.2,5.6L1044,213.5z"/>
	<path class="st4" d="M1052.3,206.8l-0.6-4.7l13-1.7l0.3,2.3l-0.6,2.5l-2.8,0.4l1.8,14l-5.8,0.7l-1.8-14L1052.3,206.8z"/>
	<path class="st4" d="M1073.5,218.2c-1.4,0.2-2.5-0.7-2.6-2l-1.8-14c-0.2-1.4,0.7-2.4,2-2.6l9.3-1.2c1.4-0.2,2.5,0.7,2.6,2l1.8,14
		c0.2,1.4-0.7,2.4-2,2.6L1073.5,218.2z M1075.2,203.8l1.2,9.3l2.3-0.3l-1.2-9.3L1075.2,203.8z"/>
	<path class="st4" d="M1095,209.6l0.7,5.8l-5.8,0.7l-2.4-18.6l11.6-1.5c1.4-0.2,2.5,0.7,2.6,2l1,8.2c0.2,1.4-0.7,2.5-2,2.6
		L1095,209.6z M1094.4,204.9l2.3-0.3l-0.4-3.5l-2.3,0.3L1094.4,204.9z"/>
	<path class="st4" d="M1114.2,194.1l5.8-0.7l2.4,18.6l-5.8,0.7l-0.3-2.3l0.1-6.1l-0.5,0.1l-1.9,6.8l0.2,1.9l-5.8,0.7l-2.4-18.6
		l5.8-0.7l0.3,2.3l-0.1,6.1l0.5-0.1l1.9-6.8L1114.2,194.1z"/>
	<path class="st4" d="M1140.9,209.6l-5.8,0.7l-0.7-5.8l-1.2,0.2l-0.8,6l-5.7,0.7l-0.3-2.3l1.2-4.8c-0.9-0.1-1.7-1-1.8-1.9l-0.9-7.3
		c-0.2-1.4,0.7-2.5,2-2.6l11.6-1.5L1140.9,209.6z M1131.4,200.1l2.3-0.3l-0.4-3.5l-2.3,0.3L1131.4,200.1z"/>
	<text transform="matrix(1 0 0 1 893.6748 313.7522)" class="st7 st8 st9">топос-краеведение</text>
</g>
<g id="Слой_13" class="st1">
	<text transform="matrix(1 0 0 1 1269.1953 243.6858)" class="st10 st11 st12 st13">4</text>
	<text transform="matrix(1 0 0 1 1254.248 290.5627)" class="st2 st11 st14 st15">2021</text>
</g>
</svg>
