{
    "tech" : {
        "title"     : "Technical",
        "id"        : "tech",
        "icon"      : "",
        "hidden"    : 1
    },
    "global" : {
        "title"     : "Globals",
        "id"        : "global",
        "icon"      : "",
        "hidden"    : 1
    },
    "layout" : {
        "title"     : "Layout",
        "id"        : "layout",
        "icon"      : "",
        "hidden"    : 0
    },
    "content" : {
        "title"     : "Contents",
        "id"        : "Contents",
        "icon"      : "",
        "hidden"    : 0
    },
    "social" : {
        "title"     : "Social",
        "id"        : "social",
        "icon"      : "",
        "hidden"    : 0
    },
    "taxonomy" : {
        "title"     : "Taxonomy",
        "id"        : "taxonomy",
        "icon"      : "",
        "hidden"    : 1
    },
    "seo" : {
        "title"     : "SEO",
        "id"        : "seo",
        "icon"      : "",
        "hidden"    : 0
    },
    "interactive" : {
        "title"     : "Interactive",
        "id"        : "interactive",
        "icon"      : "",
        "hidden"    : 0
    },
    "kraeved" : {
        "title"     : "Kraeved",
        "id"        : "kraeved",
        "icon"      : "",
        "hidden"    : 0
    }
}