<?xml version="1.0" encoding="utf-8"?>
<svg 
	version="1.1" 
	id="Слой_1" 
	xmlns="http://www.w3.org/2000/svg" 
	xmlns:xlink="http://www.w3.org/1999/xlink" 
	x="0px" 
	y="0px"
	width="1860"
	height="250"
	viewBox="0 0 3200 430" 
	xml:space="preserve"
>
	<g id="color4">
		
			<image style="overflow:visible;" width="1860" height="250" xlink:href="../../../../../../../../src/logo/logo.png"  transform="matrix(1 0 0 1 0 -1)">
		</image>
	</g>
	<g id="color3">
			<path class="st0" d="M720.8,39.7l-36.3,21c0,0-1.6,5,0.6,21.6c2.3,17.6,3.4,19.9,4.5,25.6c1.3,6.3,3.4,13.7,3.4,14
				C719.8,88.5,721.6,94.2,720.8,39.7z"/>
			<path class="st0" d="M121,158.1l-11.3,1.5l-4.8-36.3l24.3-3.2l0.6,4.5l-1.2,4.8l-11.2,1.5L121,158.1z"/>
			<path class="st0" d="M141.1,155.5c-2.7,0.3-4.8-1.3-5.2-3.9l-3.5-27.3c-0.3-2.7,1.3-4.8,4-5.1l18.1-2.4c2.7-0.3,4.8,1.3,5.2,3.9
				l3.5,27.3c0.3,2.6-1.3,4.8-4,5.1L141.1,155.5z M144.3,127.4l2.4,18.1l4.5-0.6l-2.4-18.1L144.3,127.4z"/>
			<path class="st0" d="M167.9,152l-4.8-36.3l22.7-3c2.7-0.3,4.8,1.3,5.2,3.9l1.1,8.4c0.3,2.7-1.6,4.6-4.1,4.9l0.1,1
				c2.5-0.3,4.9,1.1,5.2,3.8l1.2,9.2c0.3,2.6-1.3,4.8-4,5.1L167.9,152z M180.2,122.7l-4.5,0.6l0.5,4.1l4.5-0.6L180.2,122.7z
				M178,141.4l4.5-0.6l-0.6-5l-4.5,0.6L178,141.4z"/>
			<path class="st0" d="M203.3,147.3c-2.7,0.3-4.8-1.3-5.2-3.9l-3.5-27.3c-0.3-2.7,1.3-4.8,4-5.1l18.1-2.4c2.7-0.3,4.8,1.3,5.2,3.9
				l3.5,27.3c0.3,2.6-1.3,4.8-4,5.1L203.3,147.3z M206.5,119.3l2.4,18.1l4.5-0.6l-2.4-18.1L206.5,119.3z"/>
			<path class="st0" d="M239.9,131l1.5,11.3l-11.3,1.5l-4.8-36.3l22.7-3c2.7-0.3,4.8,1.3,5.2,3.9l2.1,15.9c0.3,2.7-1.3,4.8-4,5.2
				L239.9,131z M238.8,122l4.5-0.6l-0.9-6.8l-4.5,0.6L238.8,122z"/>
			<path class="st0" d="M273.3,114.7l-1.1-8.6c-0.3-2.6,1.3-4.8,3.9-5.2l17.7-2.3c2.7-0.3,4.8,1.3,5.2,4l3.5,27.2
				c0.3,2.7-1.3,4.8-4,5.2l-17.6,2.3c-2.7,0.3-4.8-1.3-5.2-4l-1.2-9.5l-4.1,0.5l1.9,14.1l-11.3,1.5l-4.8-36.3l11.3-1.5l1.7,13.2
				L273.3,114.7z M284.1,109.1l2.4,18.1l4.1-0.5l-2.4-18.1L284.1,109.1z"/>
			<path class="st0" d="M381.6,87l9.2,31.1l0.6,4.5l-11.3,1.5l-1.6-7.2l-5,0.6l0.2,7.4l-11.3,1.5l-0.6-4.5l0.9-32.4L381.6,87z
				M376.5,108L374,97.4l-1.2,0.2l0.3,10.9L376.5,108z"/>
			<path class="st0" d="M406,83.9l10.8-1.4l0.6,4.5l-2.6,13.1l7,14.1l0.6,4.5l-11.3,1.5l-4.9-13.7l-2,0.3l1.9,14.1l-11.3,1.5
				l-4.8-36.3l11.3-1.5l1.7,13.2l2-0.3L406,83.9z"/>
			<g>
				<path class="st0" d="M711,192.2c-9.9-15.8-19.4-33.7-26.9-53.9l-419.3,53.9H711z"/>
				<path class="st0" d="M795.4,192.2h67l-9.7-75.6l-24.4,3.1C820.3,147.8,808.2,171.8,795.4,192.2z"/>
			</g>
	</g>
	<g id="color2">
			<path class="st_0" d="M786,39.7l36.3,21c0,0,1.6,5-0.6,21.6c-2.3,17.6-3.4,19.9-4.5,25.6c-1.3,6.3-3.4,13.7-3.4,14
				C787,88.5,785.2,94.2,786,39.7z"/>
			<polygon class="st_0" points="336.3,39.8 298.6,39.8 303.4,76.6 340.4,71.8 		"/>
			<rect class="st_0" x="308.1" y="88.7" transform="matrix(0.9918 -0.1276 0.1276 0.9918 -11.5229 43.5076)" width="51.5" height="45.9"/>
			<polygon class="st_0" points="0,177.7 99.7,164.9 93.8,119.4 0,131.5 		"/>
	</g>
	<g id="color1">
			<path class="st1" d="M848.3,83.2l-12.9,1.7c-0.9,6.8-2,13.4-3.4,19.8l18.8-2.4L848.3,83.2z"/>
			<path class="st1" d="M225.8,39.8h-12.5c-3.8,10.4-13.7,17.8-25.4,17.8s-21.7-7.4-25.4-17.8h-11.8c-3.8,10.3-13.7,17.6-25.3,17.6
				s-21.5-7.3-25.3-17.6H89.3c-3.8,10.4-13.7,17.8-25.4,17.8s-21.7-7.4-25.4-17.8H0v75.7L253.7,83l-3.3-25.3
				C239.1,57.4,229.5,50.1,225.8,39.8z"/>
			<path class="st1" d="M674.7,105.5L0,192.3v19.4l679.5-87.4C677.7,118.2,676.1,112,674.7,105.5z"/>
	</g>
	<g id="color5">
			<path class="st2" d="M344,92l10.8-1.4l0.6,4.5l-2.6,13.1l7,14.1l0.6,4.5l-11.3,1.5l-4.9-13.7l-2,0.3L344,129l-11.3,1.5l-4.8-36.3
				l11.3-1.5l1.7,13.2l2-0.3L344,92z"/>
			<path class="st3" d="M112.5,192.4l-1.4-10.8l8.1-1l1.4,10.8l-3.4,0.4l-1-8.1l-1.3,0.2l1,8.1L112.5,192.4z"/>
			<path class="st2" d="M126.4,187.2l0.4,3.4l-3.4,0.4l-1.4-10.8l6.7-0.9c0.8-0.1,1.5,0.4,1.5,1.2l0.6,4.8c0.1,0.8-0.4,1.5-1.2,1.5
				L126.4,187.2z M126.1,184.5l1.3-0.2l-0.2-2l-1.3,0.2L126.1,184.5z"/>
			<path class="st2" d="M135.6,189.5c-0.8,0.1-1.5-0.4-1.5-1.2l-1-8.1c-0.1-0.8,0.4-1.4,1.2-1.5l5.4-0.7c0.8-0.1,1.5,0.4,1.5,1.2
				l1,8.1c0.1,0.8-0.4,1.4-1.2,1.5L135.6,189.5z M136.6,181.1l0.7,5.4l1.3-0.2l-0.7-5.4L136.6,181.1z"/>
			<path class="st2" d="M145.1,188.2l-1.4-10.8l7.3-0.9l0.2,1.3l-0.3,1.5l-3.3,0.4l0.2,1.2l3.3-0.4l0.3,2.7l-3.3,0.4l0.2,1.5l3.9-0.5
				l0.3,2.7L145.1,188.2z"/>
			<path class="st2" d="M158.3,175.6l3.2-0.4l0.2,1.3l-0.8,3.9l2.1,4.2l0.2,1.3l-3.4,0.4l-1.5-4.1l-0.6,0.1l0.5,4.2l-3.4,0.4
				l-1.5-10.8l3.4-0.4l0.5,4l0.6-0.1L158.3,175.6z"/>
			<path class="st2" d="M164.1,177.6l-0.3-2.7l7.6-1l0.2,1.3l-0.3,1.5l-1.6,0.2l1,8.1l-3.4,0.4l-1-8.1L164.1,177.6z"/>
			<path class="st2" d="M178.9,176.9l-0.5-4l3.4-0.4l1.4,10.8l-3.4,0.4l-0.5-4.2l-1.3,0.2l0.5,4.2l-3.4,0.4l-1.4-10.8l3.4-0.4l0.5,4
				L178.9,176.9z"/>
			<path class="st2" d="M187.3,182.8c-0.8,0.1-1.5-0.4-1.5-1.2l-1-8.1c-0.1-0.8,0.4-1.4,1.2-1.5l5.4-0.7c0.8-0.1,1.5,0.4,1.5,1.2
				l1,8.1c0.1,0.8-0.4,1.4-1.2,1.5L187.3,182.8z M188.3,174.5l0.7,5.4l1.3-0.2l-0.7-5.4L188.3,174.5z"/>
			<path class="st2" d="M203.4,174.2l0.3,2.2l-7.7,1l-0.3-2.2L203.4,174.2z"/>
			<path class="st2" d="M210,168.9l3.4-0.4l1.4,10.8l-3.4,0.4l-0.2-1.3l0.1-3.5l-0.3,0.1l-1.1,4l0.1,1.1l-3.4,0.4l-1.4-10.8l3.4-0.4
				l0.2,1.3l-0.1,3.5l0.3-0.1l1.1-4L210,168.9z"/>
			<path class="st2" d="M223.4,167.2l0.2,1.3l-0.3,1.5l-3.3,0.4l0.7,5.4l3.8-0.5l0.3,2.7l-5.9,0.8c-0.8,0.1-1.5-0.4-1.5-1.2l-1-8.1
				c-0.1-0.8,0.4-1.4,1.2-1.5L223.4,167.2z"/>
			<path class="st2" d="M233.1,166l0.2,1.3l-0.3,1.5l-3.3,0.4l0.7,5.4l3.8-0.5l0.3,2.7l-5.9,0.8c-0.8,0.1-1.5-0.4-1.5-1.2l-1-8.1
				c-0.1-0.8,0.4-1.4,1.2-1.5L233.1,166z"/>
			<path class="st2" d="M241.7,175.9l-1-8.1l-0.5,0.1l-0.2,8.3l-3.4,0.5l-0.2-1.3l0.8-9.8l6.5-0.8l1.4,10.8L241.7,175.9z"/>
			<path class="st2" d="M247.8,175.1l-1.4-10.8l7.3-0.9l0.2,1.3l-0.3,1.5l-3.3,0.4l0.2,1.2l3.3-0.4l0.3,2.7l-3.3,0.4l0.2,1.5l3.9-0.5
				l0.3,2.7L247.8,175.1z"/>
			<path class="st2" d="M256.7,171.2l1-0.1l0.6-8.3l6.5-0.8l1,8.1l0.9-0.1l0.3,2.7l-10.1,1.3L256.7,171.2z M261.9,165l-0.5,0.1
				l-0.1,5.5l1.3-0.2L261.9,165z"/>
			<path class="st2" d="M270.9,172.1c-0.8,0.1-1.5-0.4-1.5-1.2l-1-8.1c-0.1-0.8,0.4-1.4,1.2-1.5l5.4-0.7c0.8-0.1,1.5,0.4,1.5,1.2
				l1,8.1c0.1,0.8-0.4,1.4-1.2,1.5L270.9,172.1z M271.9,163.8l0.7,5.4l1.3-0.2l-0.7-5.4L271.9,163.8z"/>
			<path class="st2" d="M280.4,170.9l-1.4-10.8l6.7-0.9c0.8-0.1,1.5,0.4,1.5,1.2l0.3,2.5c0.1,0.8-0.5,1.4-1.2,1.5l0.1,0.3
				c0.8-0.1,1.5,0.3,1.6,1.2l0.3,2.7c0.1,0.8-0.4,1.4-1.2,1.5L280.4,170.9z M284.1,162.2l-1.3,0.2l0.2,1.2l1.3-0.2L284.1,162.2z
				M283.4,167.8l1.3-0.2l-0.2-1.5l-1.3,0.2L283.4,167.8z"/>
			<path class="st2" d="M296.6,157.8l2.7,9.3l0.2,1.3l-3.4,0.4l-0.5-2.2l-1.5,0.2l0.1,2.2l-3.4,0.4l-0.2-1.3l0.3-9.7L296.6,157.8z
				M295,164.1l-0.7-3.2l-0.3,0.1l0.1,3.3L295,164.1z"/>
			<path class="st2" d="M299.9,160.2l-0.3-2.7l7.6-1l0.2,1.3l-0.3,1.5l-1.6,0.2l1,8.1l-3.4,0.4l-1-8.1L299.9,160.2z"/>
			<path class="st2" d="M310.8,167l-1.4-10.8l7.3-0.9l0.2,1.3l-0.3,1.5l-3.3,0.4l0.2,1.2l3.3-0.4l0.3,2.7l-3.3,0.4l0.2,1.5l3.9-0.5
				l0.3,2.7L310.8,167z"/>
			<path class="st2" d="M325.2,165.2l-1-8.1l-0.5,0.1l-0.2,8.3l-3.4,0.5l-0.2-1.3l0.8-9.8l6.5-0.8l1.4,10.8L325.2,165.2z"/>
			<path class="st2" d="M338.8,157.3l0.6,4.7c0.1,0.8-0.4,1.5-1.2,1.5l-6.8,0.9l-1.4-10.8l3.4-0.4l0.4,3.4l3.4-0.4
				C338,156,338.6,156.4,338.8,157.3z M335.8,161l-0.2-2l-1.3,0.2l0.2,2L335.8,161z"/>
			<path class="st2" d="M348,151.2l0.2,1.3l-0.3,1.5l-3.3,0.4l0.7,5.4l3.8-0.5l0.3,2.7l-5.9,0.8c-0.8,0.1-1.5-0.4-1.5-1.2l-1-8.1
				c-0.1-0.8,0.4-1.4,1.2-1.5L348,151.2z"/>
			<path class="st2" d="M355.3,150.3l3.2-0.4l0.2,1.3l-0.8,3.9l2.1,4.2l0.2,1.3l-3.4,0.4l-1.5-4.1l-0.6,0.1l0.5,4.2l-3.4,0.4
				l-1.4-10.8l3.4-0.4l0.5,4l0.6-0.1L355.3,150.3z"/>
			<path class="st2" d="M368,148.7l2.7,9.3l0.2,1.3l-3.4,0.4l-0.5-2.2l-1.5,0.2l0.1,2.2l-3.4,0.4l-0.2-1.3l0.3-9.7L368,148.7z
				M366.5,154.9l-0.7-3.2l-0.3,0.1l0.1,3.3L366.5,154.9z"/>
			<path class="st2" d="M381.4,158l-3.4,0.4l-0.4-3.4l-0.7,0.1l-0.5,3.5l-3.3,0.4l-0.2-1.3l0.7-2.8c-0.5-0.1-1-0.6-1-1.1l-0.5-4.2
				c-0.1-0.8,0.4-1.5,1.2-1.5l6.7-0.9L381.4,158z M375.9,152.5l1.3-0.2l-0.2-2l-1.3,0.2L375.9,152.5z"/>
			<path class="st4" d="M393.3,156.4l-1.4-10.8l8.1-1l1.4,10.8l-3.4,0.4l-1-8.1l-1.3,0.2l1,8.1L393.3,156.4z"/>
			<path class="st2" d="M404.3,155.1l-1.4-10.8l7.3-0.9l0.2,1.3l-0.3,1.5l-3.3,0.4l0.2,1.2l3.3-0.4l0.3,2.7l-3.3,0.4l0.2,1.5l3.9-0.5
				l0.3,2.7L404.3,155.1z"/>
			<path class="st2" d="M413.2,151.2l1-0.1l0.6-8.3l6.5-0.8l1,8.1l0.9-0.1l0.3,2.7l-10.1,1.3L413.2,151.2z M418.2,145l-0.5,0.1
				l-0.1,5.5l1.3-0.2L418.2,145z"/>
			<path class="st2" d="M431.3,140.6l2.7,9.3l0.2,1.3l-3.4,0.4l-0.5-2.2l-1.5,0.2l0.1,2.2l-3.4,0.4l-0.2-1.3l0.3-9.7L431.3,140.6z
				M429.8,146.8l-0.7-3.2l-0.3,0.1l0.1,3.3L429.8,146.8z"/>
			<path class="st2" d="M440.1,150.5l-3.4,0.4l-1.4-10.8l7.3-0.9l0.2,1.3l-0.3,1.5l-3.3,0.4L440.1,150.5z"/>
			<path class="st2" d="M447.6,149.5c-0.8,0.1-1.5-0.4-1.5-1.2l-1-8.1c-0.1-0.8,0.4-1.4,1.2-1.5l5.4-0.7c0.8-0.1,1.5,0.4,1.5,1.2
				l1,8.1c0.1,0.8-0.4,1.4-1.2,1.5L447.6,149.5z M448.6,141.1l0.7,5.4l1.3-0.2l-0.7-5.4L448.6,141.1z"/>
			<path class="st2" d="M460.6,147.8l-3.4,0.4l-1.4-10.8l7.3-0.9l0.2,1.3l-0.3,1.5l-3.3,0.4L460.6,147.8z"/>
			<path class="st2" d="M470.1,135.6l3.4-0.4l1.4,10.8l-3.4,0.4l-0.2-1.3l0.1-3.5l-0.3,0.1l-1.1,4l0.1,1.1l-3.4,0.4l-1.4-10.8
				l3.4-0.4l0.2,1.3l-0.1,3.5l0.3-0.1l1.1-4L470.1,135.6z"/>
			<path class="st2" d="M476.9,140.6l-0.8-5.8l3.4-0.4l0.6,4.5l1.3-0.2l-0.6-4.5l3.4-0.4l1.4,10.8l-3.4,0.4l-0.5-3.7l-3.4,0.4
				C477.6,141.9,477,141.4,476.9,140.6z"/>
			<path class="st2" d="M488.4,144.2l-1.4-10.8l7.3-0.9l0.2,1.3l-0.3,1.5l-3.3,0.4l0.2,1.2l3.3-0.4l0.3,2.7l-3.3,0.4l0.2,1.5l3.9-0.5
				l0.3,2.7L488.4,144.2z"/>
			<path class="st2" d="M503.9,131.2l0.2,1.3l-0.3,1.5l-3.3,0.4l0.7,5.4l3.8-0.5l0.3,2.7l-5.9,0.8c-0.8,0.1-1.5-0.4-1.5-1.2l-1-8.1
				c-0.1-0.8,0.4-1.4,1.2-1.5L503.9,131.2z"/>
			<path class="st2" d="M511.3,130.3l3.2-0.4l0.2,1.3l-0.8,3.9l2.1,4.2l0.2,1.3l-3.4,0.4l-1.5-4.1l-0.6,0.1l0.5,4.2l-3.4,0.4
				l-1.4-10.8l3.4-0.4l0.5,4l0.6-0.1L511.3,130.3z"/>
			<path class="st2" d="M524.1,128.7l2.7,9.3l0.2,1.3l-3.4,0.4l-0.5-2.2l-1.5,0.2l0.1,2.2l-3.4,0.4l-0.2-1.3l0.3-9.7L524.1,128.7z
				M522.5,134.9l-0.7-3.2l-0.3,0.1l0.1,3.3L522.5,134.9z"/>
			<path class="st2" d="M537.4,138l-3.4,0.4l-0.4-3.4l-0.7,0.1l-0.5,3.5l-3.3,0.4l-0.2-1.3l0.7-2.8c-0.5-0.1-1-0.6-1-1.1l-0.5-4.2
				c-0.1-0.8,0.4-1.5,1.2-1.5l6.7-0.9L537.4,138z M531.9,132.5l1.3-0.2l-0.2-2l-1.3,0.2L531.9,132.5z"/>
			<path class="st4" d="M554,135.9l-1-8.1l-0.5,0.1l-0.2,8.3l-3.4,0.5l-0.2-1.3l0.8-9.8l6.5-0.8l1.4,10.8L554,135.9z"/>
			<path class="st2" d="M565.6,123.4l2.7,9.3l0.2,1.3l-3.4,0.4l-0.5-2.2l-1.5,0.2l0.1,2.2l-3.4,0.4l-0.2-1.3l0.3-9.7L565.6,123.4z
				M564,129.6l-0.7-3.2l-0.3,0.1l0.1,3.3L564,129.6z"/>
			<path class="st2" d="M578.4,127.1l0.5,4.2c0.1,0.8-0.4,1.5-1.2,1.5l-6.7,0.9l-1.4-10.8l8-1l0.2,1.3l-0.3,1.5l-4.1,0.5l0.2,1.2
				l3.4-0.4C577.6,125.8,578.3,126.3,578.4,127.1z M575.4,130.3l-0.2-1.5l-1.3,0.2l0.2,1.5L575.4,130.3z"/>
			<path class="st2" d="M583.1,132.1c-0.8,0.1-1.5-0.4-1.5-1.2l-1-8.1c-0.1-0.8,0.4-1.4,1.2-1.5l5.4-0.7c0.8-0.1,1.5,0.4,1.5,1.2
				l1,8.1c0.1,0.8-0.4,1.4-1.2,1.5L583.1,132.1z M584.1,123.7l0.7,5.4l1.3-0.2l-0.7-5.4L584.1,123.7z"/>
			<path class="st2" d="M595.6,127.1l0.4,3.4l-3.4,0.4l-1.4-10.8l6.7-0.9c0.8-0.1,1.5,0.4,1.5,1.2l0.6,4.8c0.1,0.8-0.4,1.5-1.2,1.5
				L595.6,127.1z M595.3,124.4l1.3-0.2l-0.2-2l-1.3,0.2L595.3,124.4z"/>
			<path class="st2" d="M608.4,117.9l2.7,9.3l0.2,1.3l-3.4,0.4l-0.5-2.2l-1.5,0.2l0.1,2.2l-3.4,0.4l-0.2-1.3l0.3-9.7L608.4,117.9z
				M606.8,124.1l-0.7-3.2l-0.3,0.1l0.1,3.3L606.8,124.1z"/>
			<path class="st2" d="M611.6,120.2l-0.3-2.7l7.6-1l0.2,1.3l-0.3,1.5l-1.6,0.2l1,8.1l-3.4,0.4l-1-8.1L611.6,120.2z"/>
			<path class="st2" d="M624,126.9c-0.8,0.1-1.5-0.4-1.5-1.2l-1-8.1c-0.1-0.8,0.4-1.4,1.2-1.5l5.4-0.7c0.8-0.1,1.5,0.4,1.5,1.2l1,8.1
				c0.1,0.8-0.4,1.4-1.2,1.5L624,126.9z M625,118.5l0.7,5.4l1.3-0.2l-0.7-5.4L625,118.5z"/>
			<path class="st2" d="M636.5,121.9l0.4,3.4l-3.4,0.4l-1.4-10.8l6.7-0.9c0.8-0.1,1.5,0.4,1.5,1.2l0.6,4.8c0.1,0.8-0.4,1.5-1.2,1.5
				L636.5,121.9z M636.1,119.1l1.3-0.2l-0.2-2l-1.3,0.2L636.1,119.1z"/>
			<path class="st2" d="M647.6,112.9l3.4-0.4l1.4,10.8l-3.4,0.4l-0.2-1.3l0.1-3.5l-0.3,0.1l-1.1,4l0.1,1.1l-3.4,0.4l-1.4-10.8
				l3.4-0.4l0.2,1.3l-0.1,3.5l0.3-0.1l1.1-4L647.6,112.9z"/>
			<path class="st2" d="M663.1,121.9l-3.4,0.4l-0.4-3.4l-0.7,0.1l-0.5,3.5l-3.3,0.4l-0.2-1.3l0.7-2.8c-0.5-0.1-1-0.6-1-1.1l-0.5-4.2
				c-0.1-0.8,0.4-1.5,1.2-1.5l6.7-0.9L663.1,121.9z M657.6,116.3l1.3-0.2l-0.2-2l-1.3,0.2L657.6,116.3z"/>
			<text transform="matrix(1 0 0 1 519.4482 182.3994)" class="st5 st6 st7">топос-краеведение</text>
	</g>
</svg>
