<?xml version="1.0" encoding="utf-8"?>
<!-- Generator: Adobe Illustrator 24.0.0, SVG Export Plug-In . SVG Version: 6.00 Build 0)  -->
<svg version="1.1" id="color2" xmlns="http://www.w3.org/2000/svg" xmlns:xlink="http://www.w3.org/1999/xlink" x="0px" y="0px"
	 viewBox="0 0 2000 340" style="enable-background:new 0 0 2000 340;" xml:space="preserve">
<style type="text/css">
	.st0{fill:#416C57;}
</style>
<rect x="239.1" y="240.6" class="st0" width="1694" height="66.2"/>
<path class="st0" d="M864.7,63.3H902V79l-14.6,43.6l17.6,51.1v15.7h-39.3l-10.6-48.8h-7v48.8h-39.4V63.3h39.4v45.7h7L864.7,63.3z"/>
</svg>
