<?xml version="1.0" encoding="utf-8"?>
<!-- Generator: Adobe Illustrator 24.0.0, SVG Export Plug-In . SVG Version: 6.00 Build 0)  -->
<svg version="1.1" id="Слой_1" xmlns="http://www.w3.org/2000/svg" xmlns:xlink="http://www.w3.org/1999/xlink" x="0px" y="0px"
	 viewBox="0 0 223.8 222.2" style="enable-background:new 0 0 223.8 222.2;" xml:space="preserve">
<style type="text/css">
	.st0{fill:#FFFFFF;}
</style>
<rect x="0.8" y="0.7" class="st0" width="221" height="221"/>
<path d="M110.4,206.5c-51.6,0-93.5-42-93.5-93.5s42-93.5,93.5-93.5c51.6,0,93.5,42,93.5,93.5S161.9,206.5,110.4,206.5z M110.4,59.4
	c-29.5,0-53.5,24-53.5,53.5s24,53.5,53.5,53.5s53.5-24,53.5-53.5S139.9,59.4,110.4,59.4z"/>
<path d="M110.4,160.5c-26.2,0-47.5-21.3-47.5-47.5c0-26.2,21.3-47.5,47.5-47.5s47.5,21.3,47.5,47.5
	C157.9,139.2,136.5,160.5,110.4,160.5z M110.4,81.5C93,81.5,78.9,95.6,78.9,113s14.1,31.5,31.5,31.5s31.5-14.1,31.5-31.5
	S127.7,81.5,110.4,81.5z"/>
<path d="M110.4,136.1c-12.7,0-23.1-10.4-23.1-23.1c0-12.7,10.4-23.1,23.1-23.1s23.1,10.4,23.1,23.1
	C133.4,125.7,123.1,136.1,110.4,136.1z M110.4,95.9c-9.4,0-17.1,7.7-17.1,17.1s7.7,17.1,17.1,17.1s17.1-7.7,17.1-17.1
	S119.8,95.9,110.4,95.9z"/>
</svg>
