{
  "app": {
    "title": "Название Приложения",
    "name"     : "Название Приложения",
    "external_systems":[ ],
    "scopes" : "Привет",
    "adapter": "ecosystem",
    "user_model": "User"
  },
  "template": {
    "favicon": "",
    "menu_left" : 1,
    "icon"     : "/assets/img/pp/logo.png",
    "icon_width"  : 35,
    "icon_height" : 35,
    "avatar" : "/assets/img/user1.svg",
    "login": "/login",
    "style": "/assets/css/style_sc.css",
    "styles":[
      {
        "_id" : 1,
        "title" : "Light",
        "url" : "/assets/css/style_minimal.css"
      }
    ],
    "unlogin_panel"        : [ ],
    "login_panel"        : [ ],
    "layout_header"        : [ ],
    "layout-footer"        : [ ],
    "before-place-tab"    : [],
    "category-form-after": [],
    "aside-left"        : [],
    "----room-member"        : [],
    "left_menu"         : "pictogramm",
    "ymap": {
      "default": {
        "lon": 55.76,
        "lat": 37.64,
        "zoom": 20
      }
    }
  },
  "schema" : {
    "User" : {
      "admin_data"    : {"fill":["#5C255C", "#A854A8"]},
      "apollo_fields": {
        "_id"            : {"type":"id", "title": "id", "thread":0, "editable":0 },
        "name"          : {"type":"string", "title": "Имя", "thread":1, "editable":1 },
        "middle_name"      : {"type":"string", "title": "Отчество", "thread":0, "editable":1 },
        "family_name"      : {"type":"string", "title": "Фамилия", "thread":1, "editable":1 },
        "birthdate"      : {"type":"date",   "title": "День рождения", "thread":0, "editable":1 },
        "email"            : {"type":"email",  "title": "Email", "thread":1, "editable":1 },
        "phone_number"    : {"type":"phone",  "title": "Phone", "thread":0, "editable":1 },
        "telegram_id"    : {"type":"string", "title": "telegram id", "thread":0, "editable":0 },
        "vk_id"            : {"type":"string", "title": "vk id", "thread":0, "editable":0 },
        "gender"        : {
          "type"        : "radio",
          "component"    : "string",
          "values"    : [ "male", "female" ],
          "title"        : "Пол",
          "thread"    : 0 ,
          "editable"    : 1
        },
        "roles"            : {
          "type"        : "checkbox",
          "component"    : "string",
          "values"    : [ "user", "admin" ],
          "title"        : "Roles",
          "thread"    : 1,
          "editable"    : 1
        }
      },
      "visibled_value": "email"
    }
  },
  "routing": {
    "profile": [

    ],
    "extended_routes" : [
      {
        "title"        : "Помощь",
        "icon"        : "",
        "route"        : "",
        "component"    : "HTMLState"
      }
    ],
    "bells": [ ],
    "link": [ ],
    "comments": [ ],
    "help":[],
    "main_menu": [],
    "menu": [],
    "footer": [    ]
  }
}