<?xml version="1.0" encoding="utf-8"?>
<!-- Generator: Adobe Illustrator 24.0.0, SVG Export Plug-In . SVG Version: 6.00 Build 0)  -->
<svg version="1.1" id="Слой_1" xmlns="http://www.w3.org/2000/svg" xmlns:xlink="http://www.w3.org/1999/xlink" x="0px" y="0px"
	 viewBox="0 0 100 100" style="enable-background:new 0 0 100 100;" xml:space="preserve">
<style type="text/css">
	.st0{fill:#62A3D9;stroke:#000000;stroke-width:4.715;stroke-miterlimit:10;}
	.st1{fill:#FFFFFF;stroke:#000000;stroke-width:4.715;stroke-miterlimit:10;}
	.st2{fill:#FFFFFF;stroke:#000000;stroke-width:4.7153;stroke-miterlimit:10;}
	.st3{clip-path:url(#SVGID_2_);}
	.st4{fill:#FFFFFF;}
</style>
<circle class="st0" cx="46.6" cy="48.4" r="34.3"/>
<path d="M46.6,85.1c-20.2,0-36.7-16.4-36.7-36.7c0-20.2,16.4-36.7,36.7-36.7s36.7,16.4,36.7,36.7C83.3,68.6,66.8,85.1,46.6,85.1z
	 M46.6,16.5c-17.6,0-31.9,14.3-31.9,31.9C14.7,66,29,80.3,46.6,80.3S78.5,66,78.5,48.4S64.2,16.5,46.6,16.5z"/>
<circle class="st1" cx="20" cy="26.7" r="8.1"/>
<circle class="st2" cx="80.9" cy="46.8" r="8.1"/>
<g>
	<defs>
		<circle id="SVGID_1_" cx="46.6" cy="48.4" r="31.9"/>
	</defs>
	<clipPath id="SVGID_2_">
		<use xlink:href="#SVGID_1_"  style="overflow:visible;"/>
	</clipPath>
	<g class="st3">
		<path d="M56.6,61.9c-1.1,0.1-2.1,0.3-3.1,0.1c-1.8-0.2-3-1.3-3.7-2.9c-0.2-0.5-0.5-0.7-1-0.6c-0.4,0-0.8,0-1.2,0
			c-1.4-0.1-2.5,0-3.4,1.6c-1.1,2-3.3,2.4-6.1,1.6c-0.5,1.4-1,2.8-1.4,4.3c-0.2,0.6-0.5,0.8-1.2,0.8c-1.9-0.1-3.9,0.1-5.8-0.2
			c-4.1-0.6-6.8-5.1-5.6-9.1c1.2-4,2.5-8,3.8-12c1.5-4.5,5.7-7.7,10.5-7.7c5.9-0.1,11.8-0.1,17.7,0c4.9,0.1,9.1,3.3,10.6,8
			c1.2,3.8,2.4,7.6,3.6,11.3c1.6,5.1-1.8,9.7-7.2,9.8c-1.4,0-2.8,0-4.2,0c-0.6,0-0.8-0.2-1-0.7C57.5,64.7,57,63.2,56.6,61.9z
			 M59.1,55.5c1.7-0.3,3.3-1.5,4.3-3.1c2.5-4.1,0.3-9.8-4.6-11.3c-1.4-0.4-2.9-0.4-4.4-0.5c-0.3,0-0.8,0.3-0.9,0.6
			c-0.8,1.4-1.4,2.9-2.2,4.3C51,45.7,50.6,46,50.2,46c-2,0.1-3.9,0.1-5.9,0c-0.3,0-0.8-0.3-1-0.6c-0.6-1-1.2-2-1.5-3
			c-0.5-1.6-1.5-2-3.2-2c-3.9,0.2-7.1,2.5-8.3,6.2c-1,3.4,0.9,7.3,4.2,8.6c0.6,0.2,0.9,0.2,1.3-0.5c1.3-2.5,4.3-3.4,6.7-2.1
			c1.2,0.7,2,1.7,2.5,3c1.4,0,2.8,0,4.2,0C51.1,51.1,57.1,50.9,59.1,55.5z M66.3,53.2c-0.1,0.1-0.2,0.1-0.2,0.1
			c-0.1,0.2-0.3,0.5-0.4,0.7c-1.4,2.1-3.3,3.5-5.7,4.1c-0.9,0.2-1.3,1-1,1.8c0.4,1.2,0.7,2.3,1.2,3.5c0.1,0.2,0.5,0.5,0.7,0.5
			c1,0.1,2,0.1,2.9,0c2.6-0.1,4.8-2.8,4.2-5.3C67.5,56.9,66.8,55.1,66.3,53.2z M28.4,53.1c-0.6,1.9-1.2,3.5-1.6,5.3
			c-0.7,2.7,1.3,5.5,4.1,5.6c1,0.1,2,0,3,0c0.2,0,0.6-0.3,0.7-0.5c0.4-1.2,0.8-2.4,1.2-3.6c0.2-0.7-0.3-1.5-1-1.7
			c-2.5-0.7-4.4-2.1-5.8-4.2C28.8,53.8,28.7,53.5,28.4,53.1z M40.3,54.9c-1.2,0-2.2,1-2.2,2.2c0,1.3,0.9,2.3,2.2,2.3
			c1.2,0,2.2-1,2.2-2.2C42.6,55.9,41.6,54.9,40.3,54.9z M56.5,57.2c0-1.2-1-2.2-2.2-2.2c-1.3,0-2.3,1-2.3,2.2c0,1.3,1,2.2,2.3,2.2
			C55.6,59.4,56.5,58.4,56.5,57.2z M50.6,40.6c-2.2,0-4.3,0-6.4,0c0.7,2.5,1,2.7,3.3,2.7c0.4,0,0.8,0,1.2,0c0.3,0,0.6-0.2,0.7-0.4
			C49.8,42.2,50.2,41.4,50.6,40.6z"/>
		<path d="M52.1,31.9c-3.2-2.5-6.3-2.5-9.6,0.1c-0.6-0.6-1.2-1.3-1.8-1.9c3.2-3.8,9.8-3.8,13.5,0C53.4,30.7,52.7,31.3,52.1,31.9z"/>
		<path d="M48.5,35.7c-0.8,0-1.5,0-2.2,0c-0.5-0.5-1.1-1.1-1.7-1.6c1.4-1.6,3.8-1.7,5.8,0.1C49.6,34.7,49,35.3,48.5,35.7z"/>
		<path class="st4" d="M59.1,55.5c-2-4.6-8-4.4-9.7,0.3c-1.4,0-2.8,0-4.2,0c-0.5-1.3-1.2-2.4-2.5-3c-2.4-1.3-5.4-0.4-6.7,2.1
			c-0.3,0.6-0.6,0.7-1.3,0.5c-3.3-1.3-5.3-5.2-4.2-8.6c1.1-3.7,4.3-6,8.3-6.2c1.7-0.1,2.7,0.3,3.2,2c0.4,1.1,0.9,2,1.5,3
			c0.2,0.3,0.6,0.6,1,0.6c2,0.1,3.9,0.1,5.9,0c0.3,0,0.8-0.3,0.9-0.6c0.8-1.4,1.4-2.9,2.2-4.3c0.2-0.3,0.6-0.6,0.9-0.6
			c1.5,0.1,3,0.1,4.4,0.5c4.9,1.6,7.1,7.2,4.6,11.3C62.4,54,60.8,55.2,59.1,55.5z M36.5,44c0,0.7,0,1.4,0,2c-0.7,0-1.3,0.1-2,0.1
			c0,0.9,0,1.8,0,2.7c0.7,0,1.3,0,2,0c0,0.8,0,1.4,0,2.1c1,0,1.8,0,2.8,0c0-0.7,0-1.3,0-2.1c0.7,0,1.4,0,2.1,0c0-1,0-1.8,0-2.7
			c-0.7,0-1.4-0.1-2.1-0.1c0-0.7,0-1.3,0-2C38.4,44,37.5,44,36.5,44z M55.3,44c0,0.7,0,1.3,0,2c-0.7,0-1.4,0.1-2,0.1
			c0,0.9,0,1.8,0,2.7c0.7,0,1.3,0,2.1,0c0,0.7,0,1.4,0,2c1,0,1.8,0,2.8,0c0-0.7,0-1.3,0-2c0.7,0,1.4-0.1,2-0.1c0-1,0-1.8,0-2.7
			c-0.7,0-1.3-0.1-2-0.1c0-0.7,0-1.3,0-2C57.1,44,56.3,44,55.3,44z M43.2,52.3c0.8,0,1.4,0,2.1,0c0.2,0,0.5-0.3,0.6-0.5
			c0.1-0.7,0-1.4,0-2.2c-1,0-1.8,0-2.7,0C43.2,50.5,43.2,51.3,43.2,52.3z M51.4,52.2c0-0.9,0-1.8,0-2.6c-0.9,0-1.8,0-2.6,0
			c0,0.9,0,1.8,0,2.6C49.7,52.2,50.5,52.2,51.4,52.2z"/>
		<path class="st4" d="M66.3,53.2c0.6,1.9,1.2,3.7,1.7,5.5c0.6,2.5-1.6,5.2-4.2,5.3c-1,0-2,0-2.9,0c-0.3,0-0.7-0.3-0.7-0.5
			c-0.4-1.1-0.8-2.3-1.2-3.5c-0.3-0.9,0.2-1.6,1-1.8c2.4-0.7,4.3-2.1,5.7-4.1c0.2-0.2,0.3-0.5,0.4-0.7
			C66.1,53.4,66.1,53.3,66.3,53.2z"/>
		<path class="st4" d="M28.4,53.1c0.3,0.4,0.4,0.6,0.6,0.9c1.4,2.1,3.3,3.5,5.8,4.2c0.7,0.2,1.2,1,1,1.7c-0.4,1.2-0.8,2.4-1.2,3.6
			c-0.1,0.2-0.4,0.5-0.7,0.5c-1,0.1-2,0.1-3,0c-2.8-0.2-4.8-3-4.1-5.6C27.3,56.7,27.8,55,28.4,53.1z"/>
		<path class="st4" d="M40.3,54.9c1.3,0,2.3,1,2.2,2.3c0,1.2-1,2.2-2.2,2.2c-1.3,0-2.2-1-2.2-2.3C38.1,55.9,39.1,54.9,40.3,54.9z"/>
		<path class="st4" d="M56.5,57.2c0,1.2-0.9,2.2-2.2,2.2c-1.3,0-2.3-1-2.3-2.2c0-1.3,1-2.3,2.3-2.2C55.6,54.9,56.5,55.9,56.5,57.2z"
			/>
		<path class="st4" d="M50.6,40.6c-0.4,0.9-0.8,1.6-1.2,2.3c-0.1,0.2-0.4,0.4-0.7,0.4c-0.4,0.1-0.8,0-1.2,0c-2.3,0-2.7-0.2-3.3-2.7
			C46.3,40.6,48.3,40.6,50.6,40.6z"/>
		<path d="M36.5,44c1,0,1.8,0,2.8,0c0,0.7,0,1.3,0,2c0.7,0,1.4,0.1,2.1,0.1c0,0.9,0,1.7,0,2.7c-0.7,0-1.3,0-2.1,0c0,0.8,0,1.4,0,2.1
			c-0.9,0-1.8,0-2.8,0c0-0.7,0-1.3,0-2.1c-0.8,0-1.4,0-2,0c0-0.9,0-1.8,0-2.7c0.7,0,1.3-0.1,2-0.1C36.5,45.3,36.5,44.7,36.5,44z"/>
		<path d="M55.3,44c1,0,1.8,0,2.8,0c0,0.7,0,1.3,0,2c0.7,0,1.3,0.1,2,0.1c0,0.9,0,1.7,0,2.7c-0.6,0-1.2,0.1-2,0.1c0,0.7,0,1.3,0,2
			c-1,0-1.8,0-2.8,0c0-0.6,0-1.3,0-2c-0.8,0-1.4,0-2.1,0c0-0.9,0-1.8,0-2.7c0.7,0,1.3-0.1,2-0.1C55.3,45.3,55.3,44.7,55.3,44z"/>
		<path d="M43.2,52.3c0-1,0-1.8,0-2.7c0.9,0,1.7,0,2.7,0c0,0.8,0,1.5,0,2.2c0,0.2-0.3,0.5-0.6,0.5C44.7,52.3,44,52.3,43.2,52.3z"/>
		<path d="M51.4,52.2c-0.9,0-1.7,0-2.6,0c0-0.9,0-1.7,0-2.6c0.9,0,1.7,0,2.6,0C51.4,50.5,51.4,51.3,51.4,52.2z"/>
	</g>
</g>
<circle class="st2" cx="29.5" cy="79" r="8.1"/>
</svg>
