<?xml version="1.0" encoding="utf-8"?>
<!-- Generator: Adobe Illustrator 24.0.0, SVG Export Plug-In . SVG Version: 6.00 Build 0)  -->
<svg version="1.1" id="Слой_1" xmlns="http://www.w3.org/2000/svg" xmlns:xlink="http://www.w3.org/1999/xlink" x="0px" y="0px"
	 viewBox="0 0 100 100" style="enable-background:new 0 0 100 100;" xml:space="preserve">
<style type="text/css">
	.st0{fill:#62A3D9;stroke:#000000;stroke-width:4.715;stroke-miterlimit:10;}
	.st1{fill:#FFFFFF;}
	.st2{fill:#FFFFFF;stroke:#000000;stroke-width:4.715;stroke-miterlimit:10;}
	.st3{fill:#FFFFFF;stroke:#000000;stroke-width:4.7153;stroke-miterlimit:10;}
</style>
<circle class="st0" cx="46.6" cy="48.4" r="34.3"/>
<g>
	<path class="st1" d="M57.9,85.1c0,2.1,0,3.9,0,5.8c0,1.3-1.7,2.9-2.9,2.9c-5.6,0-11.2,0-16.8,0c-1.2,0-2.9-1.7-2.9-2.9
		c0-1.9,0-3.8,0-5.8C42.8,85.1,50.2,85.1,57.9,85.1z"/>
</g>
<circle class="st2" cx="20" cy="26.7" r="8.1"/>
<path d="M46.6,85.1c-20.2,0-36.7-16.4-36.7-36.7c0-20.2,16.4-36.7,36.7-36.7s36.7,16.4,36.7,36.7C83.3,68.6,66.8,85.1,46.6,85.1z
	 M46.6,16.5c-17.6,0-31.9,14.3-31.9,31.9C14.7,66,29,80.3,46.6,80.3S78.5,66,78.5,48.4S64.2,16.5,46.6,16.5z"/>
<circle class="st3" cx="80.9" cy="46.8" r="8.1"/>
<circle class="st3" cx="29.5" cy="79" r="8.1"/>
<g>
	<path d="M41.8,60.8c-2.7,2.8-5.4,5.4-8,8.1C27.4,62.4,21,56,14.3,49.4c1.6-1.4,3.2-2.9,4.9-4.4c-11-3-14.5-12-14-18.5
		c0.5-7.9,6.5-14.6,14.2-16c3.9-0.7,7.7-0.2,11.3,1.6c5,2.5,8,6.6,9.4,12.2c1.6-1.7,3.1-3.3,4.5-4.7c6.6,6.6,13,13,19.5,19.5
		c-2.6,2.6-5.3,5.3-8,8c5.3,6.4,10.5,12.7,15.7,19c-3.6,3.6-7.2,7.2-10.8,10.8C54.6,71.4,48.3,66.2,41.8,60.8z M20.2,49.7
		c4.5,4.5,9,9,13.5,13.5c8.1-8.1,16.4-16.4,24.5-24.5c-4.4-4.4-9-9-13.5-13.5C36.7,33.3,28.4,41.5,20.2,49.7z M12.7,18.2
		c-4.5,4.8-5,12.9-1,17.3c6.3-6.3,12.6-12.6,19-19C25.5,12.5,17.4,13.2,12.7,18.2z M22.1,41.2c0.4,0,1-0.3,1.3-0.6
		c4.1-4.1,8.2-8.2,12.3-12.3c0.3-0.3,0.6-0.9,0.6-1.3c-0.1-2.7-1-5.3-2.6-7.4C27.4,26,21.1,32.3,14.7,38.7
		C16.8,40.3,19.3,41.1,22.1,41.2z M44.8,58.2c2.2,1.8,4.3,3.7,6.6,5.4c2.1,1.6,5,1.2,6.8-0.6c1.8-1.8,2-4.7,0.4-6.8
		c-0.3-0.4-0.7-0.8-1-1.2c-1.4-1.7-2.9-3.5-4.3-5.2C50.4,52.6,47.6,55.3,44.8,58.2z M63.3,61.8c-1.1,3.2-3.2,5.3-6.5,6.4
		c1.4,1.1,2.6,2.2,3.7,3.1c2-1.9,3.8-3.8,5.8-5.8C65.4,64.4,64.4,63.1,63.3,61.8z"/>
	<path class="st1" d="M44.8,25.2c-8.1,8.1-16.4,16.4-24.5,24.5c4.5,4.5,9,9,13.5,13.5c8.1-8.1,16.4-16.4,24.5-24.5
		C53.8,34.2,49.3,29.6,44.8,25.2z"/>
	<path class="st1" d="M30.7,16.6c-5.2-4.1-13.3-3.4-18,1.6c-4.5,4.8-5,12.9-1,17.3C18,29.3,24.4,23,30.7,16.6z"/>
	<path class="st1" d="M14.7,38.7c2.1,1.6,4.6,2.4,7.4,2.6c0.4,0,1-0.3,1.3-0.6c4.1-4.1,8.2-8.2,12.3-12.3c0.3-0.3,0.6-0.9,0.6-1.3
		c-0.1-2.7-1-5.3-2.6-7.4C27.4,26,21.1,32.3,14.7,38.7z"/>
	<path class="st1" d="M53.3,49.7c-2.9,2.9-5.7,5.6-8.5,8.5c2.2,1.8,4.3,3.7,6.6,5.4c2.1,1.6,5,1.2,6.8-0.6c1.8-1.8,2-4.7,0.4-6.8
		c-0.3-0.4-0.7-0.8-1-1.2C56.2,53.2,54.8,51.5,53.3,49.7z"/>
	<path class="st1" d="M66.4,65.5c-0.9-1.1-2-2.4-3.1-3.7c-1.1,3.2-3.2,5.3-6.5,6.4c1.4,1.1,2.6,2.2,3.7,3.1
		C62.5,69.3,64.4,67.4,66.4,65.5z"/>
</g>
</svg>
