<?xml version="1.0" encoding="utf-8"?>
<!-- Generator: Adobe Illustrator 24.0.0, SVG Export Plug-In . SVG Version: 6.00 Build 0)  -->
<svg version="1.1" id="Слой_1" xmlns="http://www.w3.org/2000/svg" xmlns:xlink="http://www.w3.org/1999/xlink" x="0px" y="0px"
	 viewBox="0 0 100 100" style="enable-background:new 0 0 100 100;" xml:space="preserve">
<style type="text/css">
	.st0{fill:#62A3D9;stroke:#000000;stroke-width:4.715;stroke-miterlimit:10;}
	.st1{fill:#FFFFFF;}
	.st2{fill:#FFFFFF;stroke:#000000;stroke-width:4.715;stroke-miterlimit:10;}
	.st3{fill:#FFFFFF;stroke:#000000;stroke-width:4.7153;stroke-miterlimit:10;}
</style>
<circle class="st0" cx="46.6" cy="48.4" r="34.3"/>
<g>
	<path class="st1" d="M57.9,85.1c0,2.1,0,3.9,0,5.8c0,1.3-1.7,2.9-2.9,2.9c-5.6,0-11.2,0-16.8,0c-1.2,0-2.9-1.7-2.9-2.9
		c0-1.9,0-3.8,0-5.8C42.8,85.1,50.2,85.1,57.9,85.1z"/>
</g>
<path d="M46.6,85.1c-20.2,0-36.7-16.4-36.7-36.7c0-20.2,16.4-36.7,36.7-36.7s36.7,16.4,36.7,36.7C83.3,68.6,66.8,85.1,46.6,85.1z
	 M46.6,16.5c-17.6,0-31.9,14.3-31.9,31.9C14.7,66,29,80.3,46.6,80.3S78.5,66,78.5,48.4S64.2,16.5,46.6,16.5z"/>
<image style="overflow:visible;enable-background:new    ;" width="243" height="292" xlink:href="A697232E.jpg"  transform="matrix(0.998 0 0 0.998 -7893.7544 -7770.3149)">
</image>
<g>
	<path d="M51.9,23.7c2.2-0.7,3.3,0.6,4.6,1.7c2.1,1.8,3.1,3.8,2.7,6.5c-0.2,1.9,0,3.9,0,6c-1.3,0-2.4,0-3.6,0c-1.2,0-2.4,0-3.6,0
		c0,1.2,0,2.3,0,3.6c2.4,0,4.8,0,7.2,0c0,1.2,0,2.3,0,3.5c2.4,0,4.7,0,7.1,0c0-0.3,0-0.5,0-0.8c0-3.2,0-12.3,0-15.5
		c0-0.5-0.1-0.8-0.6-1c-2.5-1.3-3.5-3.9-2.7-6.5c0.8-2.5,3.1-4,5.9-3.7c2.4,0.2,4.4,2.4,4.6,5c0.2,2.2-1.1,4.1-3.6,5.5
		c0,4.8,0,15.7,0,20.6c-3.6,0-7.1,0-10.7,0c0,1.2,0,2.4,0,3.6c4.7,0,18.1,0,22.9,0c0,1.2,0,2.3,0,3.6c-4.7,0-18.1,0-22.9,0
		c0,1.2,0,2.4,0,3.6c3.5,0,7.1,0,10.7,0c0,2.3,0,7.4,0,9.6c0,0.7,0.2,1,0.8,1.4c2.2,1.2,3.2,3.7,2.6,6c-0.6,2.4-2.8,4-5.2,4
		c-2.4,0-4.6-1.7-5.2-4c-0.6-2.4,0.4-4.9,2.6-6c0.7-0.4,0.9-0.8,0.8-1.5c0-0.9,0-4.8,0-5.8c-2.5,0-4.9,0-7.2,0
		c-2.3,7.4-6.4,10.7-12.7,10.7c-6,0-10.1-3.6-12.4-10.7c-2.4,0-0.2,0-2.7,0c0,1.2,0,8.3,0,9.5c0,0.3,0.4,0.6,0.7,0.7
		c1.9,1.1,2.9,2.7,2.8,4.9c-0.1,2.2-1.2,3.8-3.2,4.8c-2.6,1.2-5.7,0.1-7-2.5c-1.3-2.6-0.4-5.7,2.2-7.1c0.7-0.4,0.8-0.8,0.8-1.5
		c0-2.1,0-10.3,0-12.5c3.6,0,2.6,0,6.2,0c0-1.2,0-2.3,0-3.6c-4.7,0-17.9,0-22.7,0c0-1.2,0-2.4,0-3.6c4.8,0,17.9,0,22.7,0
		c0-1.2,0-2.4,0-3.6c-3.5,0-12,0-15.7,0c0-5,0-9.9,0-14.7c-1.9-0.8-3.2-2.2-3.5-4.2c-0.5-2.8,1.2-5.5,4-6.2c2.7-0.7,5.6,0.9,6.4,3.6
		c0.8,2.6-0.3,5.2-2.7,6.5c-0.3,0.1-0.6,0.5-0.6,0.8c0,3.5,0,6.9,0,10.4c2.3,0,9.6,0,12.1,0c0-1.1,0-2.2,0-3.5c2.5,0,4.8,0,7.2,0
		c0-1.2,0-2.3,0-3.5c-2.3,0-4.7,0-7,0C34,37.8,34,37.7,34,37.5c0-3,0-6,0-8.9c0-0.3,0.2-0.7,0.4-0.9c1.1-1.1,2.2-2.1,3.2-3.3
		c0.7-0.7,1.4-1.1,2.3-0.9c0.4,0,0.7,0,1.2,0c0-2.5,0-4.9,0-7.4c1.2,0,2.4,0,3.6,0c0,2.4,0,4.9,0,7.4c1.2,0,2.3,0,3.5,0
		c0-2.5,0-4.9,0-7.4c1.2,0,2.4,0,3.6,0C51.9,18.5,51.9,21,51.9,23.7z M37.6,45.1c0,0.4,0,0.8,0,1.1c0,4.7,0,9.4,0,14.1
		c0,0.9,0.1,1.8,0.2,2.7c0.7,4.7,5.9,8.2,10.6,7.1c4.5-1.1,7.3-4.6,7.3-9.1c0-5,0-10,0-15c0-0.3,0-0.6,0-0.9c-1.2,0-2.4,0-3.6,0
		c0,2.4,0,4.8,0,7.2c-3.6,0-7.1,0-10.8,0c0-2.4,0-4.8,0-7.2C39.9,45.1,38.8,45.1,37.6,45.1z M48.4,34.2c2.5,0,4.8,0,7.3,0
		c0-0.7-0.1-1.4,0-2c0.3-1.9-0.4-3.3-1.8-4.5c-0.6-0.4-1-0.7-1.8-0.7c-3,0-6,0-9,0c-3,0-3,0-5,2.1c-0.2,0.2-0.4,0.5-0.4,0.7
		c0,1.4,0,2.9,0,4.4c2.5,0,4.8,0,7.3,0c0,4.8,0,9.6,0,14.3c1.2,0,2.3,0,3.5,0C48.4,43.8,48.4,39.1,48.4,34.2z M20,30.6
		c1,0,1.8-0.8,1.8-1.7c0-1-0.9-1.8-1.8-1.8c-0.9,0-1.8,0.8-1.8,1.8C18.2,29.8,19,30.7,20,30.6z M68.2,24.6c1,0,1.9-0.8,1.8-1.8
		c0-0.9-0.9-1.7-1.8-1.7c-1,0-1.9,0.9-1.8,1.8C66.4,23.9,67.2,24.6,68.2,24.6z M29.5,79.9c1,0,1.8-0.8,1.8-1.7c0-1-0.9-1.8-1.8-1.8
		c-0.9,0-1.8,0.8-1.8,1.8C27.7,79.1,28.5,79.9,29.5,79.9z M68.2,76.9c1,0,1.9-0.8,1.8-1.8c0-0.9-0.8-1.7-1.8-1.8
		c-1,0-1.9,0.8-1.8,1.8C66.4,76.1,67.2,76.8,68.2,76.9z"/>
	<path class="st1" d="M37.6,45.1c1.3,0,2.4,0,3.6,0c0,2.4,0,4.8,0,7.2c3.6,0,7.1,0,10.8,0c0-2.4,0-4.7,0-7.2c1.3,0,2.4,0,3.6,0
		c0,0.3,0,0.6,0,0.9c0,5,0,10,0,15c0,4.6-2.8,8.1-7.3,9.1c-4.7,1.1-9.9-2.4-10.6-7.1c-0.1-0.9-0.2-1.8-0.2-2.7c0-4.7,0-9.4,0-14.1
		C37.6,45.9,37.6,45.5,37.6,45.1z M44.8,59.5c-1.2,0-2.4,0-3.5,0c0,1.2,0,2.4,0,3.5c1.2,0,2.3,0,3.5,0
		C44.8,61.8,44.8,60.7,44.8,59.5z M51.9,63.1c0-1.2,0-2.4,0-3.6c-1.2,0-2.3,0-3.5,0c0,1.2,0,2.4,0,3.6
		C49.6,63.1,50.7,63.1,51.9,63.1z"/>
	<path class="st1" d="M48.4,34.2c0,4.9,0,9.6,0,14.4c-1.2,0-2.3,0-3.5,0c0-4.7,0-9.5,0-14.3c-2.5,0-4.8,0-7.3,0c0-1.5,0-2.9,0-4.4
		c0-0.2,0.2-0.5,0.4-0.7c2-2.2,2-2.1,5-2.1c3,0,6,0,9,0c0.7,0,1.2,0.3,1.8,0.7c1.5,1.2,2.1,2.6,1.8,4.5c-0.1,0.6,0,1.3,0,2
		C53.2,34.2,50.9,34.2,48.4,34.2z"/>
	<path class="st1" d="M20,30.6c-1,0-1.9-0.8-1.9-1.8c0-0.9,0.8-1.8,1.8-1.8c1,0,1.9,0.8,1.8,1.8C21.8,29.8,21,30.6,20,30.6z"/>
	<path class="st1" d="M68.2,24.6c-1,0-1.8-0.8-1.8-1.7c0-1,0.8-1.8,1.8-1.8c0.9,0,1.8,0.8,1.8,1.7C70,23.8,69.2,24.6,68.2,24.6z"/>
	<path class="st1" d="M29.5,79.9c-1,0-1.9-0.8-1.8-1.8c0-0.9,0.8-1.8,1.8-1.8c1,0,1.9,0.8,1.8,1.8C31.3,79,30.5,79.8,29.5,79.9z"/>
	<path class="st1" d="M68.2,76.9c-1,0-1.8-0.8-1.8-1.7c0-1,0.9-1.8,1.8-1.8c0.9,0,1.8,0.8,1.8,1.8C70,76,69.2,76.9,68.2,76.9z"/>
	<path d="M44.8,59.5c0,1.2,0,2.3,0,3.5c-1.2,0-2.3,0-3.5,0c0-1.1,0-2.3,0-3.5C42.4,59.5,43.5,59.5,44.8,59.5z"/>
	<path d="M51.9,63.1c-1.2,0-2.3,0-3.5,0c0-1.2,0-2.3,0-3.6c1.2,0,2.3,0,3.5,0C51.9,60.7,51.9,61.8,51.9,63.1z"/>
</g>
<circle class="st2" cx="20" cy="26.7" r="8.1"/>
<circle class="st3" cx="29.5" cy="79" r="8.1"/>
<circle class="st3" cx="80.9" cy="53.2" r="8.1"/>
</svg>
