<?xml version="1.0" encoding="utf-8"?>
<!-- Generator: Adobe Illustrator 24.0.0, SVG Export Plug-In . SVG Version: 6.00 Build 0)  -->
<svg version="1.1" id="Слой_1" xmlns="http://www.w3.org/2000/svg" xmlns:xlink="http://www.w3.org/1999/xlink" x="0px" y="0px"
	 viewBox="0 0 100 100" style="enable-background:new 0 0 100 100;" xml:space="preserve">
<style type="text/css">
	.st0{fill:#62A3D9;stroke:#000000;stroke-width:4.715;stroke-miterlimit:10;}
	.st1{fill:#FFFFFF;}
	.st2{fill:#FFFFFF;stroke:#000000;stroke-width:4.7153;stroke-miterlimit:10;}
	.st3{fill:#FFFFFF;stroke:#000000;stroke-width:4.715;stroke-miterlimit:10;}
</style>
<circle class="st0" cx="46.6" cy="48.4" r="34.3"/>
<g>
	<path class="st1" d="M57.9,85.1c0,2.1,0,3.9,0,5.8c0,1.3-1.7,2.9-2.9,2.9c-5.6,0-11.2,0-16.8,0c-1.2,0-2.9-1.7-2.9-2.9
		c0-1.9,0-3.8,0-5.8C42.8,85.1,50.2,85.1,57.9,85.1z"/>
</g>
<path d="M46.6,85.1c-20.2,0-36.7-16.4-36.7-36.7c0-20.2,16.4-36.7,36.7-36.7s36.7,16.4,36.7,36.7C83.3,68.6,66.8,85.1,46.6,85.1z
	 M46.6,16.5c-17.6,0-31.9,14.3-31.9,31.9C14.7,66,29,80.3,46.6,80.3S78.5,66,78.5,48.4S64.2,16.5,46.6,16.5z"/>
<circle class="st2" cx="80.9" cy="46.8" r="8.1"/>
<circle class="st3" cx="20" cy="26.7" r="8.1"/>
<circle class="st2" cx="29.5" cy="79" r="8.1"/>
<g>
	<path d="M44.1,70.3c-7.9-0.5-13.6-4.9-18.4-10.5c0.8-0.8,1.6-1.6,2.5-2.6c0.7,0.8,1.4,1.7,2.1,2.6c1-1.1,1.8-2,2.7-2.9
		c-2.7-3.6-3.9-8-3.1-12.8c0.6-3.5,2.3-6.5,4.9-9c4.8-4.6,13.4-6.6,21.2-0.9c0.8-0.8,1.6-1.7,2.6-2.7c-0.9-0.7-1.8-1.4-2.8-2.1
		c1.2-1.1,2-1.8,2.9-2.6c6.7,5.5,11,12.3,10.6,21.5C69,58.9,60.3,68.6,49.7,70.1c-0.6,0.1-1.2,0.2-1.9,0.3c0,2.2,0,4.5,0,6.7
		c0,1.2,0,11.3,0,12.5c0,2.4,1.5,3.9,3.9,3.9c2.2,0,4.5,0,6.8,0c0,1.2,0,2.3,0,3.5c-8.3,0-16.7,0-25.1,0c0-1.1,0-2.3,0-3.5
		c2.1,0,4.1,0,6.2,0c0.7,0,1.5,0,2.1-0.2c1.4-0.4,2.3-1.5,2.4-2.9C44.2,86.7,44.1,74.1,44.1,70.3z M42.4,52.3c0.5,0,0.9,0,1.4,0
		c4.2,0,8.4,0,12.5,0c0.9,0,1.3-0.3,1.5-1.1c1.5-4.6,0.8-8.8-2.3-12.4c-3.1-3.7-7.2-5.1-12-4.3c-2.4,0.4-4.4,1.4-6.4,3.4
		c1.9,0,3.5,0,5.1,0c0,1.3,0,2.4,0,3.6c-0.4,0-0.8,0.1-1.2,0.1c-1.9,0-3.8,0-5.7,0c-0.4,0-0.9,0.2-1.1,0.5c-0.4,0.9-0.6,1.9-1,3.1
		c4.4,0,8.5,0,12.5,0c0,1.3,0,2.4,0,3.6c-2.1,0-4.2,0-6.2,0c-2,0-4.1,0-6.1,0c0.2,4.5,4.2,9.1,9.1,10.4c4.3,1.2,10-0.3,11.9-3.2
		c-4.1,0-8.1,0-12.1,0C42.4,54.6,42.4,53.5,42.4,52.3z M33.3,62.1c8.3,7.1,21.2,5.8,28.1-2.8c7-8.7,4.6-20.2-0.3-24.9
		c-0.8,0.8-1.6,1.6-2.4,2.3c4.8,8.6,4.5,15.5-0.9,21.3c-2.3,2.5-5.2,4.2-8.6,4.8c-4.9,1-9.5-0.1-13.4-3.1
		C35,60.5,34.2,61.3,33.3,62.1z"/>
	<path class="st1" d="M42.4,52.3c0,1.2,0,2.4,0,3.6c4,0,8,0,12.1,0c-1.9,2.9-7.6,4.4-11.9,3.2c-4.9-1.3-8.9-5.9-9.1-10.4
		c2,0,4.1,0,6.1,0c2,0,4.1,0,6.2,0c0-1.2,0-2.3,0-3.6c-4.1,0-8.2,0-12.5,0c0.4-1.2,0.6-2.2,1-3.1c0.1-0.3,0.7-0.5,1.1-0.5
		c1.9,0,3.8,0,5.7,0c0.4,0,0.8,0,1.2-0.1c0-1.2,0-2.3,0-3.6c-1.6,0-3.2,0-5.1,0c2-1.9,4.1-3,6.4-3.4c4.8-0.8,8.9,0.6,12,4.3
		c3.1,3.7,3.7,7.9,2.3,12.4c-0.3,0.8-0.6,1.1-1.5,1.1c-4.2-0.1-8.4,0-12.5,0C43.4,52.3,42.9,52.3,42.4,52.3z M53.1,48.6
		c0-1.2,0-2.3,0-3.5c-1.2,0-2.3,0-3.4,0c0,1.2,0,2.3,0,3.5C50.9,48.6,52,48.6,53.1,48.6z"/>
	<path d="M53.1,48.6c-1.1,0-2.2,0-3.4,0c0-1.1,0-2.3,0-3.5c1.1,0,2.2,0,3.4,0C53.1,46.3,53.1,47.4,53.1,48.6z"/>
</g>
</svg>
