<?xml version="1.0" encoding="utf-8"?>
<!-- Generator: Adobe Illustrator 24.0.0, SVG Export Plug-In . SVG Version: 6.00 Build 0)  -->
<svg version="1.1" id="Слой_1" xmlns="http://www.w3.org/2000/svg" xmlns:xlink="http://www.w3.org/1999/xlink" x="0px" y="0px"
	 viewBox="0 0 100 100" style="enable-background:new 0 0 100 100;" xml:space="preserve">
<style type="text/css">
	.st0{fill:#62A3D9;stroke:#000000;stroke-width:4.715;stroke-miterlimit:10;}
	.st1{fill:#FFFFFF;}
	.st2{fill:#FFFFFF;stroke:#000000;stroke-width:4.7153;stroke-miterlimit:10;}
</style>
<circle class="st0" cx="46.6" cy="48.4" r="34.3"/>
<path d="M46.6,85.1c-20.2,0-36.7-16.4-36.7-36.7c0-20.2,16.4-36.7,36.7-36.7s36.7,16.4,36.7,36.7C83.3,68.6,66.8,85.1,46.6,85.1z
	 M46.6,16.5c-17.6,0-31.9,14.3-31.9,31.9C14.7,66,29,80.3,46.6,80.3S78.5,66,78.5,48.4S64.2,16.5,46.6,16.5z"/>
<image style="overflow:visible;enable-background:new    ;" width="243" height="292" xlink:href="A697232E.jpg"  transform="matrix(0.998 0 0 0.998 -7893.7544 -7770.3149)">
</image>
<g>
	<path d="M75.8,56.1c0,1.4,0,2.7,0,4c-0.2,5,0.2,10.2-0.6,15.1c-2,11.9-13.3,20.2-25.5,19.4c-11.9-0.8-21.8-10.5-22.5-22.4
		C26.9,67.6,27,63,27,58.3c0-0.7,0-1.4,0-2c-1.7-0.1-3.3-0.2-4.8-0.2c-0.4,0-1,0.3-1.2,0.7c-1.6,2.7-3.3,5.3-4.6,8.2
		c-0.6,1.3-0.3,3-0.4,4.6c0,0.7,0.1,1.5,0,2.2c-0.1,1.2,0.3,1.9,1.4,2.5c4.3,2.5,5.3,8.2,2.2,12c-1.2,1.5-2.8,1.9-4.1,0.9
		c-1.3-0.9-1.4-2.5-0.3-4.1c0.9-1.3,1.1-2.6-0.1-3.7c-1-1-2.3-1.1-3.5-0.3c-1.4,0.9-1.4,2.4-0.3,4.1c1.3,2,0.7,4.3-1.5,4.4
		C9,87.6,7.8,87,7.2,86.4c-3.4-3.7-2.4-9.7,2.1-12.2c1.1-0.6,1.5-1.2,1.3-2.4c-0.8-5.5,0.7-10.3,3.9-14.7c0.4-0.5,0.6-1.2,1-1.7
		c1.1-1.7,1.6-3.2,1-5.5c-1.1-3.9,1.3-7.9,5-9.3c3.7-1.4,7.9,0,9.8,3.6c0.6,1.2,1.4,1.4,2.5,1.4c1.3-0.1,2.5,0,3.9,0
		c0-1.8,0-3.5,0-5.4c-0.9,0-1.8,0-2.7,0c-4.2-0.1-7.7-3.2-7.8-7.3c-0.1-4.2-0.2-8.5,0.8-12.5c2.7-11.5,14-19.2,25.6-18.1
		c12,1.2,21.3,10.7,22.1,22.6c0.2,2.3,0.2,4.6,0.1,6.9c-0.1,5.1-3.5,8.3-8.6,8.4c-0.6,0-1.3,0-2.2,0c0,1,0,1.8,0,2.6
		c0,0.8,0,1.7,0,2.6c2,0,3.9,0,5.8,0c2.5-4.4,5.8-6.1,9.8-5c4.6,1.3,7.1,6,5.5,10.5c-0.4,1.1-0.4,1.9,0.3,2.8
		c0.6,0.8,0.9,1.8,1.5,2.6c3.4,4.7,5.1,9.8,4.3,15.7c-0.1,1,0.3,1.5,1.2,1.9c4.5,2.5,5.6,8.2,2.6,12.1c-1.3,1.6-2.9,2-4.2,1
		c-1.3-0.9-1.4-2.5-0.2-4.1c0.9-1.3,1-2.6-0.1-3.7c-1-1-2.1-1.1-3.3-0.3c-1.4,0.8-1.6,2.5-0.6,3.9c1.3,1.9,1.2,3.5-0.3,4.4
		c-1.4,0.9-3,0.4-4.3-1.4c-2.7-3.8-1.6-9.3,2.5-11.6c1.2-0.7,1.4-1.4,1.5-2.7c0.4-4.3-0.5-8.1-3.1-11.5c-0.1-0.2-0.3-0.4-0.4-0.6
		c-1-2.3-2.1-4.1-5.1-3.1C77.7,56.5,76.9,56.2,75.8,56.1z M32.5,51c0,0.7-0.1,1.2-0.1,1.7c0,5.7,0,11.3,0,17c0,1.4,0.1,2.8,0.3,4.1
		c1.9,9.6,10.4,16,20,15.3c9.4-0.7,17-8.3,17.4-18c0.3-6.5,0.1-13,0.1-19.5c0-0.2-0.1-0.4-0.2-0.7C57.6,51,45.2,51,32.5,51z
		 M51.4,34.7c5.2,0,10.5,0,15.7,0c2.3,0,3.2-0.9,3.3-3.1c0-2.1,0.1-4.2-0.1-6.3c-0.6-9.4-8.2-17-17.5-17.6C43.4,7,34.9,13.2,33,22.5
		c-0.6,2.8-0.4,5.7-0.5,8.6c-0.1,2.7,0.9,3.6,3.6,3.6C41.1,34.7,46.2,34.7,51.4,34.7z M43.3,45.4c5.5,0,10.8,0,16.1,0
		c0-1.8,0-3.5,0-5.1c-5.4,0-10.7,0-16.1,0C43.3,42,43.3,43.6,43.3,45.4z M27,48.2c0-1.4-1.2-2.6-2.7-2.6c-1.5,0-2.7,1.3-2.7,2.8
		c0,1.4,1.2,2.6,2.7,2.6C25.8,50.9,27,49.7,27,48.2z M81.2,48.2c0-1.4-1.2-2.6-2.6-2.7c-1.5,0-2.8,1.2-2.7,2.7
		c0,1.4,1.2,2.6,2.6,2.7C79.9,51,81.2,49.7,81.2,48.2z"/>
	<path class="st1" d="M32.5,51c12.7,0,25.1,0,37.6,0c0.1,0.3,0.2,0.5,0.2,0.7c0,6.5,0.2,13-0.1,19.5c-0.4,9.7-8,17.3-17.4,18
		c-9.6,0.7-18.1-5.8-20-15.3c-0.3-1.3-0.3-2.8-0.3-4.1c0-5.7,0-11.3,0-17C32.4,52.2,32.5,51.7,32.5,51z M52.4,73
		c-1.1,2.3-2.2,4.4-3.2,6.5c-0.9,1.8-0.5,3.3,1,4c1.4,0.8,2.9,0.2,3.8-1.6c1.7-3.3,3.4-6.6,5-10c1.2-2.5,0-4.3-2.7-4.4
		c-1.9,0-3.8,0-6,0c1.2-2.5,2.3-4.7,3.3-6.9c0.8-1.8,0.4-3.3-1-4c-1.5-0.7-2.9-0.1-3.8,1.6c-1.7,3.4-3.4,6.9-5,10.4
		c-1.2,2.5,0,4.3,2.8,4.3C48.4,73,50.3,73,52.4,73z"/>
	<path class="st1" d="M51.4,34.7c-5.1,0-10.2,0-15.3,0c-2.7,0-3.6-0.9-3.6-3.6c0.1-2.9-0.1-5.8,0.5-8.6C34.9,13.2,43.4,7,52.8,7.6
		c9.3,0.6,16.8,8.2,17.5,17.6c0.1,2.1,0.1,4.2,0.1,6.3c0,2.2-1,3.1-3.3,3.1C61.8,34.7,56.6,34.7,51.4,34.7z M51.4,29.3
		c4.5,0,8.1-3.7,8.1-8.2c0-4.4-3.6-8-8-8.1c-4.5,0-8.2,3.6-8.2,8.1C43.3,25.6,46.9,29.3,51.4,29.3z"/>
	<path class="st1" d="M43.3,45.4c0-1.8,0-3.4,0-5.1c5.4,0,10.7,0,16.1,0c0,1.7,0,3.3,0,5.1C54.1,45.4,48.8,45.4,43.3,45.4z"/>
	<path class="st1" d="M27,48.2c0,1.5-1.2,2.8-2.7,2.8c-1.4,0-2.6-1.2-2.7-2.6c0-1.5,1.2-2.8,2.7-2.8C25.7,45.5,26.9,46.7,27,48.2z"
		/>
	<path class="st1" d="M81.2,48.2c0,1.5-1.2,2.8-2.7,2.7c-1.4,0-2.6-1.2-2.6-2.7c0-1.5,1.3-2.8,2.7-2.7C80,45.6,81.2,46.8,81.2,48.2z
		"/>
	<path d="M52.4,73c-2.1,0-4,0-5.8,0c-2.8,0-4-1.8-2.8-4.3c1.6-3.5,3.3-6.9,5-10.4c0.9-1.8,2.3-2.4,3.8-1.6c1.5,0.7,1.9,2.2,1,4
		c-1,2.2-2.1,4.4-3.3,6.9c2.2,0,4.1,0,6,0c2.7,0,3.9,1.9,2.7,4.4c-1.6,3.4-3.3,6.7-5,10c-0.9,1.8-2.4,2.3-3.8,1.6
		c-1.5-0.8-1.8-2.3-1-4C50.2,77.4,51.3,75.3,52.4,73z"/>
	<path d="M51.4,29.3c-4.5,0-8.1-3.7-8.1-8.2c0-4.5,3.7-8.1,8.2-8.1c4.4,0,8,3.6,8,8.1C59.6,25.6,55.9,29.3,51.4,29.3z M51.4,23.8
		c1.4,0,2.6-1.1,2.7-2.6c0.1-1.5-1.1-2.8-2.6-2.8c-1.4,0-2.6,1.2-2.7,2.6C48.7,22.5,49.9,23.8,51.4,23.8z"/>
	<path class="st1" d="M51.4,23.8c-1.5,0-2.7-1.3-2.6-2.8c0.1-1.4,1.3-2.6,2.7-2.6c1.5,0,2.7,1.3,2.6,2.8
		C54,22.7,52.8,23.8,51.4,23.8z"/>
</g>
<circle class="st2" cx="80.9" cy="46.8" r="8.1"/>
<circle class="st2" cx="29.5" cy="79" r="8.1"/>
</svg>
