<?xml version="1.0" encoding="utf-8"?>
<!-- Generator: Adobe Illustrator 24.0.0, SVG Export Plug-In . SVG Version: 6.00 Build 0)  -->
<svg version="1.1" id="Слой_1" xmlns="http://www.w3.org/2000/svg" xmlns:xlink="http://www.w3.org/1999/xlink" x="0px" y="0px"
	 viewBox="0 0 100 100" style="enable-background:new 0 0 100 100;" xml:space="preserve">
<style type="text/css">
	.st0{fill:#62A3D9;stroke:#000000;stroke-width:4.715;stroke-miterlimit:10;}
	.st1{fill:#FFFFFF;stroke:#000000;stroke-width:4.715;stroke-miterlimit:10;}
	.st2{fill:#FFFFFF;stroke:#000000;stroke-width:4.7153;stroke-miterlimit:10;}
	.st3{stroke:#000000;stroke-width:1.1577;stroke-miterlimit:10;}
</style>
<circle class="st0" cx="46.6" cy="48.4" r="34.3"/>
<circle class="st1" cx="20" cy="26.7" r="8.1"/>
<circle class="st2" cx="80.9" cy="46.8" r="8.1"/>
<circle class="st2" cx="29.5" cy="79" r="8.1"/>
<g>
	<path class="st3" d="M29.7,57c0-1.2,0-2.1,0-3.1c0-4.9,0-9.7,0-14.6c0-3.1,2.1-5.2,5.2-5.2c4.1,0,8,0,12,0c1.3,0,2.1,0.6,2.1,1.6
		s-0.8,1.6-2.1,1.6c-3.9,0-7.9,0-11.8,0c-1.5,0-2.1,0.6-2.1,2.1c0,5.1,0,10.3,0,15.4c0,1.5,0.6,2.1,2.1,2.1c8.2,0,16.4,0,24.7,0
		c1.5,0,2-0.6,2.1-2.1c0-0.9,0-1.9,0-2.8c0-1,0.7-1.7,1.6-1.7c0.9,0,1.6,0.7,1.6,1.7c0,1.6,0,3.1,0,4.9c0.3,0,1,0,1.6,0
		c1,0,1.6,0.7,1.7,1.7c0,1,0,2.1,0,3.2c0,2.8-2.2,4.9-5,4.9c-6.6,0-13.2,0-19.9,0c-3.9,0-7.9,0-11.8,0c-3.1,0-5.2-2.1-5.2-5.2
		c0-0.9,0-1.9,0-2.9c0-1.2,0.7-1.7,1.7-1.7C28.8,57,29.4,57,29.7,57z M29.7,60.4c0,0.2,0,0.5,0,0.7c0,2.1,0.3,2.5,2.5,2.5
		c10.2,0,20.4,0,30.4,0c0.2,0,0.5,0,0.7,0c0.8-0.1,1.5-0.7,1.5-1.5c0-0.6,0-1.2,0-1.7C53.4,60.4,41.6,60.4,29.7,60.4z"/>
	<path class="st3" d="M52.1,36.2c0-2.1,0-4.1,0-6.1c0-2.9,2.1-5,5-5c2.1,0,4.3,0,6.4,0c2.8,0,5,2.1,5,5c0,4.2,0,8.2,0,12.4
		c0,2.8-2.2,5-4.9,5c-2.2,0-4.4,0-6.5,0c-2.8,0-4.9-2.2-4.9-5C52,40.3,52.1,38.2,52.1,36.2z M65.2,36.2c0-2,0-4.1,0-6
		c0-1.3-0.6-1.9-1.9-1.9c-2,0-4.1,0-6,0c-1.3,0-1.9,0.6-1.9,1.9c0,3.9,0,8,0,11.9c0,1.3,0.6,1.9,1.9,1.9c2,0,4.1,0,6,0
		c1.3,0,1.9-0.6,2-1.9C65.2,40.1,65.2,38.2,65.2,36.2z"/>
	<path class="st3" d="M61.8,39.1c0,0.9-0.8,1.6-1.7,1.6s-1.6-0.8-1.6-1.6c0-0.9,0.8-1.6,1.7-1.6C61.1,37.5,61.8,38.2,61.8,39.1z"/>
</g>
</svg>
