<?xml version="1.0" encoding="utf-8"?>
<!-- Generator: Adobe Illustrator 24.0.0, SVG Export Plug-In . SVG Version: 6.00 Build 0)  -->
<svg version="1.1" id="Слой_1" xmlns="http://www.w3.org/2000/svg" xmlns:xlink="http://www.w3.org/1999/xlink" x="0px" y="0px"
	 viewBox="0 0 100 100" style="enable-background:new 0 0 100 100;" xml:space="preserve">
<style type="text/css">
	.st0{fill:#62A3D9;stroke:#000000;stroke-width:4.715;stroke-miterlimit:10;}
	.st1{fill:#FFFFFF;stroke:#000000;stroke-width:4.715;stroke-miterlimit:10;}
	.st2{fill:#FFFFFF;stroke:#000000;stroke-width:4.7153;stroke-miterlimit:10;}
	.st3{fill:#FFFFFF;}
</style>
<circle class="st0" cx="46.6" cy="48.4" r="34.3"/>
<path d="M46.6,85.1c-20.2,0-36.7-16.4-36.7-36.7c0-20.2,16.4-36.7,36.7-36.7s36.7,16.4,36.7,36.7C83.3,68.6,66.8,85.1,46.6,85.1z
	 M46.6,16.5c-17.6,0-31.9,14.3-31.9,31.9C14.7,66,29,80.3,46.6,80.3S78.5,66,78.5,48.4S64.2,16.5,46.6,16.5z"/>
<circle class="st1" cx="20" cy="26.7" r="8.1"/>
<circle class="st2" cx="80.9" cy="46.8" r="8.1"/>
<circle class="st2" cx="29.5" cy="79" r="8.1"/>
<g>
	<path d="M82.3,54.1c-1.6,0-3.1,0-4.6,0c-0.4,1.7-0.9,3.5-1.3,5.2c-0.1,0.4,0.3,1,0.7,1.4c4.9,4.6,5.8,10.5,5.2,16.9
		c-1.3,0-2.6,0-4.2,0c0-1.4,0-2.7,0-4.1c0.1-4.2-1.5-7.7-4.8-10.3c-0.8-0.7-2.3-0.5-3.7-0.8c0,3.1,0,5.8,0,8.7c-4.3,0-8.5,0-12.9,0
		c0-2.8,0-5.5,0-8.3c-2-0.4-3.6-0.2-5,1.4c-2.3,2.6-3.5,5.5-3.6,8.9c0,1.5,0,2.9,0,4.5c-1.4,0-2.8,0-4.2,0
		c-0.6-6.3,0.2-12.1,5.2-16.7c0.8-0.7,0.9-1.4,0.6-2.3c-0.4-1.4-0.8-2.9-1.1-4.3c-1.6,0-3.1,0-4.8,0c0,0.8,0,1.6,0,2.3
		c-0.1,4.5-3.7,8.2-8.2,8.3c-4.4,0.2-8.6-3.2-8.7-7.6c-0.2-6.7-0.1-13.3-0.1-20.2c2.1,0,4.2,0,6.3,0c0-1.5,0-2.8,0-4.2
		c-2.1,0-4.1,0-6.3,0c0-1.5,0-2.8,0-4.2c2,0,4.1,0,6.3,0c0-1.5,0-2.8,0-4.3c1.5,0,2.8,0,4.3,0c0,1.3,0,2.7,0,4.1c2.2,0,4.2,0,6.3,0
		c0,1.5,0,2.8,0,4.3c-2,0-4,0-6.1,0c0,1.5,0,2.8,0,4.3c3.2,0,6.4,0,9.6,0c0.4,0,0.8-0.4,1.1-0.6c2.2-1.7,4.4-3.4,6.7-5
		c0.6-0.4,1.4-0.7,2-0.7c4-0.1,8-0.1,12.1,0c0.7,0,1.5,0.3,2.1,0.7c2.3,1.6,4.5,3.3,6.7,5c0.4,0.3,0.8,0.6,1.2,0.6
		c3.2,0.1,6.3,0,9.5,0c0-1.5,0-2.8,0-4.2c-2,0-4.1,0-6.2,0c0-1.5,0-2.8,0-4.3c2,0,4,0,6.2,0c0-1.5,0-2.8,0-4.2c1.5,0,2.9,0,4.3,0
		c0,1.4,0,2.7,0,4.1c2.2,0,4.2,0,6.4,0c0,1.5,0,2.8,0,4.2c-2,0-4.1,0-6.2,0c0,1.5,0,2.8,0,4.3c2.1,0,4.1,0,6.2,0
		c0,0.5,0.1,0.8,0.1,1.2c0,6,0,12,0,18c0,4.5-3.3,8.1-7.8,8.6c-4.1,0.4-8.1-2.5-9.1-6.8C82.3,56.8,82.4,55.5,82.3,54.1z M82.3,49.8
		c0-2.9,0-5.6,0-8.4c-1.1,0-2.1-0.1-3,0c-1.4,0.1-2.4-0.3-3.5-1.2c-1.9-1.6-4-3.1-6-4.5c-0.6-0.4-1.4-0.7-2.1-0.7
		c-3.1-0.1-6.1-0.1-9.2,0c-0.7,0-1.5,0.3-2,0.7c-2.3,1.6-4.5,3.4-6.7,5c-0.5,0.4-1.3,0.6-1.9,0.6c-1.3,0.1-2.6,0-3.9,0
		c0,3,0,5.7,0,8.4c4.3,0,8.5,0,12.8,0c0-2.8,0-5.6,0-8.4c4.3,0,8.5,0,12.9,0c0,2.8,0,5.6,0,8.4C73.9,49.8,78,49.8,82.3,49.8z
		 M39.5,50c-2.9,0-5.7,0-8.5,0c0,2.2-0.1,4.4,0,6.5c0.1,2.3,2,4.1,4.3,4.1c2.2,0,4.1-1.7,4.2-3.9C39.6,54.5,39.5,52.3,39.5,50z
		 M86.8,49.9c-0.1,0.2-0.1,0.4-0.1,0.5c0,2,0,4,0,6c0.1,2.2,1.7,3.9,3.9,4.2c2,0.2,4.2-1.2,4.5-3.3c0.3-2.4,0.1-4.9,0.1-7.3
		C92.3,49.9,89.6,49.9,86.8,49.9z M73.2,54.2c-6.8,0-13.4,0-20.1,0c0.4,1.5,0.7,2.8,1,4.1c6.1,0,12.1,0,18.1,0
		C72.5,56.9,72.8,55.6,73.2,54.2z M39.5,41.4c-2.9,0-5.7,0-8.4,0c0,1.4,0,2.7,0,4c2.8,0,5.6,0,8.4,0C39.5,44.1,39.5,42.8,39.5,41.4z
		 M86.7,45.4c2.9,0,5.7,0,8.4,0c0-1.4,0-2.7,0-4c-2.8,0-5.6,0-8.4,0C86.7,42.8,86.7,44.1,86.7,45.4z M65.2,49.8c0-1.5,0-2.8,0-4.1
		c-1.4,0-2.7,0-4.1,0c0,1.4,0,2.7,0,4.1C62.4,49.8,63.7,49.8,65.2,49.8z M61,66.8c1.4,0,2.7,0,4.1,0c0-1.4,0-2.8,0-4.1
		c-1.4,0-2.7,0-4.1,0C61,64.2,61,65.5,61,66.8z"/>
	<path class="st3" d="M82.3,49.8c-4.3,0-8.4,0-12.7,0c0-2.8,0-5.6,0-8.4c-4.4,0-8.5,0-12.9,0c0,2.8,0,5.5,0,8.4c-4.3,0-8.5,0-12.8,0
		c0-2.7,0-5.4,0-8.4c1.3,0,2.6,0.1,3.9,0c0.7,0,1.4-0.3,1.9-0.6c2.3-1.6,4.5-3.4,6.7-5c0.6-0.4,1.4-0.7,2-0.7c3.1-0.1,6.1-0.1,9.2,0
		c0.7,0,1.5,0.3,2.1,0.7c2,1.4,4.1,2.9,6,4.5c1.1,0.9,2.1,1.3,3.5,1.2c1-0.1,2,0,3,0C82.3,44.2,82.3,46.9,82.3,49.8z"/>
	<path class="st3" d="M39.5,50c0,2.3,0.1,4.5,0,6.7c-0.1,2.1-2,3.8-4.2,3.9c-2.2,0-4.2-1.8-4.3-4.1c-0.1-2.1,0-4.3,0-6.5
		C33.8,50,36.6,50,39.5,50z"/>
	<path class="st3" d="M86.8,49.9c2.8,0,5.5,0,8.3,0c0,2.5,0.2,4.9-0.1,7.3c-0.2,2.1-2.4,3.5-4.5,3.3c-2.2-0.2-3.8-1.9-3.9-4.2
		c0-2,0-4,0-6C86.7,50.3,86.7,50.1,86.8,49.9z"/>
	<path class="st3" d="M73.2,54.2c-0.4,1.4-0.7,2.7-1,4.1c-6,0-12,0-18.1,0c-0.3-1.3-0.7-2.7-1-4.1C59.8,54.2,66.3,54.2,73.2,54.2z"
		/>
	<path class="st3" d="M39.5,41.4c0,1.4,0,2.7,0,4c-2.8,0-5.6,0-8.4,0c0-1.3,0-2.6,0-4C33.9,41.4,36.6,41.4,39.5,41.4z"/>
	<path class="st3" d="M86.7,45.4c0-1.4,0-2.7,0-4c2.8,0,5.5,0,8.4,0c0,1.3,0,2.6,0,4C92.4,45.4,89.6,45.4,86.7,45.4z"/>
	<path class="st3" d="M65.2,49.8c-1.4,0-2.7,0-4.1,0c0-1.4,0-2.8,0-4.1c1.4,0,2.7,0,4.1,0C65.2,47,65.2,48.3,65.2,49.8z"/>
	<path class="st3" d="M61,66.8c0-1.4,0-2.7,0-4.1c1.4,0,2.6,0,4.1,0c0,1.3,0,2.6,0,4.1C63.8,66.8,62.4,66.8,61,66.8z"/>
</g>
</svg>
