<?xml version="1.0" encoding="utf-8"?>
<!-- Generator: Adobe Illustrator 24.0.0, SVG Export Plug-In . SVG Version: 6.00 Build 0)  -->
<svg version="1.1" id="Слой_1" xmlns="http://www.w3.org/2000/svg" xmlns:xlink="http://www.w3.org/1999/xlink" x="0px" y="0px"
	 viewBox="0 0 100 100" style="enable-background:new 0 0 100 100;" xml:space="preserve">
<style type="text/css">
	.st0{fill:#62A3D9;stroke:#000000;stroke-width:4.715;stroke-miterlimit:10;}
	.st1{fill:#FFFFFF;stroke:#000000;stroke-width:4.7153;stroke-miterlimit:10;}
	.st2{clip-path:url(#SVGID_2_);}
	.st3{fill:#AACFE8;}
	.st4{fill:#62A3D9;}
	.st5{fill:#FFFFFF;}
</style>
<circle class="st0" cx="46.6" cy="48.4" r="34.3"/>
<path d="M46.6,85.1c-20.2,0-36.7-16.4-36.7-36.7c0-20.2,16.4-36.7,36.7-36.7s36.7,16.4,36.7,36.7C83.3,68.6,66.8,85.1,46.6,85.1z
	 M46.6,16.5c-17.6,0-31.9,14.3-31.9,31.9C14.7,66,29,80.3,46.6,80.3S78.5,66,78.5,48.4S64.2,16.5,46.6,16.5z"/>
<circle class="st1" cx="80.9" cy="46.8" r="8.1"/>
<g>
	<defs>
		<path id="SVGID_1_" d="M76.9,38.4V-4.9H16.3v43.4c-1,3.1-1.6,6.4-1.6,9.9C14.7,66,29,80.3,46.6,80.3c17.6,0,31.9-14.3,31.9-31.9
			C78.5,44.9,77.9,41.5,76.9,38.4z"/>
	</defs>
	<clipPath id="SVGID_2_">
		<use xlink:href="#SVGID_1_"  style="overflow:visible;"/>
	</clipPath>
	<g class="st2">
		<path d="M58.3,28.4c-0.2,0.2-0.2,0.3-0.3,0.4c-2.6,1.4-3.1,3.5-2.9,6.3c0.2,3.4-1.5,5.3-4.9,6c-0.1,0-0.2,0.1-0.4,0.1
			c-0.4,1.1,0,1.7,1,2.1c3.1,1.3,6.3,2.6,9.3,4.1c5.8,2.7,9,7.2,9.3,13.7c0.2,3.9,0,29.6,0,33.5c0,0.2-0.1,0.4-0.1,0.7H10.1
			c0-0.1-0.2-0.3-0.2-0.5c0-4.2-0.2-30.2,0.1-34.5c0.4-5.9,3.5-10.2,8.8-12.7c3.1-1.5,6.4-2.9,9.6-4.2c1.3-0.5,1.6-1.1,1.3-3
			c-0.3-1.4-0.3-2.9,0-4.3c0.3-1.5,0-2.3-0.9-3.1c-4.5-4-6.7-9-5.2-15.1C25,12,28.7,8.1,34.5,6.3c9.7-3,19.4,3.8,20.2,14.2
			c0.1,1.5,0.5,2.7,1.3,3.9C56.8,25.7,57.6,27,58.3,28.4z M35,53.1c0,1.9,0,3.8,0,5.9c2.7-1.8,2.7-1.8,2.7-4.9c0-5.9,0-11.7,0-17.6
			c0-4.5,2.9-7.2,7.3-7.3c1.5,0,3-0.1,4.5,0c1.5,0.1,2.6-0.5,3.6-1.7c-0.7-1.2-1.6-2.3-2-3.5c-0.4-1.3-0.3-2.7-0.5-4
			c0-0.1,0-0.3,0-0.4c-0.8-5.7-6-10-12-9.8c-5.8,0.1-10.8,4.7-11.4,10.4c-0.5,4.9,1.8,8.3,5.6,11c0.7,0.5,1,1,1,1.8
			c0,3.8-0.1,7.5,0,11.3c0,1-0.3,1.4-1.2,1.8c-4,1.7-7.9,3.4-11.9,5.2c-3.5,1.6-6,4.2-6.5,8c-0.4,3.4-0.1,28.7-0.1,32.2
			c1.7,0,3.6,0,5.4,0c0-0.2,0.1-21.9,0.1-22c0-0.5,0-1.1,0.1-1.6c0.1-4.8,2.1-8.6,6-11.4c0.7-0.5,1.5-1,2.1-1.6
			C29.9,52.5,32.4,52.9,35,53.1z M51,33.1c-1.8,0-3.6,0-5.4,0c-2.9,0-3.8,1-3.8,3.8c0,6,0,12,0,18c0,2.1,0.7,3,2.8,3.9
			c0-1.9,0-3.8,0-5.8c1.5,0,2.9,0,4.3,0c0.4,0,0.8,0.2,1.1,0.4c1.5,1.1,3,2.2,4.5,3.3c2.6,2,4.3,4.7,4.9,7.9
			c0.3,1.6,0.4,24.9,0.5,26.6c1.9,0,3.7,0,5.7,0c0-2.5,0-26.7,0-29.1c0-5.4-2.5-9.2-7.5-11.4c-3.4-1.5-6.7-3.1-10.2-4.4
			c-1.8-0.7-2.4-1.6-2.3-3.5c0.2-1.9,0-3.8,0-5.9c0.8,0,1.5,0,2.1,0c3.4,0,3.6-0.2,3.3-3.6C51.1,33.4,51.1,33.4,51,33.1z M44.4,91.2
			c0.5-5,0.5-26.7-3.2-29.7c-0.2-0.2-0.5-0.4-0.7-0.6c-0.5-0.5-0.9-0.5-1.5,0c-1.1,1-2.3,1.9-3.5,2.9c-0.3,0.2-0.5,0.6-0.6,1
			c-0.1,1.6,0,24.9,0,26.5C38.2,91.2,41.3,91.2,44.4,91.2z M48.5,57.5c0,2.1,0,4.1,0,6.1c0,2,0,25.7,0,27.6c2.5,0,4.8,0,7.1,0
			C56.4,86.2,53.9,60.2,48.5,57.5z M30.9,91.2c0-4,0-29.7,0-33.7c-5.4,2.8-7.8,28.7-7.1,33.7C26.2,91.2,28.5,91.2,30.9,91.2z"/>
		<path class="st3" d="M35,53.1c-2.7-0.2-5.2-0.5-7.2,1.6c-0.6,0.6-1.4,1.1-2.1,1.6c-3.9,2.8-5.8,6.6-6,11.4c0,0.5,0,1.1-0.1,1.6
			c0,0,0,21.8-0.1,22c-1.8,0-3.7,0-5.4,0c0-0.8,0-23.3,0-24.1c-0.1-2.7-0.2-5.4,0.1-8.1c0.5-3.8,3-6.4,6.5-8
			c3.9-1.8,7.9-3.5,11.9-5.2c0.8-0.4,1.2-0.8,1.2-1.8c-0.1-3.8-0.1-7.5,0-11.3c0-0.9-0.3-1.3-1-1.8c-3.8-2.7-6.1-6.1-5.6-11
			c0.6-5.7,5.6-10.3,11.4-10.4c6-0.1,11.2,4.1,12,9.8c0,0.1,0,0.3,0,0.4c0.1,1.3,0.1,2.8,0.5,4c0.4,1.3,1.3,2.4,2,3.5
			c-0.9,1.2-2,1.8-3.6,1.7c-1.5-0.1-3,0-4.5,0c-4.5,0.1-7.3,2.9-7.3,7.3c0,5.9,0,11.7,0,17.6c0,3,0,3-2.7,4.9C35,56.9,35,55,35,53.1
			z"/>
		<path class="st3" d="M51,33.1c0.1,0.3,0.2,0.3,0.2,0.3c0.2,3.4,0.1,3.6-3.3,3.6c-0.6,0-1.2,0-2.1,0c0,2,0.1,3.9,0,5.9
			c-0.2,1.9,0.5,2.8,2.3,3.5c3.5,1.3,6.8,2.9,10.2,4.4c5,2.2,7.5,5.9,7.5,11.4c0,2,0,4.1,0,6.2c0,0.4,0,22.5,0,22.9
			c-2,0-3.8,0-5.7,0c0-0.3-0.1-22.3-0.1-22.6c0-0.1,0-0.3,0-0.4c-0.1-1.2-0.2-2.4-0.4-3.6c-0.6-3.2-2.3-5.9-4.9-7.9
			c-1.5-1.1-3-2.2-4.5-3.3c-0.3-0.2-0.7-0.4-1.1-0.4c-1.4-0.1-2.8,0-4.3,0c0,2,0,3.9,0,5.8c-2.1-0.8-2.8-1.8-2.8-3.9c0-6,0-12,0-18
			c0-2.8,1-3.8,3.8-3.8C47.4,33.1,49.2,33.1,51,33.1z"/>
		<path class="st4" d="M44.4,91.2c-3.2,0-6.2,0-9.4,0c0-0.5,0-22.7,0-23.2c0-1.1,0-2.2,0-3.3c0-0.3,0.3-0.7,0.6-1
			c1.1-1,2.3-1.9,3.5-2.9c0.6-0.5,1-0.4,1.5,0c0.2,0.2,0.5,0.4,0.7,0.6c3.2,2.6,3.6,2.9,3.4,6.3C44.6,68.3,44.5,90.6,44.4,91.2z"/>
		<path class="st5" d="M48.5,57.5c4.9,2.5,7.4,6.2,7.3,10.6c0,0.1,0,0.3,0,0.5c0,0.3-0.1,22.4-0.1,22.7c-2.3,0-4.6,0-7.1,0
			c0-0.5,0-22.7,0-23.2c0-1.5,0-3,0-4.5C48.5,61.6,48.5,59.6,48.5,57.5z"/>
		<path class="st5" d="M30.9,91.2c-2.4,0-4.8,0-7.1,0c-0.1-0.6-0.1-22.9-0.1-23.4c0-4.3,2.5-7.8,7.2-10.3c0,3.4,0,6.9,0,10.3
			C30.9,68.4,30.9,90.7,30.9,91.2z"/>
	</g>
</g>
<circle class="st1" cx="29.5" cy="79" r="8.1"/>
</svg>
