<?xml version="1.0" encoding="utf-8"?>
<!-- Generator: Adobe Illustrator 24.0.0, SVG Export Plug-In . SVG Version: 6.00 Build 0)  -->
<svg version="1.1" id="Слой_1" xmlns="http://www.w3.org/2000/svg" xmlns:xlink="http://www.w3.org/1999/xlink" x="0px" y="0px"
	 viewBox="0 0 100 100" style="enable-background:new 0 0 100 100;" xml:space="preserve">
<style type="text/css">
	.st0{fill:#62A3D9;stroke:#000000;stroke-width:4.715;stroke-miterlimit:10;}
	.st1{fill:#FFFFFF;stroke:#000000;stroke-width:4.7153;stroke-miterlimit:10;}
	.st2{opacity:0;fill:#FFFFFF;}
</style>
<circle class="st0" cx="46.6" cy="48.4" r="34.3"/>
<circle class="st1" cx="29.5" cy="79" r="8.1"/>
<circle class="st1" cx="20" cy="26.7" r="8.1"/>
<circle class="st1" cx="80.9" cy="46.8" r="8.1"/>
<g>
	<path d="M46.7,21.5c7.1,0.4,12.7,3.6,15.8,10.1c3.1,6.6,2.3,12.9-2.1,18.7c-2.9,3.8-6,7.5-9,11.3c-2.7,3.3-7,3.3-9.6,0
		c-3-3.8-6.1-7.5-9-11.3c-4.2-5.4-5.1-11.3-2.6-17.6c2.6-6.3,7.4-10,14.2-11C45.1,21.6,45.9,21.5,46.7,21.5z M32.8,39.9
		c0,2.5,1,5.3,3,7.8c3,3.7,6,7.5,9,11.2c1.2,1.5,2.4,1.5,3.6,0c3-3.8,6.1-7.5,9-11.3c2.4-3.1,3.3-6.6,2.8-10.4
		c-1-7.2-7.4-12.3-14.6-11.8C38.5,26,32.8,32,32.8,39.9z"/>
	<path d="M46.6,72.1c-4.1-0.2-8-0.8-11.7-2.6c-1.9-0.9-3.6-2-4.8-3.8c-1.9-2.7-1.6-6.1,0.7-8.4c0.8-0.8,1.9-0.9,2.7-0.2
		c0.8,0.7,1,1.9,0.2,2.7c-1.7,1.9-0.9,3.4,0.7,4.7c2.4,1.8,5.1,2.6,8,3c4.5,0.7,8.9,0.4,13.2-1.3c1.3-0.5,2.5-1.3,3.6-2.2
		c1.5-1.2,1.5-2.5,0.3-4c-0.8-1.1-0.8-2.2,0.1-3c0.9-0.7,2-0.6,2.9,0.5c2.4,2.8,2.3,6.3-0.2,9c-2.3,2.5-5.4,3.7-8.6,4.4
		C51.4,71.6,49,71.8,46.6,72.1z"/>
	<path class="st2" d="M32.8,39.9c0-7.9,5.7-14,12.8-14.5c7.2-0.5,13.6,4.7,14.6,11.8c0.6,3.9-0.4,7.4-2.8,10.4c-3,3.8-6,7.5-9,11.3
		c-1.2,1.5-2.4,1.5-3.6,0c-3-3.7-6-7.5-9-11.2C33.8,45.3,32.8,42.4,32.8,39.9z M36.7,39.2c0,5.4,4.4,9.9,9.8,9.9
		c5.4,0,9.9-4.4,9.9-9.7c0-5.5-4.4-9.9-9.8-9.9C41.2,29.4,36.8,33.8,36.7,39.2z"/>
	<path d="M36.7,39.2c0-5.4,4.5-9.8,9.9-9.8c5.5,0,9.9,4.5,9.8,9.9c0,5.4-4.5,9.8-9.9,9.7C41.1,49.1,36.7,44.6,36.7,39.2z M52.5,39.3
		c0-3.2-2.6-5.9-5.8-5.9c-3.2,0-5.9,2.6-6,5.8c0,3.3,2.6,6,5.9,6C49.8,45.2,52.5,42.5,52.5,39.3z"/>
	<path class="st2" d="M52.5,39.3c0,3.2-2.7,5.9-5.9,5.9c-3.3,0-5.9-2.7-5.9-6c0-3.2,2.7-5.8,6-5.8C49.9,33.4,52.5,36,52.5,39.3z"/>
</g>
</svg>
