<?xml version="1.0" encoding="utf-8"?>
<!-- Generator: Adobe Illustrator 24.0.0, SVG Export Plug-In . SVG Version: 6.00 Build 0)  -->
<svg version="1.1" id="Слой_1" xmlns="http://www.w3.org/2000/svg" xmlns:xlink="http://www.w3.org/1999/xlink" x="0px" y="0px"
	 viewBox="0 0 100 100" style="enable-background:new 0 0 100 100;" xml:space="preserve">
<style type="text/css">
	.st0{fill:#62A3D9;stroke:#000000;stroke-width:4.715;stroke-miterlimit:10;}
	.st1{fill:#FFFFFF;stroke:#000000;stroke-width:4.715;stroke-miterlimit:10;}
	.st2{fill:#FFFFFF;stroke:#000000;stroke-width:4.7153;stroke-miterlimit:10;}
	.st3{stroke:#000000;stroke-miterlimit:10;}
	.st4{fill:#FFFFFF;stroke:#000000;stroke-miterlimit:10;}
</style>
<circle class="st0" cx="46.6" cy="48.4" r="34.3"/>
<circle class="st1" cx="20" cy="26.7" r="8.1"/>
<circle class="st2" cx="80.9" cy="46.8" r="8.1"/>
<circle class="st2" cx="29.5" cy="79" r="8.1"/>
<g>
	<path class="st3" d="M46.6,40.4c0,1.8,0,3.5,0,5.3c0,1.5,0.6,2.1,2.1,2.1c3.4,0,6.9,0,10.3,0c3.8,0,6.1,3,5.1,6.6
		c-2.3,9.1-10.5,15.1-20,14.9c-9-0.2-16.8-6.9-18.7-15.9c-2-10.3,4.6-20.7,14.8-23.2c3.4-0.8,6.4,1.5,6.4,5
		C46.6,36.9,46.6,38.7,46.6,40.4z M43.2,40.8c0-1.7,0-3.5,0-5.2c0-1.9-0.9-2.5-2.7-2c-8.4,2.3-13.4,10.5-11.8,19.1
		c1.4,7.4,7.9,13,15.4,13.3c7.9,0.3,14.8-4.8,16.7-12.3c0.4-1.6-0.3-2.5-1.9-2.5c-3.5,0-7.1,0-10.6,0c-2.9,0-5.1-2.2-5.1-5.1
		C43.2,44.3,43.2,42.6,43.2,40.8z"/>
	<path class="st3" d="M59.1,44.4c-1.3,0-2.6,0-3.9,0c-2.9,0-5.1-2.3-5.1-5.1c0-2.6,0-5.2,0-7.8c0-3.5,3.3-6,6.6-5
		c5.7,1.8,9.5,5.6,11.3,11.3c1.1,3.3-1.4,6.6-5,6.6C61.6,44.5,60.3,44.4,59.1,44.4z M59,41.1c1.3,0,2.5,0,3.8,0
		c1.5,0,2.3-1.1,1.8-2.5c-1.5-4.3-4.4-7.2-8.7-8.7c-1.5-0.5-2.6,0.3-2.6,1.9c0,2.5,0,4.9,0,7.4c0,1.3,0.7,2,2,2
		C56.6,41.1,57.8,41.1,59,41.1z"/>
	<path class="st4" d="M43.2,40.8c0,1.7,0,3.5,0,5.2c0,2.9,2.2,5.1,5.1,5.1c3.5,0,7.1,0,10.6,0c1.7,0,2.3,0.9,1.9,2.5
		c-1.9,7.5-8.8,12.5-16.7,12.3c-7.5-0.2-14-5.9-15.4-13.3c-1.6-8.6,3.4-16.8,11.8-19.1c1.8-0.5,2.7,0.2,2.7,2
		C43.2,37.4,43.2,39.1,43.2,40.8z"/>
	<path class="st4" d="M59,41.1c-1.2,0-2.4,0-3.6,0c-1.3,0-2-0.7-2-2c0-2.5,0-4.9,0-7.4c0-1.6,1.1-2.4,2.6-1.9
		c4.3,1.5,7.2,4.4,8.7,8.7c0.5,1.4-0.3,2.5-1.8,2.5C61.5,41.1,60.2,41.1,59,41.1z"/>
</g>
</svg>
