<?xml version="1.0" encoding="utf-8"?>
<!-- Generator: Adobe Illustrator 24.0.0, SVG Export Plug-In . SVG Version: 6.00 Build 0)  -->
<svg version="1.1" id="Слой_1" xmlns="http://www.w3.org/2000/svg" xmlns:xlink="http://www.w3.org/1999/xlink" x="0px" y="0px"
	 viewBox="0 0 100 100" style="enable-background:new 0 0 100 100;" xml:space="preserve">
<style type="text/css">
	.st0{fill:#62A3D9;stroke:#000000;stroke-width:4.715;stroke-miterlimit:10;}
	.st1{fill:#FFFFFF;stroke:#000000;stroke-width:4.715;stroke-miterlimit:10;}
	.st2{fill:#FFFFFF;}
	.st3{fill:#FFFFFF;stroke:#000000;stroke-width:4.7153;stroke-miterlimit:10;}
</style>
<path d="M47.6,85.1c-20.2,0-36.7-16.4-36.7-36.7c0-20.2,16.4-36.7,36.7-36.7s36.7,16.4,36.7,36.7C84.3,68.6,67.8,85.1,47.6,85.1z
	 M47.6,16.5c-17.6,0-31.9,14.3-31.9,31.9C15.7,66,30,80.3,47.6,80.3S79.5,66,79.5,48.4S65.2,16.5,47.6,16.5z"/>
<circle class="st0" cx="47.8" cy="48" r="34.3"/>
<image style="overflow:visible;enable-background:new    ;" width="243" height="292" xlink:href="A697232E.jpg"  transform="matrix(0.998 0 0 0.998 -7893.7544 -7770.3149)">
</image>
<circle class="st1" cx="20" cy="26.7" r="8.1"/>
<g>
	<path d="M65.9,63.2c-0.8,0-1.3,0-1.9,0c-4.6,0-9.2,0-13.8,0c-2.4,0-3.2-0.8-3.2-3.2c0-5.6,0-11.2,0-16.8c0-12.7,0-25.3,0-38
		c0-2.8,0.7-3.5,3.5-3.5c11.9,0,23.9,0,35.8,0c2.5,0,3.3,0.7,3.3,3.2c0,18.3,0,36.6,0,54.9c0,2.5-0.8,3.3-3.3,3.3
		c-4.6,0-9.2,0-13.8,0c-0.6,0-1.1,0-1.9,0c0,1.6-0.1,3,0,4.4c0,0.4,0.5,0.8,0.8,1.1c0.9,0.9,2,1.5,2.7,2.6c0.7,1.1,1.3,1.4,2.6,1.4
		c9.4-0.1,6.8,0,16.3,0c0.5,0,1,0,1.4,0c1.2,0.2,2,1,2,2.2c0,1.3-0.7,2.1-1.9,2.4c-0.5,0.1-1,0.1-1.6,0.1c-9.5,0-7,0-16.6,0
		c-1,0-1.5,0.2-2.1,1.2c-2.7,4.8-9.4,4.8-12.1,0.1c-0.6-1-1.2-1.3-2.3-1.3c-9.4,0-18.8,0-28.3,0c-0.5,0-1.1,0.1-1.6,0
		c-1.3-0.3-2-1.1-2-2.4c0.1-1.2,0.8-2,2.1-2.2c0.5-0.1,0.9,0,1.4,0c9.5,0,18.9,0,28.4,0c1,0,1.7-0.2,2.2-1.2c0.5-1,1.4-1.9,2.4-2.4
		c1.1-0.6,1.5-1.3,1.4-2.5C65.9,65.6,65.9,64.5,65.9,63.2z M51.9,6.5c0,17.4,0,34.6,0,51.9c11,0,22,0,32.9,0c0-17.3,0-34.6,0-51.9
		C73.8,6.5,62.9,6.5,51.9,6.5z M70.6,75c0-1.3-1.1-2.4-2.4-2.3c-1.2,0-2.3,1-2.3,2.3c0,1.3,1,2.4,2.3,2.4
		C69.6,77.4,70.7,76.3,70.6,75z"/>
	<path class="st2" d="M51.9,6.5c11,0,21.9,0,32.9,0c0,17.3,0,34.5,0,51.9c-11,0-21.9,0-32.9,0C51.9,41.1,51.9,23.9,51.9,6.5z
		 M68.3,25.3c3,0,6,0,8.9,0c2,0,2.8-0.8,2.8-2.7c0-2.9,0-5.7,0-8.6c0-1.9-0.9-2.8-2.8-2.8c-6,0-12,0-18,0c-1.9,0-2.8,0.9-2.8,2.8
		c0,2.9,0,5.7,0,8.6c0,1.9,0.9,2.8,2.8,2.8C62.3,25.3,65.3,25.3,68.3,25.3z M68.1,44.2c3.9,0.1,7.1-2.9,7.3-6.9
		c0.1-3.9-2.9-7.1-6.9-7.3c-3.8-0.2-7.1,3-7.3,6.9C61.1,40.8,64.2,44.1,68.1,44.2z M58.9,49c-1.3,0-2.3,1-2.4,2.2
		c0,1.3,1,2.5,2.3,2.5c1.2,0,2.3-1,2.4-2.2C61.2,50.1,60.2,49.1,58.9,49z M68.2,53.7c1.2,0,2.3-1,2.4-2.2c0-1.3-1-2.4-2.3-2.4
		c-1.3,0-2.3,1-2.4,2.2C65.9,52.5,67,53.7,68.2,53.7z M80,51.4C80,50,79,49,77.6,49c-1.3,0-2.3,1.1-2.3,2.3c0,1.3,1.1,2.4,2.4,2.4
		C79,53.7,80.1,52.6,80,51.4z"/>
	<path class="st2" d="M70.6,75c0,1.3-1.1,2.4-2.4,2.4c-1.3,0-2.4-1.1-2.3-2.4c0-1.2,1-2.3,2.3-2.3C69.5,72.6,70.6,73.7,70.6,75z"/>
	<path d="M68.3,25.3c-3,0-6.1,0-9.1,0c-1.9,0-2.8-0.8-2.8-2.8c0-2.9,0-5.7,0-8.6c0-1.9,0.9-2.8,2.8-2.8c6,0,12,0,18,0
		c1.9,0,2.8,0.9,2.8,2.8c0,2.9,0,5.7,0,8.6c0,1.9-0.9,2.7-2.8,2.7C74.3,25.3,71.3,25.3,68.3,25.3z M75.3,20.5c0-1.7,0-3.1,0-4.6
		c-4.7,0-9.3,0-14,0c0,1.6,0,3,0,4.6C66,20.5,70.6,20.5,75.3,20.5z"/>
	<path d="M68.1,44.2c-3.9-0.1-7-3.4-6.9-7.3c0.2-3.9,3.5-7,7.3-6.9c3.9,0.2,7,3.4,6.9,7.3C75.2,41.3,72,44.4,68.1,44.2z M68.4,39.5
		c1.3,0,2.3-1.1,2.3-2.3c0-1.3-1.1-2.4-2.4-2.4c-1.2,0-2.3,1.1-2.3,2.4C65.9,38.5,67,39.5,68.4,39.5z"/>
	<path d="M58.9,49c1.3,0,2.3,1.1,2.3,2.4c0,1.2-1.1,2.2-2.4,2.2c-1.3,0-2.3-1.2-2.3-2.5C56.6,50,57.6,49,58.9,49z"/>
	<path d="M68.2,53.7c-1.3,0-2.3-1.2-2.3-2.5c0-1.2,1.1-2.2,2.4-2.2c1.3,0,2.3,1.1,2.3,2.4C70.6,52.7,69.5,53.7,68.2,53.7z"/>
	<path d="M80,51.4c0,1.2-1,2.3-2.3,2.3c-1.3,0-2.4-1.1-2.4-2.4c0-1.2,1-2.3,2.3-2.3C79,49,80,50,80,51.4z"/>
	<path class="st2" d="M75.3,20.5c-4.7,0-9.3,0-14,0c0-1.5,0-3,0-4.6c4.7,0,9.3,0,14,0C75.3,17.4,75.3,18.9,75.3,20.5z"/>
	<path class="st2" d="M68.4,39.5c-1.3,0-2.4-1-2.4-2.3c0-1.2,1-2.3,2.3-2.4c1.3,0,2.4,1.1,2.4,2.4C70.6,38.4,69.6,39.5,68.4,39.5z"
		/>
</g>
<circle class="st3" cx="29.5" cy="79" r="8.1"/>
</svg>
