<?xml version="1.0" encoding="utf-8"?>
<!-- Generator: Adobe Illustrator 24.0.0, SVG Export Plug-In . SVG Version: 6.00 Build 0)  -->
<svg version="1.1" id="Слой_1" xmlns="http://www.w3.org/2000/svg" xmlns:xlink="http://www.w3.org/1999/xlink" x="0px" y="0px"
	 viewBox="0 0 100 100" style="enable-background:new 0 0 100 100;" xml:space="preserve">
<style type="text/css">
	.st0{fill:#62A3D9;stroke:#000000;stroke-width:4.715;stroke-miterlimit:10;}
	.st1{clip-path:url(#SVGID_2_);}
	.st2{clip-path:url(#SVGID_2_);fill:#FFFFFF;}
	.st3{fill:#FFFFFF;stroke:#000000;stroke-width:4.7153;stroke-miterlimit:10;}
	.st4{fill:#FFFFFF;stroke:#000000;stroke-width:4.715;stroke-miterlimit:10;}
	.st5{fill:#FFFFFF;}
</style>
<circle class="st0" cx="46.6" cy="48.4" r="34.3"/>
<g>
	<defs>
		<path id="SVGID_1_" d="M89-1.3H7.3V60h7.1c4.8,13.2,17.4,22.7,32.3,22.7c14.9,0,27.5-9.5,32.3-22.7H89V-1.3z"/>
	</defs>
	<clipPath id="SVGID_2_">
		<use xlink:href="#SVGID_1_"  style="overflow:visible;"/>
	</clipPath>
	<path class="st1" d="M79,57.7c0.9,0.7,1.7,1.3,2.5,2c3.2,3,4.8,6.8,4.8,11.2c0,5,0,6.5,0,9.2c0,1.9-0.8,2.7-2.7,2.7
		c-19.1,0-38.3,0-57.4,0c-1.9,0-2.7-0.8-2.7-2.7c0-3.1,0-6.1,0-9.2c0.1-5.4,2.4-9.7,7-12.7c0.1-0.1,0.3-0.2,0.7-0.5
		c-0.3-0.2-0.6-0.3-0.9-0.5C24.2,51.5,25,41.2,32,36.9c1.6-1,3.4-1.6,5.4-1.6c3.7,0,7.5,0,11.2,0c1.3,0,2.2,0.8,2.2,2
		c0,4,0.1,8-0.1,12.1c-0.1,3.1-1.6,5.6-3.9,7.7c-0.2,0.2-0.5,0.4-0.8,0.7c0.8,0.6,1.5,1.1,2.4,1.7C50,57.3,52.2,56,55,56
		c2.8-0.1,5.1,1,6.9,3.2c0.7-0.5,1.4-1,2.1-1.4c-0.9-1.1-2-2.1-2.7-3.3c-4.8-7.5,0-17.5,8.8-18.6c0.6-0.1,0.8-0.5,1-0.9
		c3.4-5.9,11.7-6.3,15.3-0.6c2.6,4,1.7,9.2-2,12.1c-0.3,0.2-0.5,0.6-0.5,0.9c0.1,4.1-1.5,7.4-4.6,10.1C79.1,57.5,79.1,57.6,79,57.7z
		 M49.1,70.2c-1.1-1.4-2.1-2.8-2.2-4.5c-0.1-1.5-1-2.4-2-3.3c-1.3-1.1-2.8-1.7-4.5-2c-5.6-1.1-11.5,2.8-12.2,8.5
		c-0.4,3-0.2,6.1-0.2,9.2c0,0,0.1,0.1,0.1,0.1c5.4,0,10.8,0,16.3,0C44.8,74.9,46.4,72.2,49.1,70.2z M81.9,78.3c0-3.1,0.2-6,0-8.9
		c-0.4-4.3-2.9-7.1-6.8-8.6c-4-1.4-7.6-0.7-10.7,2.2c-0.3,0.3-0.7,0.7-0.7,1c0,2.3-0.8,4.3-2.3,6.1c0.2,0.2,0.4,0.4,0.6,0.5
		c2.1,1.7,3.4,3.9,3.9,6.6c0.1,0.8,0.5,1,1.2,1c4.6,0,9.2,0,13.8,0C81.2,78.3,81.5,78.3,81.9,78.3z M63.9,49.2
		c0.2,2.6,2.4,5.2,5.1,6.1c3.3,1,6.5,0.1,8.6-2.5c1.9-2.3,2.3-5.7,1-8.1C74.6,49.1,69.7,50.5,63.9,49.2z M46.1,49.4
		c-5.1,0-10.2,0-15.3,0c0.6,3.8,4.1,6.6,8,6.4C42.4,55.7,45.7,52.8,46.1,49.4z M31.1,44.8c5.1,0,10.1,0,15.1,0c0-1.7,0-3.4,0-5.2
		c-1.8,0-3.6,0-5.3,0c-1.4,0-2.8,0-4.2,0.2C34,40.2,31.6,42.4,31.1,44.8z M61.4,78.3c0-3-3.2-5.7-6.4-5.5c-3.2,0.2-6.2,2.9-5.9,5.5
		C53.2,78.3,57.3,78.3,61.4,78.3z M55.2,68.3c2.2,0,4-1.7,4-4c0-2.1-1.8-3.9-3.9-4c-2.2,0-4,1.8-4,4C51.3,66.6,53,68.3,55.2,68.3z
		 M75.4,41.3c-4.2-2.9-9.8-0.1-10.8,3.4C68.3,46.2,73.2,44.7,75.4,41.3z M82.4,42c1.5-1.5,1.3-4.4-0.6-6.1c-1.8-1.6-4.8-1.4-6.2,0.3
		c1.2,0.8,2.6,1.5,3.7,2.4C80.5,39.6,81.4,40.8,82.4,42z"/>
	<path class="st1" d="M43,2.6c1.6,0,3.2,0.5,4.7,1.6c0.5,0.4,0.7,0.4,1.3,0.1c3.2-2.2,6.8-2.3,9.8-0.2c2.9,2,4.2,5.6,3.4,9.2
		c-0.9,4.1-3.3,7.2-6.4,9.9c-1.5,1.4-3.3,2.5-5,3.6c-1.5,0.9-3.3,1-4.9,0.1c-5.3-3-9.4-7.2-11.4-13.1C32.8,8.2,36.9,2.7,43,2.6z
		 M58.2,11.4c-0.1,0-0.2-0.1-0.2-0.1c0-2-1.1-3.6-2.9-4.1c-1.8-0.5-3.6,0.3-4.7,2.1c-1.1,1.8-3,1.8-4.1,0C45,7.3,43,6.5,41,7.4
		c-2,0.9-2.9,3-2.1,5.3c1.6,4.3,4.7,7.4,8.4,9.9c0.7,0.5,1.4,0.4,2.1,0c3.1-1.9,5.7-4.3,7.4-7.5C57.5,13.9,57.8,12.6,58.2,11.4z"/>
	<path class="st2" d="M49.1,70.2c-2.8,2-4.3,4.7-4.7,8c-0.2,14.5-8.2,6.8-13.6,6.8c0,5.9-2.8,0.9-2.8,0.9c0-3.1-0.2-14,0.2-17
		c0.7-5.7,6.6-9.6,12.2-8.5c1.7,0.3,3.2,1,4.5,2c1,0.8,2,1.7,2,3.3C47.1,67.4,48,68.8,49.1,70.2z"/>
	<path class="st2" d="M81.9,78.3c-0.4,0-0.7,0-1,0c-4.6,0-9.2,0-13.8,0c-0.7,0-1-0.1-1.2-1c-0.4-2.7-1.8-4.9-3.9-6.6
		c-0.2-0.2-0.4-0.3-0.6-0.5c1.5-1.8,2.3-3.8,2.3-6.1c0-0.3,0.4-0.7,0.7-1c3.1-2.9,6.8-3.7,10.7-2.2c3.9,1.4,6.4,4.3,6.8,8.6
		C82.1,72.2,81.9,75.2,81.9,78.3z"/>
	<path class="st2" d="M46.1,49.4c-0.4,3.4-3.7,6.3-7.3,6.4c-3.9,0.1-7.4-2.6-8-6.4C35.9,49.4,41,49.4,46.1,49.4z"/>
	<path class="st2" d="M31.1,44.8c0.5-2.4,2.8-4.6,5.6-5c1.4-0.2,2.8-0.2,4.2-0.2c1.8,0,3.5,0,5.3,0c0,1.8,0,3.5,0,5.2
		C41.2,44.8,36.2,44.8,31.1,44.8z"/>
	<path class="st2" d="M61.4,78.3c8.7,18.1-16,21.7-12.3,0c-0.3-2.6,2.7-5.3,5.9-5.5C58.2,72.6,61.4,75.3,61.4,78.3z"/>
	<path class="st2" d="M55.2,68.3c-2.3,0-4-1.7-4-4c0-2.2,1.8-4,4-4c2.2,0,3.9,1.8,3.9,4C59.2,66.6,57.5,68.3,55.2,68.3z"/>
</g>
<path d="M46.6,85.1c-20.2,0-36.7-16.4-36.7-36.7c0-20.2,16.4-36.7,36.7-36.7s36.7,16.4,36.7,36.7C83.3,68.6,66.8,85.1,46.6,85.1z
	 M46.6,16.5c-17.6,0-31.9,14.3-31.9,31.9C14.7,66,29,80.3,46.6,80.3c17.6,0,31.9-14.3,31.9-31.9C78.5,30.8,64.2,16.5,46.6,16.5z"/>
<circle class="st3" cx="29.5" cy="79" r="8.1"/>
<circle class="st4" cx="20" cy="26.7" r="8.1"/>
<path class="st5" d="M58.2,11.4c-0.5,1.2-0.8,2.6-1.4,3.7c-1.8,3.2-4.3,5.6-7.4,7.5c-0.7,0.4-1.4,0.5-2.1,0
	c-3.7-2.5-6.8-5.6-8.4-9.9C38.1,10.4,39,8.4,41,7.4c1.9-0.9,4-0.2,5.3,1.9c1.1,1.8,2.9,1.8,4.1,0c1.1-1.8,2.9-2.6,4.7-2.1
	c1.8,0.5,2.9,2.1,2.9,4.1C58.1,11.3,58.2,11.3,58.2,11.4z"/>
<path class="st5" d="M63.9,49.2c5.8,1.3,10.7-0.2,14.6-4.5c1.3,2.4,0.9,5.8-1,8.1c-2.1,2.6-5.3,3.5-8.6,2.5
	C66.3,54.4,64.1,51.8,63.9,49.2z"/>
<path class="st5" d="M75.4,41.3c-2.2,3.4-7.2,4.9-10.8,3.4C65.6,41.2,71.3,38.4,75.4,41.3z"/>
<path class="st5" d="M82.4,42c-1-1.1-1.9-2.4-3.1-3.4c-1.1-1-2.5-1.6-3.7-2.4c1.4-1.8,4.4-2,6.2-0.3C83.7,37.5,83.9,40.4,82.4,42z"
	/>
</svg>
