<?xml version="1.0" encoding="utf-8"?>
<!-- Generator: Adobe Illustrator 24.0.0, SVG Export Plug-In . SVG Version: 6.00 Build 0)  -->
<svg version="1.1" id="Слой_1" xmlns="http://www.w3.org/2000/svg" xmlns:xlink="http://www.w3.org/1999/xlink" x="0px" y="0px"
	 viewBox="0 0 100 100" style="enable-background:new 0 0 100 100;" xml:space="preserve">
<style type="text/css">
	.st0{fill:#62A3D9;stroke:#000000;stroke-width:4.715;stroke-miterlimit:10;}
	.st1{fill:#FFFFFF;stroke:#000000;stroke-width:4.7153;stroke-miterlimit:10;}
	.st2{fill:#FFFFFF;}
	.st3{fill:#FFFFFF;stroke:#000000;stroke-width:4.715;stroke-miterlimit:10;}
</style>
<path d="M46.6,85.1c-20.2,0-36.7-16.4-36.7-36.7c0-20.2,16.4-36.7,36.7-36.7s36.7,16.4,36.7,36.7C83.3,68.6,66.8,85.1,46.6,85.1z
	 M46.6,16.5c-17.6,0-31.9,14.3-31.9,31.9C14.7,66,29,80.3,46.6,80.3S78.5,66,78.5,48.4S64.2,16.5,46.6,16.5z"/>
<circle class="st0" cx="47.8" cy="48" r="34.3"/>
<image style="overflow:visible;enable-background:new    ;" width="243" height="292" xlink:href="A697232E.jpg"  transform="matrix(0.998 0 0 0.998 -7893.7544 -7770.3149)">
</image>
<circle class="st1" cx="80.9" cy="46.8" r="8.1"/>
<circle class="st1" cx="29.5" cy="79" r="8.1"/>
<g>
	<path d="M54.1,62.2c1.7,0,3.3,0,5.1,0c0-0.6,0-1.2,0-1.8c0-7.4,0-14.8,0-22.2c0-4.4,2.3-6.8,6.8-6.8c3.8,0,7.6,0,11.3,0
		c4.9,0,8.1,2.2,9.7,6.9c1.7,4.7,4.1,9.3,4.9,14.2c0.9,4.8,0.2,9.8,0.2,14.7c0,3.6,0,7.2,0,10.8c0,4.1-2.4,6.6-6.5,6.6
		c-1.7,0-2.6,0.4-3.4,2c-1.7,3.3-4.7,5-8.4,4.9c-3.8-0.1-6.6-1.9-8.2-5.3c-0.6-1.3-1.3-1.6-2.6-1.6c-5.5,0.1-11,0-16.5,0.1
		c-0.6,0-1.5,0.3-1.8,0.8c-3.6,6.7-9.7,7.9-15.3,3.5c-2.2,0.9-4.1,2-6.2,2.3c-4.1,0.7-7.9-1.5-9.6-5.3c-0.5-1-1-1.4-2.1-1.4
		c-5.3,0-7.4-2.1-7.4-7.4c0-15.2,0-30.5,0-45.7c0-4.8,2.3-7,7.1-7c11.9,0,23.8,0,35.7,0c4.8,0,7,2.3,7,7.1c0,9.6,0,19.1,0,28.7
		C54.1,60.8,54.1,61.5,54.1,62.2z M9.4,62.1c13.3,0,26.3,0,39.3,0c0.1-0.2,0.1-0.3,0.1-0.5c0-10.2,0-20.4,0-30.5
		c0-1.3-0.7-1.5-1.7-1.5c-12,0-24,0-36,0c-1.3,0-1.8,0.5-1.8,1.8c0.1,5.3,0,10.6,0,16C9.4,52.3,9.4,57.1,9.4,62.1z M64.4,79.3
		c0.1,0,0.3,0,0.4,0.1c0.2-0.3,0.4-0.6,0.6-0.9c1.7-3.7,4.6-5.8,8.7-5.8c4.1,0,7.1,2,8.7,5.8c0.8,1.8,2.1,0.9,3.2,1
		c1.2,0,1-1.1,1-1.8c0-6.9,0-13.7,0-20.6c0-0.5-0.1-1-0.1-1.5c-4.6,0-9,0-13.4,0c-2.9,0-3.7-0.8-3.7-3.6c0-4.5,0-8.9,0-13.4
		c0-0.6,0-1.2-0.1-1.9c-1.2,0-2.3,0.1-3.3,0c-1.6-0.2-2.2,0.4-2.2,2.1c0.1,13,0,26.1,0,39.1C64.4,78.3,64.4,78.8,64.4,79.3z
		 M59.1,67.6c-16.6,0-33.1,0-49.7,0c0,3.3-0.1,6.5,0,9.7c0,0.7,0.5,2,0.9,2c1.2,0.1,2.6,0.8,3.4-1.1c1.8-4.2,6-6.3,10.4-5.3
		c1.8,0.4,3.5,1.5,5.3,2.4c5.7-4.5,11.8-3.3,15.4,3.4c0.2,0.4,1,0.8,1.5,0.8c2.6,0.1,5.1,0,7.7,0c1.7,0,3.4,0,5.1,0
		C59.1,75.4,59.1,71.5,59.1,67.6z M85.9,50.2c-1.2-3.4-2.3-6.5-3.4-9.5c-1.4-3.7-3.2-4.7-7.3-3.9c0,4.5,0,8.9,0,13.4
		C78.7,50.2,82.1,50.2,85.9,50.2z M26.6,82c0-2.3-1.9-4.2-4.3-4.2c-2.3,0-4.3,1.9-4.3,4.2c0,2.4,1.9,4.4,4.4,4.3
		C24.7,86.3,26.6,84.3,26.6,82z M36,86.3c2.3,0,4.3-1.9,4.3-4.2c0-2.3-1.8-4.3-4.2-4.3c-2.4,0-4.4,1.9-4.4,4.3
		C31.8,84.4,33.7,86.3,36,86.3z M74.2,77.8c-2.3,0-4.3,1.8-4.3,4.2c-0.1,2.3,1.8,4.3,4.1,4.4c2.4,0.1,4.4-1.8,4.4-4.2
		C78.4,79.7,76.6,77.8,74.2,77.8z"/>
	<path class="st2" d="M9.4,62.1c0-5,0-9.9,0-14.7c0-5.3,0-10.6,0-16c0-1.3,0.4-1.8,1.8-1.8c12,0,24,0,36,0c1,0,1.7,0.2,1.7,1.5
		c0,10.2,0,20.4,0,30.5c0,0.1-0.1,0.2-0.1,0.5C35.7,62.1,22.7,62.1,9.4,62.1z M15.4,46c0,2.7,0,5.4,0,8.1c0,1.9,1,3,2.5,3.1
		c1.6,0,2.6-1.1,2.7-3.1c0-5.4,0-10.7,0-16.1c0-1.9-0.9-3-2.5-3.1c-1.6,0-2.6,1.1-2.7,3.1C15.4,40.6,15.4,43.3,15.4,46z M37.7,45.7
		c0,2.8,0,5.6,0,8.4c0,1.9,1,3,2.6,3c1.6,0,2.6-1.1,2.6-3c0-5.4,0-10.9,0-16.3c0-1.9-1-3-2.6-3c-1.6,0-2.5,1.1-2.6,3
		C37.7,40.5,37.7,43.1,37.7,45.7z M31.7,46.1c0-2.7,0-5.5,0-8.2c0-1.9-1-3-2.5-3.1c-1.6,0-2.6,1.1-2.6,3.1c0,5.4,0,10.7,0,16.1
		c0,1.9,1,3,2.5,3.1c1.6,0,2.6-1.1,2.6-3.1C31.7,51.4,31.7,48.7,31.7,46.1z"/>
	<path class="st2" d="M64.4,79.3c0-0.5,0-1.1,0-1.6c0-13,0-26.1,0-39.1c0-1.7,0.5-2.3,2.2-2.1c1,0.1,2.1,0,3.3,0
		c0,0.7,0.1,1.3,0.1,1.9c0,4.5,0,8.9,0,13.4c0,2.9,0.8,3.6,3.7,3.6c4.4,0,8.8,0,13.4,0C87,56,87,56.5,87,57c0,6.9,0,13.7,0,20.6
		c0,0.8,0.2,1.9-1,1.8c-1.1,0-2.5,0.8-3.2-1c-1.6-3.8-4.6-5.8-8.7-5.8c-4.1,0-7,2.1-8.7,5.8c-0.1,0.3-0.4,0.6-0.6,0.9
		C64.7,79.4,64.5,79.4,64.4,79.3z M75,60.6C75,60.6,75,60.6,75,60.6c-0.9,0-1.8-0.1-2.7,0c-1.4,0.2-2.3,1-2.3,2.5
		c0,1.4,0.8,2.4,2.3,2.5c1.9,0.1,3.8,0.1,5.6,0c1.4-0.1,2.3-1,2.3-2.5c0.1-1.4-0.9-2.4-2.4-2.6C76.8,60.5,75.9,60.6,75,60.6z"/>
	<path class="st2" d="M59.1,67.6c0,4,0,7.8,0,11.9c-1.7,0-3.4,0-5.1,0c-2.6,0-5.1,0-7.7,0c-0.5,0-1.2-0.4-1.5-0.8
		c-3.7-6.7-9.7-8-15.4-3.4c-1.8-0.8-3.5-1.9-5.3-2.4c-4.4-1-8.6,1.2-10.4,5.3c-0.8,1.9-2.2,1.3-3.4,1.1c-0.4,0-0.8-1.3-0.9-2
		c-0.1-3.2,0-6.4,0-9.7C26,67.6,42.5,67.6,59.1,67.6z"/>
	<path class="st2" d="M85.9,50.2c-3.8,0-7.2,0-10.7,0c0-4.5,0-8.9,0-13.4c4-0.9,5.9,0.1,7.3,3.9C83.6,43.7,84.7,46.8,85.9,50.2z"/>
	<path class="st2" d="M26.6,82c0,2.3-1.9,4.3-4.2,4.3c-2.4,0-4.4-1.9-4.4-4.3c0-2.3,1.9-4.2,4.3-4.2C24.6,77.8,26.6,79.7,26.6,82z"
		/>
	<path class="st2" d="M36,86.3c-2.3,0-4.3-1.9-4.3-4.2c0-2.4,2-4.3,4.4-4.3c2.4,0,4.2,2,4.2,4.3C40.3,84.4,38.4,86.3,36,86.3z"/>
	<path class="st2" d="M74.2,77.8c2.4,0,4.2,1.9,4.2,4.3c0,2.4-2,4.3-4.4,4.2c-2.4-0.1-4.2-2-4.1-4.4C69.9,79.6,71.9,77.7,74.2,77.8z
		"/>
	<path d="M15.4,46c0-2.7,0-5.4,0-8.1c0-2,1-3.1,2.7-3.1c1.5,0,2.5,1.1,2.5,3.1c0,5.4,0,10.7,0,16.1c0,2-1,3.1-2.7,3.1
		c-1.5,0-2.5-1.1-2.5-3.1C15.4,51.3,15.4,48.7,15.4,46z"/>
	<path d="M37.7,45.7c0-2.6,0-5.3,0-7.9c0-1.9,1-3,2.6-3c1.6,0,2.6,1.1,2.6,3c0,5.4,0,10.9,0,16.3c0,1.9-1,3-2.6,3
		c-1.6,0-2.5-1.1-2.6-3C37.7,51.3,37.7,48.5,37.7,45.7z"/>
	<path d="M31.7,46.1c0,2.6,0,5.3,0,7.9c0,2-1,3.1-2.6,3.1c-1.5,0-2.5-1.2-2.5-3.1c0-5.4,0-10.7,0-16.1c0-2,1-3.1,2.6-3.1
		c1.5,0,2.5,1.2,2.5,3.1C31.7,40.6,31.7,43.4,31.7,46.1z"/>
	<path d="M75,60.6c0.9,0,1.8-0.1,2.7,0c1.5,0.1,2.5,1.2,2.4,2.6c-0.1,1.4-0.9,2.4-2.3,2.5c-1.9,0.1-3.8,0.1-5.6,0
		c-1.4-0.1-2.3-1.1-2.3-2.5c0-1.4,0.9-2.3,2.3-2.5C73.1,60.5,74,60.6,75,60.6C75,60.6,75,60.6,75,60.6z"/>
</g>
<circle class="st3" cx="20" cy="26.7" r="8.1"/>
</svg>
