<?xml version="1.0" encoding="utf-8"?>
<!-- Generator: Adobe Illustrator 24.0.0, SVG Export Plug-In . SVG Version: 6.00 Build 0)  -->
<svg version="1.1" id="Слой_1" xmlns="http://www.w3.org/2000/svg" xmlns:xlink="http://www.w3.org/1999/xlink" x="0px" y="0px"
	 viewBox="0 0 100 100" style="enable-background:new 0 0 100 100;" xml:space="preserve">
<style type="text/css">
	.st0{fill:#62A3D9;}
	.st1{fill:#FFFFFF;}
	.st2{fill:#FFFFFF;stroke:#000000;stroke-width:4.7153;stroke-miterlimit:10;}
</style>
<g>
	<path d="M47.1,82.3c-19.6,0-35.6-16-35.5-35.5c0-19.5,16-35.4,35.5-35.5c19.6,0,35.6,16,35.5,35.5C82.6,66.3,66.6,82.3,47.1,82.3z
		 M22.8,66.5c4.5-4.5,8.9-8.9,13.3-13.4c0.4-0.4,0.5-1.1,0.6-1.6c0-4.6,0-9.2,0-13.9c0-0.4-0.1-0.8-0.1-1.2c-0.3,0-0.5-0.1-0.8-0.1
		c-5.8,0-11.6,0-17.3,0c-0.9,0-1.1,0.5-1.4,1.2C15.8,42,15.4,46.5,16,51C16.8,56.8,19.1,61.9,22.8,66.5z M57.7,36.4
		c-0.1,0.3-0.2,0.5-0.2,0.6c0,5,0,10,0,15c0,0.5,0.3,1,0.7,1.4c1.6,1.6,3.2,3.2,4.8,4.8c2.8,2.8,5.5,5.5,8.3,8.3
		c0.2-0.2,0.3-0.2,0.4-0.3c6.6-8.7,8.3-18.3,5.3-28.8c-0.2-0.8-0.6-1-1.4-1c-2.6,0-5.2,0-7.8,0C64.5,36.4,61.1,36.4,57.7,36.4z
		 M49.2,57.4c0,6.9,0,13.8,0,20.7c0.9-0.1,1.6-0.2,2.4-0.2c1.3,0,1.8-0.6,1.8-2c-0.1-12.5,0-25,0-37.5c0-0.6,0-1.2,0-1.7
		c-4.3,0-8.3,0-12.5,0c0,0.7,0,1.3,0,1.9c0,11.9,0,23.8,0,35.7c0,3.7,0,3.7,3.7,3.8c0.1,0,0.2-0.1,0.5-0.2c0-6.8,0-13.6,0-20.5
		C46.5,57.4,47.7,57.4,49.2,57.4z M49.2,32.1c3.3,0.5,6.2,0.4,8.2-2.6c0.7-1.1,1.8-1.9,2.7-2.8c1.8-1.7,3.5-3.5,5.3-5.3
		c-10.9-8.2-26.6-7.7-36.5,0c3.1,3.1,6.2,6.1,9.2,9.2c1.6,1.5,4.7,2.1,6.9,1.3c-3.3-1.9-4.6-4.4-3.9-7.4c0.6-2.6,3-4.6,5.8-4.7
		c2.8-0.1,5.4,1.7,6.2,4.4C54,27.2,52.8,29.7,49.2,32.1z M19.5,32.1c4.8,0,9.3,0,13.9,0c-2.7-2.6-5.3-5.2-7.9-7.9
		C23.1,26.4,21.1,29,19.5,32.1z M60.7,32.1c4.7,0,9.2,0,13.8,0c-0.5-2-4-6.6-5.9-7.9C66,26.8,63.5,29.4,60.7,32.1z M36.7,59
		c-3.7,3.6-7.3,7.2-10.9,10.8c1,0.8,2,1.6,3.1,2.5c2.5-2.5,4.9-4.9,7.3-7.4c0.2-0.2,0.4-0.5,0.4-0.8C36.7,62.4,36.7,60.7,36.7,59z
		 M65.4,72.3c1.1-0.9,2.1-1.7,2.9-2.4c-3.6-3.6-7.1-7.2-10.8-10.9c0,1.7,0,3.5,0,5.2c0,0.2,0.2,0.4,0.3,0.6
		C60.3,67.2,62.8,69.7,65.4,72.3z M49.1,26.1c0.1-1.1-0.7-2.1-1.9-2.1c-1.2-0.1-2.2,0.8-2.2,1.9C45,27,45.8,27.9,46.9,28
		C48.1,28.1,49.1,27.3,49.1,26.1z M36.5,76.3c0-2,0-3.8,0-5.2c-1.2,1.1-2.5,2.2-3.9,3.5C33.9,75.2,35.1,75.7,36.5,76.3z M61.2,74.8
		c-1.3-1.3-2.5-2.6-3.6-3.6c0,1.5,0,3.2,0,5.2C59,75.7,60.3,75.2,61.2,74.8z"/>
	<path d="M15.8,23.9c-1.4,0-2.7,0-4.1,0c0-4.2,0-8.3,0-12.5c4.1,0,8.3,0,12.4,0c0,1.4,0,2.7,0,4.1c-2.8,0-5.5,0-8.4,0
		C15.8,18.3,15.8,21,15.8,23.9z"/>
	<path d="M82.5,23.9c-1.3,0-2.6,0-4,0c0-2.8,0-5.5,0-8.3c-2.8,0-5.6,0-8.4,0c0-1.5,0-2.8,0-4.2c4.1,0,8.2,0,12.4,0
		C82.5,15.5,82.5,19.6,82.5,23.9z"/>
	<path d="M11.6,82.2c0-4.2,0-8.2,0-12.4c1.3,0,2.6,0,4,0c0,2.7,0,5.4,0,8.2c2.9,0,5.6,0,8.4,0c0,1.5,0,2.8,0,4.2
		C20,82.2,15.9,82.2,11.6,82.2z"/>
	<path d="M78.4,69.9c1.5,0,2.8,0,4.1,0c0,4.1,0,8.2,0,12.3c-4.1,0-8.2,0-12.5,0c0-1.3,0-2.6,0-4c2.8,0,5.5,0,8.3,0
		C78.4,75.4,78.4,72.7,78.4,69.9z"/>
	<path class="st0" d="M22.8,66.5c-3.7-4.6-6-9.8-6.8-15.5c-0.6-4.6-0.2-9,1.1-13.4c0.2-0.7,0.4-1.2,1.4-1.2c5.8,0,11.6,0,17.3,0
		c0.2,0,0.4,0.1,0.8,0.1c0,0.4,0.1,0.8,0.1,1.2c0,4.6,0,9.2,0,13.9c0,0.5-0.2,1.2-0.6,1.6C31.7,57.6,27.3,62,22.8,66.5z"/>
	<path class="st0" d="M57.7,36.4c3.4,0,6.8,0,10.2,0c2.6,0,5.2,0,7.8,0c0.8,0,1.2,0.2,1.4,1c3,10.5,1.3,20.1-5.3,28.8
		c-0.1,0.1-0.2,0.2-0.4,0.3c-2.8-2.8-5.5-5.5-8.3-8.3c-1.6-1.6-3.2-3.2-4.8-4.8c-0.3-0.4-0.7-0.9-0.7-1.4c0-5,0-10,0-15
		C57.5,36.9,57.6,36.7,57.7,36.4z"/>
	<path class="st1" d="M49.2,57.4c-1.5,0-2.7,0-4.2,0c0,6.9,0,13.7,0,20.5C44.7,78,44.7,78,44.6,78c-3.7-0.2-3.7-0.2-3.7-3.8
		c0-11.9,0-23.8,0-35.7c0-0.6,0-1.2,0-1.9c4.2,0,8.2,0,12.5,0c0,0.6,0,1.2,0,1.7c0,12.5,0,25,0,37.5c0,1.4-0.4,2-1.8,2
		c-0.7,0-1.5,0.1-2.4,0.2C49.2,71.1,49.2,64.3,49.2,57.4z"/>
	<path class="st0" d="M49.2,32.1c3.6-2.4,4.8-4.9,3.9-7.9c-0.8-2.7-3.4-4.5-6.2-4.4c-2.8,0.1-5.2,2.1-5.8,4.7
		c-0.7,3.1,0.6,5.6,3.9,7.4c-2.1,0.9-5.3,0.3-6.9-1.3c-3.1-3.1-6.1-6.1-9.2-9.2c9.9-7.7,25.6-8.2,36.5,0c-1.8,1.8-3.5,3.5-5.3,5.3
		c-0.9,0.9-2,1.7-2.7,2.8C55.3,32.5,52.4,32.6,49.2,32.1z"/>
	<path class="st0" d="M19.5,32.1c1.6-3.1,3.6-5.7,5.9-7.9c2.7,2.6,5.3,5.2,7.9,7.9C28.8,32.1,24.2,32.1,19.5,32.1z"/>
	<path class="st0" d="M60.7,32.1c2.7-2.7,5.3-5.3,7.9-7.9c1.9,1.2,5.4,5.9,5.9,7.9C70,32.1,65.4,32.1,60.7,32.1z"/>
	<path class="st1" d="M36.7,59c0,1.7,0,3.4,0,5.1c0,0.3-0.2,0.6-0.4,0.8c-2.4,2.4-4.8,4.9-7.3,7.4c-1.1-0.9-2.1-1.7-3.1-2.5
		C29.4,66.2,33,62.7,36.7,59z"/>
	<path class="st1" d="M65.4,72.3c-2.6-2.6-5.1-5-7.5-7.5c-0.2-0.2-0.3-0.4-0.3-0.6c0-1.7,0-3.5,0-5.2c3.6,3.7,7.2,7.2,10.8,10.9
		C67.5,70.6,66.4,71.4,65.4,72.3z"/>
	<path class="st1" d="M49.1,26.1c-0.1,1.2-1,2-2.2,1.9c-1.1-0.1-1.9-1-1.9-2.1c0.1-1.2,1.1-2,2.2-1.9C48.4,24.1,49.2,25,49.1,26.1z"
		/>
	<path class="st0" d="M36.5,76.3c-1.4-0.6-2.6-1.1-3.9-1.7c1.4-1.3,2.7-2.4,3.9-3.5C36.5,72.5,36.5,74.3,36.5,76.3z"/>
	<path class="st0" d="M61.2,74.8c-1,0.4-2.2,1-3.6,1.6c0-2,0-3.8,0-5.2C58.7,72.2,59.9,73.4,61.2,74.8z"/>
</g>
<circle class="st2" cx="80.9" cy="46.8" r="8.1"/>
</svg>
