<?xml version="1.0" encoding="utf-8"?>
<!-- Generator: Adobe Illustrator 24.0.0, SVG Export Plug-In . SVG Version: 6.00 Build 0)  -->
<svg version="1.1" id="Слой_1" xmlns="http://www.w3.org/2000/svg" xmlns:xlink="http://www.w3.org/1999/xlink" x="0px" y="0px"
	 viewBox="0 0 100 100" style="enable-background:new 0 0 100 100;" xml:space="preserve">
<style type="text/css">
	.st0{fill:#62A3D9;stroke:#000000;stroke-width:4.715;stroke-miterlimit:10;}
	.st1{fill:none;stroke:#000000;stroke-width:4.715;stroke-linecap:round;stroke-linejoin:round;stroke-miterlimit:10;}
	.st2{fill:#FFFFFF;stroke:#000000;stroke-width:4.715;stroke-miterlimit:10;}
	.st3{fill:#FFFFFF;stroke:#000000;stroke-width:4.7153;stroke-miterlimit:10;}
	.st4{fill:none;stroke:#000000;stroke-width:4.715;stroke-linecap:round;stroke-linejoin:round;}
	.st5{fill:none;stroke:#000000;stroke-width:4.715;stroke-linecap:round;stroke-linejoin:round;stroke-dasharray:3.6284,8.164;}
	.st6{fill:#FFFFFF;stroke:#000000;stroke-width:4.715;stroke-linecap:round;stroke-linejoin:round;stroke-miterlimit:10;}
</style>
<circle class="st0" cx="46.6" cy="54" r="34.3"/>
<path class="st1" d="M22.2,28.4l20.7,17.2c4.8,3.9,5.3,11,1.2,15.7L30.4,79"/>
<circle class="st2" cx="21.4" cy="28.4" r="8.1"/>
<circle class="st3" cx="29.5" cy="79" r="8.1"/>
<g>
	<g>
		<line class="st4" x1="80.9" y1="46.8" x2="79" y2="47.5"/>
		<path class="st5" d="M71.4,50.4l-1.1,0.4c-4.5,2.1-8.6,6.4-12.8,11.6L43,82.2"/>
		<line class="st4" x1="40.6" y1="85.5" x2="39.4" y2="87.1"/>
	</g>
</g>
<circle class="st6" cx="80.9" cy="46.8" r="8.1"/>
</svg>
