<?xml version="1.0" encoding="utf-8"?>
<!-- Generator: Adobe Illustrator 24.0.0, SVG Export Plug-In . SVG Version: 6.00 Build 0)  -->
<svg version="1.1" id="Слой_1" xmlns="http://www.w3.org/2000/svg" xmlns:xlink="http://www.w3.org/1999/xlink" x="0px" y="0px"
	 viewBox="0 0 100 100" style="enable-background:new 0 0 100 100;" xml:space="preserve">
<style type="text/css">
	.st0{fill:#62A3D9;stroke:#000000;stroke-width:4.715;stroke-miterlimit:10;}
	.st1{fill:#FFFFFF;stroke:#000000;stroke-width:4.7153;stroke-miterlimit:10;}
	.st2{fill:#FFFFFF;stroke:#000000;stroke-width:4.715;stroke-miterlimit:10;}
	.st3{fill:#98C6E5;}
	.st4{fill:#FFFFFF;}
</style>
<circle class="st0" cx="46.6" cy="48.4" r="34.3"/>
<path d="M46.6,85.1c-20.2,0-36.7-16.4-36.7-36.7c0-20.2,16.4-36.7,36.7-36.7s36.7,16.4,36.7,36.7C83.3,68.6,66.8,85.1,46.6,85.1z
	 M46.6,16.5c-17.6,0-31.9,14.3-31.9,31.9C14.7,66,29,80.3,46.6,80.3S78.5,66,78.5,48.4S64.2,16.5,46.6,16.5z"/>
<circle class="st1" cx="80.9" cy="46.8" r="8.1"/>
<circle class="st2" cx="20" cy="26.7" r="8.1"/>
<g>
	<path d="M-365.7,24.2c2.9,0,5.6,0,8.4,0c0,2.9,0,5.8,0,8.8c1.1-0.1,2-0.2,3-0.4c0.1,0,0.3-0.4,0.3-0.6c0-1,0-2.1,0-3.1
		c0-0.4,0.3-0.8,0.5-1c2-1.4,4.6-1.4,6.5,0c0.3,0.2,0.5,0.6,0.5,1c0.1,1.1,0,2.1,0,3.2c0,0.2,0.2,0.5,0.4,0.6
		c0.9,0.2,1.9,0.2,2.9,0.4c0-2.9,0-5.8,0-8.8c2.8,0,5.6,0,8.5,0c0,0.3,0,0.6,0,0.9c0,8.2,0,16.4,0,24.6c0,0.5,0.1,0.9,0.5,1.3
		c1.4,1.3,2.7,2.7,4,4c0.2,0.2,0.4,0.5,0.4,0.8c0,3.1,0,6.2,0,9.4c-13.7,0-27.3,0-41.1,0c0-0.2,0-0.4,0-0.7c0-2.8,0-5.6,0-8.4
		c0-0.4,0.2-0.8,0.5-1.1c1.2-1.3,2.5-2.6,3.8-3.8c0.5-0.5,0.7-1,0.7-1.7c0-8.1,0-16.2,0-24.2C-365.7,24.9-365.7,24.6-365.7,24.2z
		 M-337,37.1c-0.1-0.1-0.1-0.1-0.2-0.1c-8.5-2.8-17.1-2.8-25.7-0.1c-0.2,0.1-0.4,0.4-0.4,0.7c0,2.1,0,4.2,0,6.3
		c0,2.4,1.6,4.5,3.9,4.8c1.7,0.3,3.4,0.1,5.2,0.1c0-1.4,0-2.7,0-4.2c2.7,0,5.2,0,7.9,0c0,1.4,0,2.8,0,4.3c1.5,0,2.8,0,4.1,0
		c2.7,0,4.9-2.1,5-4.8C-336.9,41.8-337,39.4-337,37.1z M-363.2,62.8c8.8,0,17.5,0,26.2,0c0-4.5,0-8.9,0-13.5c-2.7,2.6-6,1.8-9.1,2
		c0,1.8,0,3.5,0,5.2c0,0.3,0,0.7-0.2,0.8c-1.2,1.3-2.5,2.5-3.8,3.8c-0.9-1-1.8-1.9-2.7-2.7c-1-0.8-1.3-1.7-1.2-3
		c0.1-1.4,0-2.8,0-4.2c-3.2-0.1-6.5,0.6-9.2-2C-363.2,54-363.2,58.3-363.2,62.8z M-363.2,34.5c1.1-0.3,2.2-0.6,3.3-0.9
		c0.1,0,0.3-0.3,0.3-0.4c0-2.2,0-4.4,0-6.6c-1.2,0-2.4,0-3.6,0C-363.2,29.2-363.2,31.8-363.2,34.5z M-340.6,26.6c0,2.2,0,4.4,0,6.5
		c0,0.2,0.2,0.4,0.3,0.5c1.1,0.3,2.1,0.6,3.3,0.9c0-2.7,0-5.2,0-7.9C-338.2,26.6-339.3,26.6-340.6,26.6z M-365.7,54
		c-0.2,0.2-0.3,0.3-0.5,0.4c-1.7,1.2-2.4,2.8-2.1,4.9c0.2,1.1,0,2.3,0,3.5c0.9,0,1.7,0,2.5,0C-365.7,59.9-365.7,57-365.7,54z
		 M-332,62.8c0-2.1,0-4.1,0-6.1c0-0.1-0.1-0.3-0.2-0.4c-0.7-0.8-1.5-1.6-2.4-2.5c0,3.2,0,6.1,0,9C-333.7,62.8-332.9,62.8-332,62.8z
		 M-351.7,51.4c0,1.2,0.1,2.4,0,3.6c-0.2,1.4,0.8,2,1.6,2.7c1.3-0.8,1.8-1.8,1.6-3.3c-0.1-1,0-2.1,0-3.1
		C-349.7,51.4-350.6,51.4-351.7,51.4z M-351.5,32.3c1,0,1.8,0,2.7,0c0-0.6,0-1.1,0-1.6c0-1.2-0.2-1.5-1.5-1.4c-0.3,0-0.6,0-0.9,0.2
		c-0.2,0.1-0.4,0.3-0.4,0.5C-351.5,30.7-351.5,31.5-351.5,32.3z M-348.6,47.1c-1.1,0-2,0-3,0c0,0.6,0,1.2,0,1.8c1,0,2,0,3,0
		C-348.6,48.2-348.6,47.7-348.6,47.1z"/>
	<path class="st3" d="M-337,37.1c0,2.4,0.1,4.7,0,7.1c-0.1,2.7-2.3,4.7-5,4.8c-1.3,0-2.7,0-4.1,0c0-1.4,0-2.8,0-4.3
		c-2.7,0-5.3,0-7.9,0c0,1.4,0,2.8,0,4.2c-1.8,0-3.6,0.2-5.2-0.1c-2.3-0.4-3.9-2.5-3.9-4.8c0-2.1,0-4.2,0-6.3c0-0.2,0.2-0.6,0.4-0.7
		c8.6-2.7,17.1-2.7,25.7,0.1C-337.1,37-337.1,37-337,37.1z M-346.3,38.2c-2.6,0-5.1,0-7.6,0c0,0.8,0,1.6,0,2.3c2.6,0,5.1,0,7.6,0
		C-346.3,39.7-346.3,39-346.3,38.2z"/>
	<path class="st3" d="M-363.2,62.8c0-4.5,0-8.9,0-13.5c2.7,2.6,5.9,1.9,9.2,2c0,1.4,0.1,2.8,0,4.2c-0.1,1.3,0.3,2.2,1.2,3
		c1,0.8,1.8,1.8,2.7,2.7c1.3-1.3,2.6-2.6,3.8-3.8c0.2-0.2,0.2-0.5,0.2-0.8c0-1.7,0-3.4,0-5.2c3.1-0.2,6.4,0.6,9.1-2
		c0,4.6,0,9,0,13.5C-345.8,62.8-354.5,62.8-363.2,62.8z"/>
	<path class="st4" d="M-363.2,34.5c0-2.7,0-5.2,0-7.9c1.2,0,2.4,0,3.6,0c0,2.2,0,4.4,0,6.6c0,0.1-0.2,0.4-0.3,0.4
		C-361,33.9-362.1,34.2-363.2,34.5z"/>
	<path class="st4" d="M-340.6,26.6c1.3,0,2.4,0,3.6,0c0,2.6,0,5.2,0,7.9c-1.1-0.3-2.2-0.6-3.3-0.9c-0.1,0-0.3-0.3-0.3-0.5
		C-340.6,31-340.6,28.8-340.6,26.6z"/>
	<path class="st4" d="M-365.7,54c0,3,0,5.9,0,8.8c-0.8,0-1.6,0-2.5,0c0-1.1,0.1-2.3,0-3.5c-0.3-2.1,0.4-3.7,2.1-4.9
		C-366.1,54.3-365.9,54.2-365.7,54z"/>
	<path class="st4" d="M-332,62.8c-0.9,0-1.7,0-2.5,0c0-2.9,0-5.8,0-9c0.9,0.9,1.6,1.7,2.4,2.5c0.1,0.1,0.2,0.3,0.2,0.4
		C-332,58.8-332,60.8-332,62.8z"/>
	<path class="st4" d="M-351.7,51.4c1.1,0,2,0,3.1,0c0,1-0.1,2.1,0,3.1c0.2,1.4-0.3,2.5-1.6,3.3c-0.8-0.7-1.7-1.3-1.6-2.7
		C-351.6,53.8-351.7,52.6-351.7,51.4z"/>
	<path class="st4" d="M-351.5,32.3c0-0.8,0-1.6,0-2.4c0-0.2,0.2-0.4,0.4-0.5c0.3-0.1,0.6-0.1,0.9-0.2c1.2-0.1,1.5,0.2,1.5,1.4
		c0,0.5,0,1.1,0,1.6C-349.7,32.3-350.5,32.3-351.5,32.3z"/>
	<path class="st4" d="M-348.6,47.1c0,0.6,0,1.1,0,1.8c-1,0-2,0-3,0c0-0.6,0-1.1,0-1.8C-350.6,47.1-349.7,47.1-348.6,47.1z"/>
	<path d="M-346.3,38.2c0,0.8,0,1.5,0,2.3c-2.5,0-5.1,0-7.6,0c0-0.8,0-1.5,0-2.3C-351.4,38.2-348.9,38.2-346.3,38.2z"/>
</g>
<g>
	<path d="M-294,46.6c0.8,0.1,1.4,0.1,1.9,0.4c1.6,0.6,2.4,1.8,2.5,3.4c0.1,2.6,0.1,5.2,0,7.8c-0.1,2.2-1.6,3.7-3.9,3.7
		c-0.7,0-1.2,0.1-1.7,0.8c-1,1.4-2.5,2.1-4.2,2.1c-4.8,0-9.5,0-14.3,0c-1.8,0-3.3-0.8-4.3-2.2c-0.4-0.5-0.8-0.7-1.4-0.6
		c-1.2,0.1-2.2-0.3-3.1-1.1c-0.7-0.7-1-1.7-1-2.7c0-2.5,0-4.9,0-7.4c0-2.3,1.5-3.8,3.9-3.9c0.1,0,0.2,0,0.5,0c0-2.8,0-5.7,0-8.6
		c-0.9,0-2,0-3.1,0c0-3.4,0-6.8,0-10.2c10.4,0,20.7,0,31.1,0c0,3.4,0,6.7,0,10.1c-1.1,0-2.1,0-3.1,0C-294,41-294,43.8-294,46.6z
		 M-296.1,50c0-0.3,0-0.5,0-0.7c0-3.1,0-6.1,0-9.2c0-2.3-1.3-3.6-3.5-3.6c-4.5,0-9.1,0-13.6,0c-2.3,0-3.5,1.3-3.6,3.6
		c0,3.1,0,6.1,0,9.2c0,0.2,0,0.5,0,0.7c1,0,2,0,3.1,0c0-1.4,0-2.8,0-4.2c0.8,0,1.4,0,2.2,0c0,1.4,0,2.8,0,4.2c3.4,0,6.7,0,10.1,0
		c0-1.4,0-2.8,0-4.2c0.8,0,1.4,0,2.2,0c0,1.4,0,2.8,0,4.3C-298.1,50-297.2,50-296.1,50z M-311.5,52.2c0,3.5,0,6.9,0,10.3
		c3.4,0,6.7,0,10,0c0-3.4,0-6.8,0-10.3C-304.8,52.2-308.1,52.2-311.5,52.2z M-301,30.1c-3.7,0-7.2,0-10.8,0c0,1.4,0,2.8,0,4.1
		c3.6,0,7.2,0,10.8,0C-301,32.8-301,31.5-301,30.1z M-314.1,30.1c-2,0-3.9,0-5.8,0c0,1.9,0,3.8,0,5.8c0.6,0,1.2,0,1.8,0
		c0.3,0,0.6,0,0.8-0.2c0.9-0.8,2-1.3,3.2-1.4C-314.1,32.9-314.1,31.5-314.1,30.1z M-293,30.1c-2,0-3.9,0-5.8,0c0,1.4,0,2.8,0,4.2
		c1.2,0.2,2.3,0.6,3.2,1.4c0.1,0.1,0.2,0.2,0.4,0.2c0.7,0,1.5,0,2.2,0C-293,33.9-293,32-293,30.1z M-316.8,52.2c0,2.5-0.1,5,0,7.5
		c0,1.6,1.6,2.9,3,2.8c0-3.4,0-6.8,0-10.2C-314.8,52.2-315.7,52.2-316.8,52.2z M-299.2,62.5c1.7-0.1,3.1-1.4,3.1-3.1
		c0-2.3,0-4.5,0-6.8c0-0.1,0-0.2-0.1-0.3c-1,0-2,0-3,0C-299.2,55.6-299.2,59-299.2,62.5z M-319,48.9c-1.5-0.1-2.2,0.4-2.2,1.8
		c0,2.4,0,4.7,0,7.1c0,1.4,0.8,2,2.2,1.7C-319,56-319,52.5-319,48.9z M-293.9,59.6c1.4,0.1,2.2-0.4,2.2-1.7c0-2.4,0-4.9,0-7.3
		c0-1.3-0.9-1.9-2.2-1.6C-293.9,52.5-293.9,56-293.9,59.6z"/>
	<path class="st4" d="M-296.1,50c-1.1,0-2.1,0-3.1,0c0-1.4,0-2.8,0-4.3c-0.7,0-1.4,0-2.2,0c0,1.4,0,2.8,0,4.2c-3.4,0-6.7,0-10.1,0
		c0-1.4,0-2.8,0-4.2c-0.8,0-1.4,0-2.2,0c0,1.4,0,2.8,0,4.2c-1.1,0-2.1,0-3.1,0c0-0.2,0-0.5,0-0.7c0-3.1,0-6.1,0-9.2
		c0-2.3,1.3-3.6,3.6-3.6c4.5,0,9.1,0,13.6,0c2.2,0,3.5,1.3,3.5,3.6c0,3.1,0,6.1,0,9.2C-296.1,49.5-296.1,49.7-296.1,50z
		 M-310.2,42.3c0,2.1,1.7,3.8,3.7,3.8c2.1,0,3.7-1.7,3.8-3.7c0-2.1-1.6-3.8-3.7-3.8C-308.5,38.6-310.2,40.3-310.2,42.3z"/>
	<path class="st3" d="M-311.5,52.2c3.4,0,6.7,0,10,0c0,3.4,0,6.8,0,10.3c-3.3,0-6.7,0-10,0C-311.5,59.1-311.5,55.7-311.5,52.2z"/>
	<path class="st3" d="M-301,30.1c0,1.4,0,2.7,0,4.1c-3.6,0-7.2,0-10.8,0c0-1.4,0-2.7,0-4.1C-308.3,30.1-304.7,30.1-301,30.1z"/>
	<path class="st3" d="M-314.1,30.1c0,1.4,0,2.8,0,4.2c-1.2,0.2-2.3,0.6-3.2,1.4c-0.2,0.2-0.5,0.2-0.8,0.2c-0.6,0-1.2,0-1.8,0
		c0-2,0-3.9,0-5.8C-317.9,30.1-316,30.1-314.1,30.1z"/>
	<path class="st3" d="M-293,30.1c0,1.9,0,3.8,0,5.8c-0.8,0-1.5,0-2.2,0c-0.1,0-0.3-0.1-0.4-0.2c-0.9-0.8-2-1.3-3.2-1.4
		c0-1.4,0-2.8,0-4.2C-296.9,30.1-295,30.1-293,30.1z"/>
	<path class="st3" d="M-316.8,52.2c1.1,0,2,0,3.1,0c0,3.4,0,6.8,0,10.2c-1.4,0.1-3-1.2-3-2.8C-316.8,57.2-316.8,54.7-316.8,52.2z"/>
	<path class="st3" d="M-299.2,62.5c0-3.4,0-6.8,0-10.3c1,0,2,0,3,0c0,0.1,0.1,0.2,0.1,0.3c0,2.3,0,4.5,0,6.8
		C-296.1,61.1-297.4,62.4-299.2,62.5z"/>
	<path class="st4" d="M-319,48.9c0,3.6,0,7.1,0,10.6c-1.4,0.3-2.2-0.4-2.2-1.7c0-2.4,0-4.7,0-7.1C-321.2,49.3-320.5,48.8-319,48.9z"
		/>
	<path class="st4" d="M-293.9,59.6c0-3.6,0-7.1,0-10.6c1.3-0.3,2.2,0.3,2.2,1.6c0,2.4,0,4.9,0,7.3
		C-291.7,59.2-292.4,59.7-293.9,59.6z"/>
	<path d="M-310.2,42.3c0-2.1,1.7-3.7,3.8-3.7c2.1,0,3.8,1.7,3.7,3.8c0,2.1-1.7,3.7-3.8,3.7C-308.5,46.1-310.2,44.4-310.2,42.3z
		 M-306.4,40.8c-0.9,0-1.6,0.7-1.6,1.6c0,0.9,0.7,1.7,1.6,1.6c0.9,0,1.6-0.7,1.6-1.6C-304.8,41.5-305.5,40.8-306.4,40.8z"/>
	<path class="st4" d="M-306.4,40.8c0.9,0,1.6,0.7,1.6,1.6c0,0.9-0.7,1.6-1.6,1.6c-0.9,0-1.6-0.7-1.6-1.6
		C-308,41.4-307.3,40.8-306.4,40.8z"/>
</g>
<circle class="st1" cx="29.5" cy="79" r="8.1"/>
<g>
	<path d="M9.9,39.9c3.6,0,6.9,0,10.2,0c0.8,0,1.7-0.2,2.3-0.7c3.2-2.7,6.8-3.9,10.9-3.3c1.3,0.2,3.1-0.3,4,0.3
		c0.9,0.6,1,2.4,1.4,3.6c0.9,2.7,1.8,5.4,2.7,8.1c0.2,0.5,0.6,1,1,1.3c3.9,2.9,7.9,5.7,11.8,8.5c0.6,0.4,1.3,0.6,1.9,0.8
		c3.5,0.9,7.1,1.8,10.6,2.7c5.6,1.5,9.4,6.3,9.4,12.1c0,2.3,0,4.5,0,6.8c0,0.8-0.3,1.3-0.9,1.7c-6.7,4.5-14.2,7-22.1,7.9
		c-2.4,0.3-4.8,0.3-7.2,0.5c-0.8,0.1-1.4-0.1-1.6-1c-0.8-2.7-2.7-3.9-5.4-4.4c-1.5-0.3-2.4-0.2-3.2,1.3C35,87.5,34.3,89.3,33,90
		c-1.3,0.7-3.2,0.3-4.8,0.3c-3.9,0-7.8,0-11.8,0c-5.1,0-8.5-3.4-8.5-8.6c0-0.4,0-0.8,0-1.2C7.5,74.6,8.2,68.8,9.6,63
		c0.2-0.8,0.2-1.7,0.2-2.5c0-6.3,0-12.6,0-18.8C9.9,41.1,9.9,40.6,9.9,39.9z M24,60c1.4,0,2.7,0.1,4,0c0.9-0.1,1.4,0.3,1.8,1
		c1.7,2.8,3.3,5.7,5.1,8.5c0.3,0.5,0.9,1,1.5,1.2c4.9,1.7,9.9,3.3,14.8,4.9c0.7,0.2,1.5,0.2,2.2,0.1c5.5-1.4,11-3,16.5-4.5
		c0.7-0.2,1.3-0.4,2.1-0.6c-1.1-3-3.1-4.8-6-5.6c-3.2-0.8-6.4-1.6-9.6-2.4c-0.4-0.1-1.1,0.2-1.4,0.5c-1.1,1.3-2,2.7-3.1,4.1
		c-1.1-0.8-2.2-1.6-3.2-2.4c1.1-1.4,2-2.7,3.1-4.2c-1.3-0.9-2.6-1.8-3.9-2.8c-1.4,1.8-2.7,3.6-4,5.3c-1.2-0.9-2.2-1.6-3.2-2.4
		c1.3-1.8,2.6-3.5,3.9-5.3c-1.3-1-2.6-1.8-3.9-2.8c-1.7,2.2-3.2,4.3-4.9,6.5c-1.1-0.9-2.1-1.6-3.2-2.4c1.2-1.6,2.3-3.1,3.5-4.7
		c-4.1,0-8,0-11.9,0C24,54.7,24,57.3,24,60z M72.3,74.8c-0.4,0.1-0.6,0.1-0.8,0.2c-6.1,1.7-12.2,3.3-18.3,4.9
		c-0.7,0.2-1.5,0.2-2.2-0.1c-4.3-1.4-8.7-2.7-12.9-4.3c-3-1.1-6.1-1.6-9.3-1.5c-1.6,0.1-3.1,0.2-4.4,1.1c-1.6,1.1-3.2,1.3-4.8,0
		c-1.1-0.8-2.1-0.8-3.3,0c-1.3,0.9-2.6,1.6-4.1,0.4c0,0-0.2,0-0.3,0.1c0,2.2-0.1,4.4,0,6.7c0.1,2.2,1.7,3.7,4,3.8c0-1.3,0-2.5,0-3.8
		c1.4,0,2.6,0,4,0c0,1.3,0,2.6,0,3.9c1.4,0,2.6,0,4,0c0-1.3,0-2.6,0-3.9c1.4,0,2.6,0,4,0c0,1.3,0,2.5,0,3.7c2.5,0.6,2.8,0.4,4-1.4
		c0.9-1.3,1.8-2.7,2.7-4c0.4-0.6,0.7-0.8,1.4-0.6c2.1,0.6,4.2,1.2,6.3,1.6c2.3,0.4,3.9,1.3,4.5,3.6c0.2,0.8,0.7,1,1.5,0.9
		c1.4-0.2,2.8-0.2,4.3-0.4c6.7-0.8,12.9-2.8,18.7-6.2c0.4-0.2,0.8-0.7,0.8-1.2C72.4,77.3,72.3,76.1,72.3,74.8z M37.2,47.9
		c-0.8-2.6-1.6-5-2.5-7.3c-0.1-0.3-0.7-0.6-1.1-0.6c-3.2-0.4-6.3,0.1-8.8,2.5c-0.3,0.2-0.6,0.4-0.9,0.6c-0.9,0.8-2,1-3.2,1
		c-2.3-0.1-4.5,0-6.8,0c0,1.4,0,2.7,0,4C21.7,47.9,29.4,47.9,37.2,47.9z M30.5,70.1c-1.2-2-2.2-3.7-3.3-5.4
		c-0.2-0.3-0.9-0.6-1.3-0.6c-2.9-0.1-5.9,0-8.8,0c-1.2,0-2.4,0-3.6,0c-0.5,2.4-0.9,4.7-1.4,6.9c1,0.6,1.8,1.2,2.8,0.4
		c2-1.6,4-1.5,6,0c0.4,0.3,1.3,0.3,1.8,0.1c1.9-1.2,3.9-1.6,6.1-1.4C29.3,70.1,29.7,70.1,30.5,70.1z M14,52.1c0,2.7,0,5.2,0,7.9
		c2,0,3.9,0,5.8,0c0-2.7,0-5.2,0-7.9C17.9,52.1,16,52.1,14,52.1z"/>
	<path class="st3" d="M24,60c0-2.8,0-5.3,0-8c3.9,0,7.8,0,11.9,0c-1.2,1.6-2.3,3.2-3.5,4.7c1.1,0.8,2,1.5,3.2,2.4
		c1.6-2.1,3.2-4.3,4.9-6.5c1.3,1,2.6,1.8,3.9,2.8c-1.3,1.8-2.6,3.5-3.9,5.3c1,0.8,2,1.5,3.2,2.4c1.3-1.8,2.7-3.5,4-5.3
		c1.4,1,2.6,1.9,3.9,2.8c-1.1,1.4-2.1,2.8-3.1,4.2c1.1,0.8,2.1,1.6,3.2,2.4c1.1-1.4,2-2.8,3.1-4.1c0.3-0.3,1-0.6,1.4-0.5
		c3.2,0.7,6.4,1.5,9.6,2.4c2.9,0.8,4.9,2.6,6,5.6c-0.7,0.2-1.4,0.4-2.1,0.6c-5.5,1.5-11,3-16.5,4.5c-0.7,0.2-1.5,0.1-2.2-0.1
		c-5-1.6-9.9-3.2-14.8-4.9c-0.6-0.2-1.1-0.7-1.5-1.2c-1.7-2.8-3.4-5.6-5.1-8.5c-0.4-0.7-0.9-1.1-1.8-1C26.7,60.1,25.4,60,24,60z"/>
	<path class="st4" d="M72.3,74.8c0,1.3,0.1,2.5,0,3.6c0,0.4-0.4,0.9-0.8,1.2c-5.8,3.4-12.1,5.4-18.7,6.2c-1.4,0.2-2.8,0.2-4.3,0.4
		c-0.8,0.1-1.3-0.1-1.5-0.9c-0.6-2.3-2.2-3.2-4.5-3.6c-2.1-0.3-4.2-1-6.3-1.6c-0.7-0.2-1,0-1.4,0.6c-0.9,1.4-1.8,2.7-2.7,4
		c-1.2,1.8-1.5,1.9-4,1.4c0-1.2,0-2.4,0-3.7c-1.4,0-2.6,0-4,0c0,1.3,0,2.5,0,3.9c-1.4,0-2.6,0-4,0c0-1.3,0-2.6,0-3.9
		c-1.4,0-2.6,0-4,0c0,1.3,0,2.6,0,3.8c-2.4-0.1-3.9-1.6-4-3.8c-0.1-2.2,0-4.4,0-6.7c0.1,0,0.3-0.1,0.3-0.1c1.5,1.1,2.8,0.4,4.1-0.4
		c1.1-0.8,2.2-0.8,3.3,0c1.6,1.3,3.2,1.1,4.8,0c1.3-0.9,2.8-1,4.4-1.1c3.2-0.1,6.2,0.4,9.3,1.5c4.2,1.6,8.6,2.9,12.9,4.3
		c0.7,0.2,1.5,0.2,2.2,0.1c6.1-1.6,12.2-3.3,18.3-4.9C71.7,74.9,71.9,74.9,72.3,74.8z"/>
	<path class="st4" d="M37.2,47.9c-7.9,0-15.5,0-23.2,0c0-1.3,0-2.5,0-4c2.3,0,4.6-0.1,6.8,0c1.2,0,2.3-0.2,3.2-1
		c0.3-0.2,0.6-0.4,0.9-0.6c2.5-2.4,5.5-2.8,8.8-2.5c0.4,0,1,0.3,1.1,0.6C35.6,42.9,36.4,45.3,37.2,47.9z"/>
	<path class="st4" d="M30.5,70.1c-0.7,0-1.2,0-1.6,0c-2.2-0.2-4.2,0.2-6.1,1.4c-0.4,0.3-1.3,0.2-1.8-0.1c-2.1-1.4-4-1.6-6,0
		c-1,0.8-1.8,0.2-2.8-0.4c0.4-2.2,0.9-4.4,1.4-6.9c1.2,0,2.4,0,3.6,0c2.9,0,5.9,0,8.8,0c0.4,0,1.1,0.2,1.3,0.6
		C28.3,66.4,29.3,68.1,30.5,70.1z"/>
	<path class="st4" d="M14,52.1c2,0,3.9,0,5.8,0c0,2.6,0,5.2,0,7.9c-1.9,0-3.8,0-5.8,0C14,57.3,14,54.8,14,52.1z"/>
</g>
</svg>
