<?xml version="1.0" encoding="utf-8"?>
<!-- Generator: Adobe Illustrator 24.0.0, SVG Export Plug-In . SVG Version: 6.00 Build 0)  -->
<svg version="1.1" id="Слой_1" xmlns="http://www.w3.org/2000/svg" xmlns:xlink="http://www.w3.org/1999/xlink" x="0px" y="0px"
	 viewBox="0 0 100 100" style="enable-background:new 0 0 100 100;" xml:space="preserve">
<style type="text/css">
	.st0{fill:#62A3D9;stroke:#000000;stroke-width:4.715;stroke-miterlimit:10;}
	.st1{fill:#FFFFFF;}
	.st2{fill:#FFFFFF;stroke:#000000;stroke-width:4.7153;stroke-miterlimit:10;}
	.st3{fill:#FFFFFF;stroke:#000000;stroke-width:4.715;stroke-miterlimit:10;}
</style>
<circle class="st0" cx="46.6" cy="48.4" r="34.3"/>
<g>
	<path class="st1" d="M57.9,85.1c0,2.1,0,3.9,0,5.8c0,1.3-1.7,2.9-2.9,2.9c-5.6,0-11.2,0-16.8,0c-1.2,0-2.9-1.7-2.9-2.9
		c0-1.9,0-3.8,0-5.8C42.8,85.1,50.2,85.1,57.9,85.1z"/>
</g>
<path d="M46.6,85.1c-20.2,0-36.7-16.4-36.7-36.7c0-20.2,16.4-36.7,36.7-36.7s36.7,16.4,36.7,36.7C83.3,68.6,66.8,85.1,46.6,85.1z
	 M46.6,16.5c-17.6,0-31.9,14.3-31.9,31.9C14.7,66,29,80.3,46.6,80.3S78.5,66,78.5,48.4S64.2,16.5,46.6,16.5z"/>
<circle class="st2" cx="80.9" cy="46.8" r="8.1"/>
<circle class="st3" cx="20" cy="26.7" r="8.1"/>
<circle class="st2" cx="29.5" cy="79" r="8.1"/>
<image style="overflow:visible;" width="243" height="291" xlink:href="BE5DD20A.jpg"  transform="matrix(1 0 0 1 -7894 -7770.1104)">
</image>
<g>
	<path d="M40.8,51.5c2,0,3.9,0,5.9,0c0,1.3,0,2.6,0,3.9c-1.2,0-2.4,0-3.8,0c0,4,0,7.9,0,11.8c-6.7,0-13.2,0-19.8,0
		c0-3.8,0-7.7,0-11.7c-1.4,0-2.6,0-4,0c0-1.4,0-2.6,0-3.9c1.9,0,3.8,0,5.9,0c0-1.7,0.1-3.2,0-4.7c0-0.4-0.5-0.8-0.8-1.1
		c-5.6-4.9-10.6-10.3-14.7-16.6c-2-3-3.7-6.2-4.1-9.8C4.7,13.7,7,9.3,11.5,6c4-3,8.7-4.5,13.6-5.3c7.8-1.3,15.5-0.8,23,1.9
		c2.9,1.1,5.6,2.5,7.8,4.7c4.4,4.2,5.8,9.3,3.8,15.1c-1.6,4.8-4.4,9-7.7,12.7c-3.3,3.7-6.8,7.1-10.3,10.6c-0.6,0.6-0.9,1.2-0.9,2
		C40.8,48.9,40.8,50.1,40.8,51.5z M30.9,4.2c-4.3,1-7.3,3.2-8.8,7.2c-1.2,3.3-1.2,6.6-0.7,10c1.1,7.7,4.1,14.7,7.9,21.4
		c0.1,0.2,0.2,0.5,0.4,0.6c0.2,0.1,0.5,0.2,0.7,0.2c0.2-0.1,0.3-0.4,0.4-0.6c0.1-0.3,0-0.6,0-0.9c0-12.1,0-24.2,0-36.4
		C30.9,5.2,30.9,4.8,30.9,4.2z M35,4.3c0,13.1,0,26.2,0,39.2c0.1,0.1,0.2,0.2,0.3,0.3c0.4-0.4,0.9-0.7,1.2-1.2
		c2.8-4.8,5.1-9.9,6.6-15.2c1.2-4.1,1.9-8.3,1.4-12.7C43.8,9.1,40,4.9,35,4.3z M45,5.7c3.4,4.5,4,9.4,3.5,14.5
		c-0.6,6.2-2.6,12-5.2,17.7c-0.2,0.4-0.3,0.7-0.5,1.1c0.1,0.1,0.3,0.2,0.4,0.3c2.6-3.2,5.4-6.2,7.8-9.5C53,27,54.7,24,56,20.9
		c1.5-3.6,0.6-7.1-2-10C51.6,8.3,48.5,6.9,45,5.7z M22.7,39.1c0.1-0.2,0.1-0.2,0.1-0.3c-0.1-0.4-0.3-0.7-0.5-1.1
		c-2.2-5-4.1-10.1-4.9-15.5c-0.8-5.7-0.6-11.3,3-16.2c0,0,0-0.1-0.2-0.6c-2.4,1.3-4.8,2.4-6.9,4c-3.1,2.3-4.7,5.5-4.1,9.4
		c0.3,1.8,1,3.6,1.8,5.3C14,29.8,18.2,34.5,22.7,39.1z M27,63.3c4,0,7.8,0,11.8,0c0-2.6,0-5.1,0-7.7c-3.9,0-7.8,0-11.8,0
		C27,58.1,27,60.7,27,63.3z M36.8,47.6c-2.7,0-5.2,0-7.7,0c0,1.3,0,2.6,0,3.8c2.6,0,5.1,0,7.7,0C36.8,50.2,36.8,48.9,36.8,47.6z"/>
	<path class="st1" d="M30.9,4.2c0,0.6,0,1.1,0,1.5c0,12.1,0,24.2,0,36.4c0,0.3,0,0.6,0,0.9c0,0.2-0.2,0.5-0.4,0.6
		c-0.2,0.1-0.5,0-0.7-0.2c-0.2-0.1-0.3-0.4-0.4-0.6C25.5,36,22.6,29,21.4,21.3c-0.5-3.4-0.5-6.7,0.7-10C23.6,7.3,26.6,5.1,30.9,4.2z
		"/>
	<path class="st1" d="M35,4.3c5.1,0.6,8.9,4.8,9.5,10.3c0.5,4.3-0.2,8.6-1.4,12.7c-1.5,5.4-3.7,10.4-6.6,15.2
		c-0.3,0.5-0.8,0.8-1.2,1.2c-0.1-0.1-0.2-0.2-0.3-0.3C35,30.4,35,17.4,35,4.3z"/>
	<path class="st1" d="M45,5.7c3.6,1.2,6.7,2.6,9,5.2c2.6,2.9,3.5,6.4,2,10c-1.3,3.1-3,6-4.9,8.8c-2.4,3.3-5.2,6.4-7.8,9.5
		C43.1,39.1,43,39,42.9,39c0.2-0.4,0.3-0.7,0.5-1.1c2.5-5.7,4.6-11.4,5.2-17.7C49,15.1,48.4,10.3,45,5.7z"/>
	<path class="st1" d="M22.7,39.1c-4.5-4.6-8.7-9.3-11.6-15c-0.8-1.6-1.6-3.5-1.8-5.3c-0.6-3.9,1-7.1,4.1-9.4c2.1-1.5,4.6-2.6,6.9-4
		c0.1,0.4,0.2,0.5,0.2,0.6c-3.6,4.9-3.9,10.5-3,16.2c0.8,5.4,2.6,10.5,4.9,15.5c0.2,0.4,0.3,0.7,0.5,1.1
		C22.8,38.9,22.8,38.9,22.7,39.1z"/>
	<path class="st1" d="M27,63.3c0-2.6,0-5.1,0-7.7c3.9,0,7.8,0,11.8,0c0,2.6,0,5.1,0,7.7C34.9,63.3,31,63.3,27,63.3z"/>
</g>
</svg>
