<?xml version="1.0" encoding="utf-8"?>
<!-- Generator: Adobe Illustrator 24.0.0, SVG Export Plug-In . SVG Version: 6.00 Build 0)  -->
<svg version="1.1" id="Слой_1" xmlns="http://www.w3.org/2000/svg" xmlns:xlink="http://www.w3.org/1999/xlink" x="0px" y="0px"
	 viewBox="0 0 100 100" style="enable-background:new 0 0 100 100;" xml:space="preserve">
<style type="text/css">
	.st0{fill:#62A3D9;stroke:#000000;stroke-width:4.715;stroke-miterlimit:10;}
	.st1{fill:#FFFFFF;stroke:#000000;stroke-width:4.715;stroke-miterlimit:10;}
	.st2{fill:#FFFFFF;}
	.st3{fill:#FFFFFF;stroke:#000000;stroke-width:4.7153;stroke-miterlimit:10;}
</style>
<circle class="st0" cx="46.6" cy="48.4" r="34.3"/>
<circle class="st1" cx="20" cy="26.7" r="8.1"/>
<g>
	<path class="st2" d="M69.9,13.9c0,6.2,0,12.4,0,18.6c-7.7,0-15.4,0-23.1,0c0-6.2,0-12.3,0-18.6C54.5,13.9,62.1,13.9,69.9,13.9z"/>
	<path class="st2" d="M47.1,62.8c0,6.3,0,12.4,0,18.6c-7.5,0-15,0-22.5,0c0-6.2,0-12.4,0-18.6C32.1,62.8,39.6,62.8,47.1,62.8z"/>
	<path class="st2" d="M35.7,44.8c1.6,0,2.7,1.2,2.7,2.7c0,1.4-1.3,2.7-2.7,2.6c-1.4,0-2.7-1.2-2.7-2.7C33,46,34.1,44.8,35.7,44.8z"
		/>
	<path class="st2" d="M58.3,44.8c1.6,0,2.7,1.2,2.7,2.7c0,1.4-1.3,2.7-2.7,2.6c-1.5,0-2.6-1.2-2.6-2.7
		C55.6,45.9,56.7,44.8,58.3,44.8z"/>
	<path d="M73.1,49.8c0.4,0,0.8,0,1.2,0c1.5,0,2.5-0.8,2.5-2.1c0-1.4-1-2.4-2.5-2.4c-0.4,0-0.8,0-1.2,0V49.8z"/>
	<path d="M65.9,49.7c0.8,0,1.6,0,7.8,0v-4.5c-6.4,0-7.3,0-8.2,0c-0.2,0-0.5-0.2-0.6-0.5c-0.8-1.8-2.1-3.1-3.9-3.9
		c-0.2-0.1-0.5-0.4-0.5-0.6c-0.1-1,0-2,0-3.1c0.5,0,0.9,0,1.2,0c3.3,0,6.6,0,9.9,0c2,0,2.8-0.8,2.8-2.7c0-7.4,0-14.8,0-22.3
		c0-1.9-0.8-2.7-2.7-2.7c-8.9,0-17.8,0-26.8,0c-1.9,0-2.7,0.8-2.7,2.7c0,7.5,0,14.9,0,22.4c0,1.8,0.8,2.7,2.7,2.7c3.3,0,6.7,0,10,0
		c0.4,0,0.7,0,1.1,0.1c0,1,0.1,1.9,0,2.8c0,0.3-0.3,0.8-0.6,0.9c-1.7,0.8-3,2-3.7,3.8c-0.2,0.5-0.5,0.7-1,0.7c-2.4,0-4.7,0-7.1,0
		c-0.8,0-1.1-0.2-1.4-0.9c-1.3-2.7-3.5-4-6.4-4c-2.9,0-5.1,1.3-6.5,3.9c-0.3,0.6-0.6,0.7-1.2,0.7c-1.8,0-3.7,0-5.5,0
		c-1.6,0-2.6,0.9-2.6,2.3c0,1.5,1,2.5,2.6,2.5c1.8,0,3.6,0,5.4,0c0.6,0,0.8,0.2,1,0.7c0.7,1.7,2,2.9,3.7,3.7
		c0.2,0.1,0.6,0.4,0.6,0.7c0.1,1.1,0,2.2,0,3.5c-0.5,0-0.8,0-1.2,0c-3.2,0-6.3,0-9.5,0c-1.8,0-2.7,0.8-2.7,2.7c0,7.5,0,15,0,22.5
		c0,1.7,0.9,2.6,2.6,2.6c8.8,0,17.6,0,26.5,0c1.7,0,2.6-0.9,2.6-2.6c0-7.5,0-15,0-22.6c0-1.7-0.8-2.6-2.6-2.6c-3.3,0-6.7,0-10,0
		c-0.4,0-0.7,0-1.2,0c0-1.1-0.1-2.2,0-3.2c0-0.3,0.3-0.8,0.6-0.9c1.7-0.8,2.9-2,3.7-3.6c0.2-0.5,0.6-0.7,1.1-0.7c2.3,0,4.6,0,6.9,0
		c0.8,0,1.2,0.2,1.6,0.9c1.3,2.7,3.6,4,6.6,3.9c2.9-0.1,5.1-1.5,6.3-4.2C65,49.9,65.3,49.7,65.9,49.7z M47.1,62.8
		c0,6.3,0,12.4,0,18.6c-7.5,0-15,0-22.5,0c0-6.2,0-12.4,0-18.6C32.1,62.8,39.6,62.8,47.1,62.8z M35.7,50.2c-1.4,0-2.7-1.2-2.7-2.7
		c0-1.6,1.1-2.7,2.7-2.7c1.6,0,2.7,1.2,2.7,2.7C38.3,49,37.1,50.2,35.7,50.2z M46.8,32.5c0-6.2,0-12.3,0-18.6c7.7,0,15.4,0,23.1,0
		c0,6.2,0,12.4,0,18.6C62.2,32.5,54.5,32.5,46.8,32.5z M58.2,50.2c-1.5,0-2.6-1.2-2.6-2.7c0-1.6,1.1-2.7,2.7-2.7
		c1.6,0,2.7,1.2,2.7,2.7C60.9,49,59.6,50.2,58.2,50.2z"/>
</g>
<circle class="st3" cx="80.9" cy="46.8" r="8.1"/>
</svg>
