<?xml version="1.0" encoding="utf-8"?>
<!-- Generator: Adobe Illustrator 24.0.0, SVG Export Plug-In . SVG Version: 6.00 Build 0)  -->
<svg version="1.1" id="Слой_1" xmlns="http://www.w3.org/2000/svg" xmlns:xlink="http://www.w3.org/1999/xlink" x="0px" y="0px"
	 viewBox="0 0 100 100" style="enable-background:new 0 0 100 100;" xml:space="preserve">
<style type="text/css">
	.st0{fill:#62A3D9;stroke:#000000;stroke-width:4.715;stroke-miterlimit:10;}
	.st1{fill:#FFFFFF;}
	.st2{fill:#FFFFFF;stroke:#000000;stroke-width:4.7153;stroke-miterlimit:10;}
	.st3{fill:#FFFFFF;stroke:#000000;stroke-width:4.715;stroke-miterlimit:10;}
</style>
<circle class="st0" cx="46.6" cy="48.4" r="34.3"/>
<g>
	<path class="st1" d="M57.9,85.1c0,2.1,0,3.9,0,5.8c0,1.3-1.7,2.9-2.9,2.9c-5.6,0-11.2,0-16.8,0c-1.2,0-2.9-1.7-2.9-2.9
		c0-1.9,0-3.8,0-5.8C42.8,85.1,50.2,85.1,57.9,85.1z"/>
</g>
<path d="M46.6,85.1c-20.2,0-36.7-16.4-36.7-36.7c0-20.2,16.4-36.7,36.7-36.7s36.7,16.4,36.7,36.7C83.3,68.6,66.8,85.1,46.6,85.1z
	 M46.6,16.5c-17.6,0-31.9,14.3-31.9,31.9C14.7,66,29,80.3,46.6,80.3S78.5,66,78.5,48.4S64.2,16.5,46.6,16.5z"/>
<circle class="st2" cx="80.9" cy="46.8" r="8.1"/>
<circle class="st3" cx="20" cy="26.7" r="8.1"/>
<circle class="st2" cx="29.5" cy="79" r="8.1"/>
<image style="overflow:visible;" width="243" height="291" xlink:href="A697232E.jpg"  transform="matrix(1 0 0 1 -7894 -7770.1104)">
</image>
<g>
	<path d="M-396.3,169.4c-0.5,0-0.8,0-1.2,0c-0.7,0-1.2,0.4-1.3,1.1c-0.1,0.6,0.2,1.1,0.9,1.3c0.7,0.2,1.2,0,1.5-0.7
		c0.2-0.4,0.4-0.5,0.8-0.5c0.6,0,1.1,0,1.7,0c0.3,2.5-2.5,4.4-4.9,3.5c-1.4-0.6-2.2-1.7-2.4-3.2c-0.1-1.5,0.6-2.7,1.9-3.5
		c0.8-0.5,0.8-0.5,0-1c-1.3-0.8-1.9-1.9-1.9-3.4c0-2.5,0-5,0-7.5c0-0.3,0-0.6,0-1c-1.7,0-3.3,0-4.9,0c0-6.7,0-13.2,0-19.8
		c1.6,0,3.2,0,4.9,0c0-0.9,0-1.6,0-2.5c2.5,0,4.9,0,7.4,0c0,0.8,0,1.5,0,2.4c0.8,0,1.6,0,2.5,0c0-0.8,0-1.6,0-2.4c2.5,0,4.9,0,7.4,0
		c0,0.8,0,1.6,0,2.4c1.7,0,3.3,0,5,0c0,2.5,0,4.9,0,7.4c1.7,0,3.3,0,5,0c0,2.5,0,5,0,7.4c0.9,0,1.6,0,2.5,0c0-2.4,0-4.9,0-7.3
		c2.5,0,4.9,0,7.4,0c0,0.8,0,1.5,0,2.4c-1.6,0-3.2,0-4.9,0c0,2.5,0,4.9,0,7.4c-1.7,0-3.3,0-5,0c0,2.5,0,5,0,7.4c-2.5,0-4.9,0-7.4,0
		c0-1.6,0-3.2,0-4.9c-0.9,0-1.6,0-2.5,0c0,1.6,0,3.2,0,4.9c-3.4,0-6.6,0-10,0c0,1.2,0,2.3,0,3.4c0,1.7-0.6,2.9-2.1,3.7
		c-0.2,0.1-0.4,0.5-0.4,0.7C-396.3,167.9-396.3,168.6-396.3,169.4z M-383.9,139.5c-2.5,0-4.9,0-7.4,0c0-0.8,0-1.6,0-2.4
		c-0.9,0-1.6,0-2.5,0c0,0.8,0,1.6,0,2.4c-2.5,0-4.9,0-7.4,0c0-0.8,0-1.6,0-2.4c-0.9,0-1.7,0-2.4,0c0,3.3,0,6.6,0,9.8
		c0.8,0,1.6,0,2.4,0c0-1.6,0-3.2,0-4.9c5.8,0,11.5,0,17.4,0c0,1.7,0,3.3,0,4.8c0.9,0,1.6,0,2.4,0c0-3.3,0-6.6,0-9.8
		c-0.8,0-1.6,0-2.5,0C-383.9,138-383.9,138.8-383.9,139.5z M-396.3,159.5c0-4.9,0-9.9,0-14.9c-0.8,0-1.6,0-2.4,0c0,5,0,10,0,14.9
		C-397.9,159.5-397.1,159.5-396.3,159.5z M-391.4,156.9c0-4.2,0-8.2,0-12.3c-0.8,0-1.6,0-2.4,0c0,4.1,0,8.2,0,12.3
		C-392.9,156.9-392.2,156.9-391.4,156.9z M-378.8,144.6c0,4.1,0,8.2,0,12.3c0.8,0,1.6,0,2.4,0c0-4.1,0-8.2,0-12.3
		C-377.3,144.6-378,144.6-378.8,144.6z M-388.8,144.6c0,0.4,0,0.7,0,1c0,3.3,0,6.5,0,9.8c0,1.6,0,1.6,1.6,1.6c0.7,0,0.9-0.2,0.9-0.9
		c0-3.6,0-7.1,0-10.7c0-0.3,0-0.5,0-0.8C-387.2,144.6-388,144.6-388.8,144.6z M-396.3,134.7c-0.9,0-1.6,0-2.4,0c0,0.8,0,1.6,0,2.4
		c0.8,0,1.6,0,2.4,0C-396.3,136.2-396.3,135.5-396.3,134.7z M-386.4,137.1c0-0.8,0-1.6,0-2.4c-0.8,0-1.6,0-2.4,0c0,0.8,0,1.6,0,2.4
		C-388,137.1-387.2,137.1-386.4,137.1z M-401.3,149.5c-0.8,0-1.6,0-2.4,0c0,0.8,0,1.6,0,2.4c0.8,0,1.6,0,2.4,0
		C-401.3,151.1-401.3,150.3-401.3,149.5z M-383.9,151.9c2.5,0.3,2.6,0.2,2.5-1.9c0,0,0-0.1,0-0.1c0-0.6-0.4-0.6-0.7-0.5
		c-0.6,0.2-1.5-0.5-1.7,0.4C-384,150.5-383.9,151.2-383.9,151.9z M-397.5,164.3c0.8,0,1.2-0.4,1.2-1.1c0-0.7-0.5-1.3-1.2-1.3
		c-0.7,0-1.3,0.6-1.3,1.2C-398.7,163.9-398.3,164.3-397.5,164.3z"/>
	<path class="st1" d="M-396.3,159.5c-0.8,0-1.5,0-2.4,0c0-4.9,0-9.9,0-14.9c0.8,0,1.5,0,2.4,0C-396.3,149.6-396.3,154.6-396.3,159.5
		z"/>
	<path class="st1" d="M-391.4,156.9c-0.8,0-1.6,0-2.4,0c0-4.1,0-8.2,0-12.3c0.8,0,1.6,0,2.4,0C-391.4,148.7-391.4,152.8-391.4,156.9
		z"/>
	<path class="st1" d="M-378.8,144.6c0.8,0,1.5,0,2.4,0c0,4.1,0,8.2,0,12.3c-0.8,0-1.5,0-2.4,0C-378.8,152.8-378.8,148.7-378.8,144.6
		z"/>
	<path class="st1" d="M-388.8,144.6c0.9,0,1.6,0,2.5,0c0,0.3,0,0.6,0,0.8c0,3.6,0,7.1,0,10.7c0,0.7-0.2,0.9-0.9,0.9
		c-1.6,0-1.6,0-1.6-1.6c0-3.3,0-6.5,0-9.8C-388.8,145.3-388.8,145-388.8,144.6z"/>
	<path class="st1" d="M-396.3,134.7c0,0.8,0,1.6,0,2.4c-0.8,0-1.6,0-2.4,0c0-0.8,0-1.5,0-2.4C-398,134.7-397.2,134.7-396.3,134.7z"
		/>
	<path class="st1" d="M-386.4,137.1c-0.8,0-1.6,0-2.4,0c0-0.8,0-1.5,0-2.4c0.8,0,1.5,0,2.4,0C-386.4,135.4-386.4,136.2-386.4,137.1z
		"/>
	<path class="st1" d="M-401.3,149.5c0,0.8,0,1.5,0,2.4c-0.8,0-1.6,0-2.4,0c0-0.8,0-1.5,0-2.4C-402.9,149.5-402.1,149.5-401.3,149.5z
		"/>
	<path class="st1" d="M-383.9,151.9c0-0.7-0.1-1.4,0-2c0.3-1,1.2-0.3,1.7-0.4c0.3-0.1,0.8-0.1,0.7,0.5c0,0,0,0.1,0,0.1
		C-381.2,152.1-381.4,152.2-383.9,151.9z"/>
	<path class="st1" d="M-397.5,164.3c-0.7,0-1.2-0.4-1.2-1.1c0-0.7,0.6-1.2,1.3-1.2c0.7,0,1.2,0.6,1.2,1.3
		C-396.3,163.9-396.7,164.3-397.5,164.3z"/>
</g>
<g>
	<path d="M54.9,67.1c-1.4,4.1-4.1,6.3-8.2,6.4c-4.3,0-7.1-2.3-8.4-6.4c-2.1,0-4.3,0.1-6.4,0c-0.7,0-1.6-0.3-2.1-0.8
		c-6.4-6.6-8.1-14.5-5.6-23.1c2.6-8.7,8.7-14.1,17.5-16c13.1-2.8,25.5,5.5,27.9,18.7c1.4,7.7-0.7,14.6-6.1,20.4
		c-0.5,0.5-1.4,0.9-2.2,0.9C59.3,67.2,57.1,67.1,54.9,67.1z M58.7,35.1c-3.1-2.3-6.2-3.7-10-4.1c0,1.4,0,2.7,0,4c-1.5,0-2.8,0-4.3,0
		c0-1.4,0-2.6,0-4c-3.8,0.5-6.9,1.8-10,4.2c1.2,0.9,2.2,1.8,3.1,2.5c-1.1,1.2-2.1,2.2-3.2,3.4c-0.9-1-1.7-2-2.7-3.1
		c-2.4,3-3.7,6.2-4.1,10c1.5,0,2.7,0,4,0c0,1.5,0,2.8,0,4.3c-1.4,0-2.6,0-4,0c0.3,3,1.4,5.6,2.8,8c1.1,1.8,2.4,3.1,4.7,2.6
		c0.7-0.1,1.4-0.1,2.1,0c0.7,0.1,1.2-0.1,1.5-0.9c0.9-2.3,2.5-4,4.8-4.9c0.8-0.3,1-0.7,1-1.5c0-3.4,0-6.9,0-10.3c0-0.5,0-1,0.1-1.6
		c1.4,0,2.7,0,4.2,0c0,0.6,0,1.1,0,1.6c0,3,0.1,6,0,9.1c-0.1,1.6,0.3,2.5,1.9,3.2c2.3,0.9,3.6,3,4.3,5.3c1.7,0,3.3,0.1,4.9,0
		c0.6,0,1.3-0.4,1.6-0.8c1.8-2.1,3-4.5,3.7-7.2c0.2-0.8,0.3-1.6,0.5-2.6c-1.5,0-2.8,0-4.1,0c0-1.5,0-2.8,0-4.3c1.4,0,2.6,0,4,0
		c-0.4-3.8-1.8-6.9-4.2-10c-0.9,1.2-1.8,2.2-2.6,3.2c-1.2-1.2-2.2-2.1-3.4-3.3C56.6,36.9,57.6,36,58.7,35.1z M46.6,60.8
		c-2.5,0-4.3,1.8-4.3,4.3c0,2.3,2,4.2,4.3,4.2c2.3,0,4.2-2,4.2-4.3C50.8,62.6,49.1,60.8,46.6,60.8z"/>
	<path class="st1" d="M58.7,35.1c-1.1,1-2.1,1.8-3.2,2.7c1.2,1.2,2.2,2.1,3.4,3.3c0.8-1,1.6-2,2.6-3.2c2.4,3.1,3.8,6.2,4.2,10
		c-1.4,0-2.7,0-4,0c0,1.5,0,2.8,0,4.3c1.3,0,2.5,0,4.1,0c-0.2,1-0.3,1.8-0.5,2.6c-0.7,2.7-1.9,5.1-3.7,7.2c-0.4,0.4-1.1,0.8-1.6,0.8
		c-1.6,0.1-3.2,0-4.9,0c-0.8-2.3-2-4.4-4.3-5.3c-1.6-0.7-2-1.6-1.9-3.2c0.1-3,0-6,0-9.1c0-0.5,0-1,0-1.6c-1.5,0-2.8,0-4.2,0
		c0,0.5-0.1,1.1-0.1,1.6c0,3.4,0,6.9,0,10.3c0,0.8-0.2,1.2-1,1.5c-2.3,0.9-4,2.5-4.8,4.9c-0.3,0.8-0.7,1-1.5,0.9
		c-0.7-0.1-1.4-0.1-2.1,0c-2.4,0.5-3.6-0.8-4.7-2.6c-1.4-2.4-2.5-5-2.8-8c1.4,0,2.7,0,4,0c0-1.5,0-2.8,0-4.3c-1.3,0-2.5,0-4,0
		c0.4-3.8,1.7-6.9,4.1-10c0.9,1.1,1.8,2.1,2.7,3.1c1.2-1.2,2.1-2.2,3.2-3.4c-0.9-0.7-1.9-1.6-3.1-2.5c3.1-2.5,6.2-3.8,10-4.2
		c0,1.4,0,2.7,0,4c1.5,0,2.8,0,4.3,0c0-1.3,0-2.5,0-4C52.5,31.4,55.6,32.8,58.7,35.1z"/>
	<path class="st1" d="M46.6,60.8c2.4,0,4.2,1.8,4.2,4.2c0,2.3-1.9,4.2-4.2,4.3c-2.3,0-4.3-1.9-4.3-4.2
		C42.3,62.6,44.2,60.7,46.6,60.8z"/>
</g>
</svg>
