<?xml version="1.0" encoding="utf-8"?>
<!-- Generator: Adobe Illustrator 24.0.0, SVG Export Plug-In . SVG Version: 6.00 Build 0)  -->
<svg version="1.1" id="Слой_1" xmlns="http://www.w3.org/2000/svg" xmlns:xlink="http://www.w3.org/1999/xlink" x="0px" y="0px"
	 viewBox="0 0 100 100" style="enable-background:new 0 0 100 100;" xml:space="preserve">
<style type="text/css">
	.st0{fill:#62A3D9;stroke:#000000;stroke-width:4.715;stroke-miterlimit:10;}
	.st1{fill:#FFFFFF;}
	.st2{fill:#FFFFFF;stroke:#000000;stroke-width:4.7153;stroke-miterlimit:10;}
	.st3{fill:#FFFFFF;stroke:#000000;stroke-width:4.715;stroke-miterlimit:10;}
</style>
<circle class="st0" cx="46.6" cy="48.4" r="34.3"/>
<g>
	<path class="st1" d="M57.9,85.1c0,2.1,0,3.9,0,5.8c0,1.3-1.7,2.9-2.9,2.9c-5.6,0-11.2,0-16.8,0c-1.2,0-2.9-1.7-2.9-2.9
		c0-1.9,0-3.8,0-5.8C42.8,85.1,50.2,85.1,57.9,85.1z"/>
</g>
<path d="M46.6,85.1c-20.2,0-36.7-16.4-36.7-36.7c0-20.2,16.4-36.7,36.7-36.7s36.7,16.4,36.7,36.7C83.3,68.6,66.8,85.1,46.6,85.1z
	 M46.6,16.5c-17.6,0-31.9,14.3-31.9,31.9C14.7,66,29,80.3,46.6,80.3S78.5,66,78.5,48.4S64.2,16.5,46.6,16.5z"/>
<circle class="st2" cx="80.9" cy="46.8" r="8.1"/>
<circle class="st3" cx="20" cy="26.7" r="8.1"/>
<image style="overflow:visible;enable-background:new    ;" width="243" height="292" xlink:href="A697232E.jpg"  transform="matrix(0.998 0 0 0.998 -7893.7544 -7770.3149)">
</image>
<g>
	<path d="M52.9,95.9c-4.3,0-8.5,0-12.7,0c0-1.4,0-2.8,0-4.3c1.4,0,2.7,0,4.2,0c0-4.3,0-8.6,0-12.9c-1.3,0-2.6,0-3.9,0
		c-2.9,0-5.9,0-8.8,0c-0.4,0-1,0.2-1.2,0.6c-2,3.9-4,7.9-6,11.9c0,0.1,0,0.2-0.1,0.4c0.9,0,1.8,0,2.7,0c0,1.5,0,2.8,0,4.3
		c-4.2,0-8.5,0-12.8,0c0-1.4,0-2.8,0-4.3c1.5,0,2.9,0,4.3,0c0.3,0,0.8-0.2,1-0.5c2.2-4.2,4.3-8.4,6.4-12.8
		c-5.6-2.2-7.9-6.5-7.5-12.4c-1.5,0-2.8,0-4.2,0c0-1.5,0-2.8,0-4.3c4.3,0,8.5,0,12.8,0c0-1.5,0-2.9,0-4.4c-1.4,0-2.7,0-4,0
		c-1.6-10.4,6.3-24.3,21.2-25.8c0-1.4,0-2.9,0-4.4c-1.4,0-2.7,0-4.2,0c0-1.5,0-2.8,0-4.3c4.2,0,8.4,0,12.7,0c0,1.4,0,2.8,0,4.3
		c-1.4,0-2.7,0-4.2,0c0,1.4,0,2.7,0,4c0,0.2,0.5,0.5,0.7,0.6c9,1.3,15.3,6.2,19,14.4c1.6,3.5,2,7.3,1.7,11.2c-1.4,0-2.7,0-4.2,0
		c0,1.5,0,2.9,0,4.4c4.3,0,8.5,0,12.8,0c0,1.5,0,2.9,0,4.4c-1.4,0-2.7,0-4.2,0c0.3,5.9-1.9,10.2-7.5,12.4c2,3.9,3.9,7.7,5.8,11.6
		c0.6,1.3,1.3,1.9,2.7,1.7c1-0.1,2.1,0,3.2,0c0,1.5,0,2.8,0,4.3c-4.3,0-8.5,0-12.8,0c0-1.4,0-2.7,0-4.2c0.9,0,1.8,0,2.9,0
		c-0.3-0.7-0.5-1.2-0.8-1.7c-1.7-3.5-3.5-7-5.3-10.4c-0.2-0.4-0.7-0.8-1-0.8c-4.2-0.1-8.4,0-12.6,0c-0.1,0-0.2,0-0.4,0.1
		c0,4.2,0,8.4,0,12.7c1.3,0,2.7,0,4.1,0C52.9,93,52.9,94.4,52.9,95.9z M65.8,52.8c-1-9.7-9.4-17.1-19.2-17.1
		c-9.8,0-18.2,7.5-19.2,17.1C40.2,52.8,53,52.8,65.8,52.8z M70.3,66c-15.9,0-31.6,0-47.4,0c0,0.8,0,1.4,0,2.1
		c0.1,3.6,2.8,6.3,6.4,6.3c11.5,0,23,0,34.5,0c2.9,0,5.3-1.7,6.1-4.5C70.3,68.7,70.2,67.4,70.3,66z M31.6,61.5c4.4,0,8.6,0,12.8,0
		c0-1.5,0-2.8,0-4.2c-4.3,0-8.6,0-12.8,0C31.6,58.7,31.6,60,31.6,61.5z M48.8,61.5c4.4,0,8.6,0,12.8,0c0-1.5,0-2.8,0-4.2
		c-4.3,0-8.6,0-12.8,0C48.8,58.7,48.8,60,48.8,61.5z"/>
	<path class="st1" d="M65.8,52.8c-12.8,0-25.6,0-38.4,0c1-9.7,9.4-17.1,19.2-17.1C56.4,35.6,64.8,43.1,65.8,52.8z M40.1,44.2
		c-1.5,0-2.8,0-4.2,0c0,1.4,0,2.8,0,4.2c1.4,0,2.8,0,4.2,0C40.1,47,40.1,45.7,40.1,44.2z M53.1,44.2c0,1.5,0,2.8,0,4.2
		c1.5,0,2.8,0,4.2,0c0-1.4,0-2.8,0-4.2C55.9,44.2,54.5,44.2,53.1,44.2z M48.7,44.2c-1.4,0-2.7,0-4.1,0c0,1.4,0,2.8,0,4.2
		c1.4,0,2.7,0,4.1,0C48.7,47,48.7,45.6,48.7,44.2z"/>
	<path class="st1" d="M70.3,66c-0.1,1.4-0.1,2.7-0.4,3.9c-0.8,2.7-3.2,4.5-6.1,4.5c-11.5,0-23,0-34.5,0c-3.6,0-6.3-2.7-6.4-6.3
		c0-0.7,0-1.4,0-2.1C38.7,66,54.4,66,70.3,66z"/>
	<path d="M40.1,44.2c0,1.4,0,2.8,0,4.2c-1.4,0-2.8,0-4.2,0c0-1.4,0-2.7,0-4.2C37.3,44.2,38.6,44.2,40.1,44.2z"/>
	<path d="M53.1,44.2c1.5,0,2.8,0,4.2,0c0,1.4,0,2.8,0,4.2c-1.4,0-2.8,0-4.2,0C53.1,47,53.1,45.7,53.1,44.2z"/>
	<path d="M48.7,44.2c0,1.4,0,2.8,0,4.2c-1.4,0-2.7,0-4.1,0c0-1.4,0-2.7,0-4.2C45.9,44.2,47.2,44.2,48.7,44.2z"/>
</g>
</svg>
