<?xml version="1.0" encoding="utf-8"?>
<!-- Generator: Adobe Illustrator 24.0.0, SVG Export Plug-In . SVG Version: 6.00 Build 0)  -->
<svg version="1.1" id="Слой_1" xmlns="http://www.w3.org/2000/svg" xmlns:xlink="http://www.w3.org/1999/xlink" x="0px" y="0px"
	 viewBox="0 0 100 100" style="enable-background:new 0 0 100 100;" xml:space="preserve">
<style type="text/css">
	.st0{fill:#62A3D9;stroke:#000000;stroke-width:4.715;stroke-miterlimit:10;}
	.st1{fill:#FFFFFF;stroke:#000000;stroke-width:4.7153;stroke-miterlimit:10;}
	.st2{fill:#FFFFFF;stroke:#000000;stroke-width:4.715;stroke-miterlimit:10;}
	.st3{fill:#FFFFFF;}
</style>
<circle class="st0" cx="47.8" cy="48" r="34.3"/>
<path d="M46.6,85.1c-20.2,0-36.7-16.4-36.7-36.7c0-20.2,16.4-36.7,36.7-36.7s36.7,16.4,36.7,36.7C83.3,68.6,66.8,85.1,46.6,85.1z
	 M46.6,16.5c-17.6,0-31.9,14.3-31.9,31.9C14.7,66,29,80.3,46.6,80.3S78.5,66,78.5,48.4S64.2,16.5,46.6,16.5z"/>
<image style="overflow:visible;enable-background:new    ;" width="243" height="292" xlink:href="A697232E.jpg"  transform="matrix(0.998 0 0 0.998 -7893.7544 -7770.3149)">
</image>
<circle class="st1" cx="80.9" cy="46.8" r="8.1"/>
<circle class="st2" cx="20" cy="26.7" r="8.1"/>
<g>
	<path d="M40.5,73.8c0-1.2,0-2.2,0-3.2c0-5.1,0-10.2,0-15.3c0-0.9-0.2-1.4-1-1.9c-6.4-4-9.6-10.1-11.2-17.2
		c-0.2-1.1,0.2-2.1,1.2-2.7c1.1-0.6,2.1-0.4,3.2,0.3c4.6,3.4,9.9,4,15.6,3.7c0-2.3-0.1-4.6,0-6.8c0.1-2.5-0.1-4.6-2.3-6.4
		c-2.1-1.8-3.1-4.4-3.8-7.1c-0.3-1.2-0.3-2.4,0.8-3.2c1.1-0.9,2.2-0.5,3.4,0.1c1.2,0.6,2.6,0.9,3.9,0.9c3.1-0.1,6-1.2,8.8-2.5
		C57,7.7,57.4,4.6,60.3,2.3c2.5-2,6.1-2,8.7,0c2.9,2.3,3.3,5.3,1.3,10.1c3.5,1.4,7,3.1,11,2.2c0.6-0.1,1.3-0.5,1.8-0.8
		c1-0.6,2-0.7,3,0c1,0.7,1.2,1.8,1,2.9c-0.9,3.5-2.6,6.6-5.3,9c-0.6,0.6-0.9,1.1-0.9,2c0,3.2,0,6.4,0,9.8c5.6,0.3,10.8-0.3,15.4-3.6
		c1.1-0.7,2.1-1.1,3.3-0.5c1.2,0.6,1.5,1.7,1.2,3c-1.6,7.2-5,13.2-11.5,17.2c-0.3,0.2-0.7,0.8-0.7,1.2c0,6.3,0,12.6,0,19.1
		c1.1,0,2.2,0,3.2,0c1.8,0,2.8,1,2.8,2.8c0,2.6,0,5.2,0,7.7c0,2.5-0.8,3.3-3.3,3.3c-15.7,0-31.5,0-47.2,0c-2.3,0-4.5,0-6.8,0
		c-2.1,0-3-0.9-3-2.9c0-2.7,0-5.3,0-8c0-2,0.9-2.9,2.9-2.9C38.4,73.8,39.3,73.8,40.5,73.8z M94,40.9c-4.3,1.5-8.5,1.9-12.7,1.7
		c-1.3-0.1-2.6-0.3-3.9-0.3c-8.5,0-16.9,0-25.4,0c-0.9,0-1.7,0.2-2.6,0.2c-2.5,0-5.1,0.2-7.6-0.1c-2.2-0.2-4.4-0.8-6.6-1.2
		c3,6.2,7.9,10.1,14.8,10.4c9.7,0.4,19.3,0.3,29,0C86,51.2,90.8,47.3,94,40.9z M83.5,73.7c0-5.9,0-11.7,0-17.6
		c-6.3,1.2-12.6,0.6-18.9,0.6c-6.3,0.1-12.6-0.1-18.9-0.2c0,5.6,0,11.4,0,17.1c2.8,0,5.6,0,8.3,0c0.1-1.9,0.1-3.6,0.3-5.4
		c0.6-5.2,5.1-9,10.4-9c5.3,0,9.7,3.9,10.3,9.1c0.2,1.7,0.2,3.5,0.3,5.3C78,73.7,80.7,73.7,83.5,73.7z M39.7,82.4
		c16.7,0,33.3,0,49.9,0c0-1.2,0-2.3,0-3.4c-16.7,0-33.3,0-49.9,0C39.7,80.2,39.7,81.2,39.7,82.4z M49.3,20.1
		c1.1,1.6,2.1,2.5,4.1,2.4c7.7-0.1,15.3,0,23-0.1c1.6,0,2.7-0.8,3.3-2.4c-5-0.1-9.6-1.9-14-4.2c-0.8-0.4-1.3-0.5-2.1,0
		C59.2,18.1,54.6,19.9,49.3,20.1z M69.9,73.7c0-1.7,0.1-3.2,0-4.7c-0.2-2.5-2.3-4.4-4.9-4.6c-2.3-0.2-4.9,1.4-5.4,3.7
		c-0.4,1.8-0.3,3.7-0.4,5.6C62.9,73.7,66.4,73.7,69.9,73.7z M62.6,27.7c0,3.2,0,6.3,0,9.4c1.4,0,2.7,0,4,0c0-3.2,0-6.2,0-9.4
		C65.3,27.7,64,27.7,62.6,27.7z M57.4,27.8c-1.4,0-2.6,0-3.8,0c0,3.2,0,6.2,0,9.3c1.3,0,2.6,0,3.8,0C57.4,33.9,57.4,30.9,57.4,27.8z
		 M75.7,37.1c0-3.2,0-6.3,0-9.4c-1.3,0-2.5,0-3.7,0c0,3.2,0,6.2,0,9.4C73.2,37.1,74.4,37.1,75.7,37.1z M64.6,6c-1,0-1.9,0.9-1.8,1.9
		c0,1,0.9,1.9,2,1.8c1,0,1.9-0.9,1.8-2C66.5,6.7,65.6,5.9,64.6,6z"/>
	<path class="st3" d="M94,40.9c-3.2,6.4-8,10.4-14.9,10.6c-9.7,0.3-19.3,0.4-29,0c-6.9-0.3-11.7-4.2-14.8-10.4
		c2.3,0.4,4.4,1.1,6.6,1.2c2.5,0.2,5,0.1,7.6,0.1c0.9,0,1.7-0.2,2.6-0.2c8.5,0,16.9,0,25.4,0c1.3,0,2.6,0.2,3.9,0.3
		C85.6,42.8,89.7,42.3,94,40.9z"/>
	<path class="st3" d="M83.5,73.7c-2.8,0-5.5,0-8.3,0c-0.1-1.8-0.1-3.6-0.3-5.3c-0.6-5.2-5-9.1-10.3-9.1c-5.3,0-9.8,3.8-10.4,9
		c-0.2,1.7-0.2,3.5-0.3,5.4c-2.7,0-5.4,0-8.3,0c0-5.8,0-11.6,0-17.1c6.3,0.1,12.6,0.3,18.9,0.2c6.3-0.1,12.6,0.5,18.9-0.6
		C83.5,62,83.5,67.8,83.5,73.7z"/>
	<path class="st3" d="M39.7,82.4c0-1.1,0-2.2,0-3.4c16.6,0,33.2,0,49.9,0c0,1.1,0,2.2,0,3.4C72.9,82.4,56.3,82.4,39.7,82.4z"/>
	<path class="st3" d="M49.3,20.1c5.3-0.2,9.9-2,14.3-4.3c0.8-0.4,1.4-0.4,2.1,0c4.4,2.3,8.9,4.1,14,4.2c-0.6,1.6-1.7,2.4-3.3,2.4
		c-7.7,0-15.3-0.1-23,0.1C51.5,22.6,50.4,21.7,49.3,20.1z"/>
	<path class="st3" d="M69.9,73.7c-3.5,0-6.9,0-10.7,0c0.1-1.9,0-3.8,0.4-5.6c0.5-2.3,3.1-3.9,5.4-3.7c2.6,0.2,4.6,2.1,4.9,4.6
		C70,70.5,69.9,72,69.9,73.7z"/>
	<path class="st3" d="M64.6,6c1.1,0,1.9,0.8,2,1.8c0,1-0.8,1.9-1.8,2c-1,0-1.9-0.8-2-1.8C62.7,6.9,63.5,6,64.6,6z"/>
</g>
<circle class="st1" cx="29.5" cy="79" r="8.1"/>
</svg>
