<?xml version="1.0" encoding="utf-8"?>
<!-- Generator: Adobe Illustrator 24.0.0, SVG Export Plug-In . SVG Version: 6.00 Build 0)  -->
<svg version="1.1" id="Слой_1" xmlns="http://www.w3.org/2000/svg" xmlns:xlink="http://www.w3.org/1999/xlink" x="0px" y="0px"
	 viewBox="0 0 100 100" style="enable-background:new 0 0 100 100;" xml:space="preserve">
<style type="text/css">
	.st0{fill:#62A3D9;stroke:#000000;stroke-width:4.715;stroke-miterlimit:10;}
	.st1{fill:#FFFFFF;stroke:#000000;stroke-width:4.7153;stroke-miterlimit:10;}
	.st2{fill:#FFFFFF;stroke:#000000;stroke-width:4.715;stroke-miterlimit:10;}
	.st3{fill:#FFFFFF;}
</style>
<circle class="st0" cx="46.6" cy="48.4" r="34.3"/>
<path d="M46.6,85.1c-20.2,0-36.7-16.4-36.7-36.7c0-20.2,16.4-36.7,36.7-36.7s36.7,16.4,36.7,36.7C83.3,68.6,66.8,85.1,46.6,85.1z
	 M46.6,16.5c-17.6,0-31.9,14.3-31.9,31.9C14.7,66,29,80.3,46.6,80.3S78.5,66,78.5,48.4S64.2,16.5,46.6,16.5z"/>
<circle class="st1" cx="80.9" cy="46.8" r="8.1"/>
<image style="overflow:visible;" width="250" height="296" xlink:href="2E1517D6.jpg"  transform="matrix(1 0 0 1 -7894 -7770.1104)">
</image>
<circle class="st2" cx="20" cy="26.7" r="8.1"/>
<g>
	<path d="M48.7,67.6c0.8,0.3,1.6,0.6,2.3,0.8c-0.8,1.3-1.5,2.3-2.2,3.4c-1.4-0.9-3-1.9-4.7-3.1c-1.8,3.3-3.5,6.2-5.1,9.2
		c-0.6,1.1-0.8,2.3-1.2,3.4c-1.2,3.1-3.9,5.1-7.1,5.2c-3.6,0.1-6.3-1.6-7.9-4.8c-1.4-2.8-0.9-6.4,1.4-8.6c3.4-3.2,5.4-7.2,7.9-11.2
		c-1.7-0.9-3.3-1.8-4.9-2.6c0.8-1.3,1.4-2.4,2.1-3.6c0.6,0.4,1.3,0.8,2.2,1.2c0.3-0.4,0.6-0.9,0.8-1.3c7.7-12.7,15.4-25.4,23.1-38.1
		c1.4-2.3,2.9-4.7,4.3-7c2.7-0.7,5.3-1.3,8-2c1.8-0.5,3.6-0.9,5.6-1.4c0.1,0.5,0.2,1,0.3,1.4c0.9,3.7,1.8,7.4,2.7,11.1
		c0.2,0.9,0.1,1.5-0.4,2.3c-8.9,14.6-17.7,29.2-26.6,43.9c-0.3,0.4-0.6,0.8-1,1.2C48.6,67.2,48.6,67.4,48.7,67.6z M70.6,11.9
		c-2.5,0.6-4.7,1.2-7,1.7c-0.9,0.2-1.4,0.6-1.9,1.4C53,29.2,44.4,43.5,35.7,57.7c-0.2,0.4-0.4,0.7-0.6,1.2c1.2,0.7,2.3,1.4,3.5,2.1
		C46.3,48.3,54,35.6,61.7,22.9c1.1,0.6,2.2,1.3,3.4,2c-7.7,12.7-15.4,25.5-23.1,38c1.1,0.7,2.2,1.4,3.3,2.1c0.1,0,0.1-0.1,0.2-0.2
		c8.9-14.7,17.8-29.4,26.7-44.1c0.2-0.3,0.3-0.7,0.2-1C71.9,17.2,71.2,14.6,70.6,11.9z M29.3,73.4c-0.7,0.8-1.6,1.6-2.3,2.5
		c-1.1,1.3-1.3,2.8-0.5,4.3c0.8,1.6,2.2,2.5,4,2.4c1.7,0,2.9-0.9,3.5-2.5c0.5-1.1,0.8-2.2,1.1-3.2C33.2,75.7,31.3,74.5,29.3,73.4z
		 M32.2,69.9c1.6,1,3.2,2,4.6,2.8c1.1-1.9,2.3-3.9,3.5-5.7c-1.5-0.9-3.1-1.9-4.6-2.8C34.5,66.1,33.3,68.1,32.2,69.9z"/>
	<path class="st3" d="M70.6,11.9c0.7,2.7,1.3,5.3,1.9,7.9c0.1,0.3-0.1,0.7-0.2,1c-8.9,14.7-17.8,29.4-26.7,44.1
		c0,0.1-0.1,0.1-0.2,0.2c-1.1-0.7-2.2-1.4-3.3-2.1c7.6-12.6,15.3-25.3,23.1-38c-1.2-0.7-2.3-1.3-3.4-2C54,35.6,46.3,48.3,38.6,61.1
		c-1.3-0.8-2.4-1.4-3.5-2.1c0.2-0.4,0.4-0.8,0.6-1.2C44.4,43.5,53,29.2,61.6,15c0.5-0.8,1-1.2,1.9-1.4
		C65.8,13.1,68.1,12.5,70.6,11.9z"/>
	<path class="st3" d="M29.3,73.4c2,1.2,3.9,2.3,5.8,3.5c-0.4,1-0.7,2.1-1.1,3.2c-0.7,1.5-1.9,2.4-3.5,2.5c-1.8,0-3.2-0.8-4-2.4
		c-0.7-1.5-0.5-3,0.5-4.3C27.8,74.9,28.6,74.1,29.3,73.4z"/>
	<path class="st3" d="M32.2,69.9c1.1-1.8,2.3-3.8,3.5-5.7c1.5,0.9,3.1,1.9,4.6,2.8c-1.1,1.9-2.3,3.8-3.5,5.7
		C35.4,71.8,33.7,70.8,32.2,69.9z"/>
</g>
<circle class="st1" cx="29.5" cy="79" r="8.1"/>
</svg>
