<?xml version="1.0" encoding="utf-8"?>
<!-- Generator: Adobe Illustrator 24.0.0, SVG Export Plug-In . SVG Version: 6.00 Build 0)  -->
<svg version="1.1" id="Слой_1" xmlns="http://www.w3.org/2000/svg" xmlns:xlink="http://www.w3.org/1999/xlink" x="0px" y="0px"
	 viewBox="0 0 100 100" style="enable-background:new 0 0 100 100;" xml:space="preserve">
<style type="text/css">
	.st0{fill:#62A3D9;stroke:#000000;stroke-width:4.715;stroke-miterlimit:10;}
	.st1{fill:#FFFFFF;stroke:#000000;stroke-width:4;stroke-miterlimit:10;}
	.st2{fill:#FFFFFF;}
	.st3{fill:#FFFFFF;stroke:#000000;stroke-width:4.715;stroke-miterlimit:10;}
</style>
<path d="M46.6,85.1c-20.2,0-36.7-16.4-36.7-36.7c0-20.2,16.4-36.7,36.7-36.7s36.7,16.4,36.7,36.7C83.3,68.6,66.8,85.1,46.6,85.1z
	 M46.6,16.5c-17.6,0-31.9,14.3-31.9,31.9C14.7,66,29,80.3,46.6,80.3S78.5,66,78.5,48.4S64.2,16.5,46.6,16.5z"/>
<circle class="st0" cx="47.8" cy="48" r="34.3"/>
<image style="overflow:visible;enable-background:new    ;" width="243" height="292" xlink:href="A697232E.jpg"  transform="matrix(0.998 0 0 0.998 -7893.7544 -7770.3149)">
</image>
<circle class="st1" cx="29.5" cy="79" r="4.6"/>
<g>
	<path d="M28.3,69.2c-4-4.2-2.8-10.9,2.4-13.7c3.1-1.7,6.1-3.6,8.4-6.3c2.6-3.1,5.2-6.4,7.6-9.7c2.1-2.9,3.2-6.2,4.1-9.6
		c0.9-3.5,3.2-5.8,6.8-6.5c3.7-0.7,6.7,0.6,8.9,3.6c3,4.3,1.5,10.2-3.2,12.6c-4.3,2.2-7.9,5.2-10.8,9.1c-0.8,1.1-1.6,2.2-2.5,3.2
		c-3.4,3.9-5.6,8.4-6.8,13.4c-0.8,3.5-3.8,6-8.3,6.5C32.8,72.3,30.3,71.4,28.3,69.2z M54.1,30.5c-1.4,6-4.4,11-8.2,15.8
		c-3.2,4-6.4,7.9-10.8,10.6c-1,0.6-2,1.1-2.9,1.7c-2.2,1.3-3.3,3.6-2.6,6.1c0.6,2.2,2.7,3.8,4.9,3.8c2.6,0,4.6-1.5,5.2-4
		C41,59,43.4,54.2,47,50c1.1-1.3,2.1-2.6,3-3.9c3-4,6.7-7.1,11.1-9.3c2.1-1.1,3.3-2.7,3.1-5.2c-0.2-3.1-2.9-5.3-6.4-4.8
		C56.2,27.2,54.6,28.4,54.1,30.5z"/>
	<path d="M46.4,74c-1.6-2.7-1.6-5.4,0-8.1c5.1-8.5,11.1-16.1,18.1-23.1c2.3-2.3,5.6-3,8.5-1.8c3.2,1.4,5,4.6,4.5,8.1
		c-0.5,3.3-3.1,6-6.6,6.4c-3.3,0.4-6.1,1.8-8.2,4.4c-2.1,2.7-2.9,5.6-2.4,9c0.6,4.3-2.4,8.1-6.6,8.6C50.8,77.8,47.9,76.5,46.4,74z
		 M56.8,69.2c-0.6-4.5,0.6-8.5,3.6-11.9c2.6-3,5.8-4.7,9.7-5.1c1.8-0.2,3.2-1.1,3.8-2.8c0.6-1.8-0.1-3.8-1.8-4.8
		c-1.6-1-3.7-0.8-5,0.7c-5.8,6-11.3,12.2-15.6,19.4c-0.7,1.1-1.5,2.2-2.1,3.4c-0.8,1.4-0.8,2.9,0.1,4.3c0.9,1.4,2.3,2,3.6,1.9
		C55.6,73.7,57.1,71.7,56.8,69.2z"/>
	<path d="M18.9,43.3c1.4-1.7,3.2-2.6,5.3-2.8c3.1-0.4,5.7-1.8,7.7-4.2c2.2-2.7,3-5.8,2.5-9.3c-0.4-3.3,1.4-6.5,4.4-7.8
		c3-1.3,6.6-0.6,8.8,1.9c2.2,2.5,2.5,6.1,0.8,8.9c-5.1,8.6-11.2,16.4-18.3,23.4c-2.2,2.2-4.9,2.8-7.9,1.8c-2.9-1-4.5-3.2-5-6.1
		C17.1,46.8,17.6,44.9,18.9,43.3z M38,26.8c0.6,4.6-0.6,8.6-3.7,12c-2.5,2.9-5.7,4.6-9.5,5c-2,0.2-3.4,1.1-4,3.1
		c-0.5,1.8,0.3,3.7,1.9,4.6c1.6,0.9,3.6,0.7,4.9-0.7c6-6.1,11.5-12.4,15.9-19.8c0.6-1,1.3-2,1.9-3c0.8-1.4,0.8-2.9-0.1-4.3
		c-0.8-1.3-2.4-2-3.9-1.8C39.1,22.3,37.6,24.3,38,26.8z"/>
	<path d="M80.7,68.1c0.4,3.1-1.8,5.8-4.8,6.2c-3.1,0.4-5.9-1.8-6.2-4.8c-0.4-3,1.8-5.8,4.9-6.2C77.6,62.9,80.3,65,80.7,68.1z
		 M77.3,68.5c-0.1-1.1-1.2-1.9-2.3-1.8c-1.1,0.1-2,1.2-1.8,2.3c0.1,1.1,1.2,2,2.3,1.8C76.6,70.7,77.4,69.7,77.3,68.5z"/>
	<path class="st2" d="M58,26.8c-1.7,0.3-3.3,1.5-3.9,3.7c-1.4,6-4.4,11-8.2,15.8c-3.2,4-6.4,7.9-10.8,10.6c-1,0.6-2,1.1-2.9,1.7
		c-2.2,1.3-3.3,3.6-2.6,6.1c0.6,2.2,2.7,3.8,4.9,3.8c2.6,0,4.6-1.5,5.2-4C41,59,43.4,54.2,47,50c1.1-1.3,2.1-2.6,3-3.9
		c3-4,6.7-7.1,11.1-9.3c2.1-1.1,3.3-2.7,3.1-5.2C64.2,28.5,61.5,26.4,58,26.8z"/>
	<path class="st2" d="M53,74c2.7-0.3,4.2-2.4,3.8-4.9c-0.6-4.5,0.6-8.5,3.6-11.9c2.6-3,5.8-4.7,9.7-5.1c1.8-0.2,3.2-1.1,3.8-2.8
		c0.6-1.8-0.1-3.8-1.8-4.8c-1.6-1-3.7-0.8-5,0.7c-5.8,6-11.3,12.2-15.6,19.4c-0.7,1.1-1.5,2.2-2.1,3.4c-0.8,1.4-0.8,2.9,0.1,4.3
		C50.3,73.6,51.6,74.1,53,74z"/>
	<path class="st2" d="M41.5,22c-2.3,0.3-3.8,2.3-3.5,4.8c0.6,4.6-0.6,8.6-3.7,12c-2.5,2.9-5.7,4.6-9.5,5c-2,0.2-3.4,1.1-4,3.1
		c-0.5,1.8,0.3,3.7,1.9,4.6c1.6,0.9,3.6,0.7,4.9-0.7c6-6.1,11.5-12.4,15.9-19.8c0.6-1,1.3-2,1.9-3c0.8-1.4,0.8-2.9-0.1-4.3
		C44.6,22.5,43,21.8,41.5,22z"/>
	<path class="st2" d="M75.4,70.9c1.1-0.1,2-1.2,1.8-2.3c-0.1-1.1-1.2-1.9-2.3-1.8c-1.1,0.1-2,1.2-1.8,2.3
		C73.2,70.2,74.3,71,75.4,70.9z"/>
</g>
<circle class="st3" cx="20" cy="26.7" r="8.1"/>
</svg>
