<?xml version="1.0" encoding="utf-8"?>
<!-- Generator: Adobe Illustrator 24.0.0, SVG Export Plug-In . SVG Version: 6.00 Build 0)  -->
<svg version="1.1" id="Слой_1" xmlns="http://www.w3.org/2000/svg" xmlns:xlink="http://www.w3.org/1999/xlink" x="0px" y="0px"
	 viewBox="0 0 100 100" style="enable-background:new 0 0 100 100;" xml:space="preserve">
<style type="text/css">
	.st0{fill:#62A3D9;stroke:#000000;stroke-width:4.715;stroke-miterlimit:10;}
	.st1{fill:#FFFFFF;stroke:#000000;stroke-width:4.7153;stroke-miterlimit:10;}
	.st2{fill:#FFFFFF;}
</style>
<circle class="st0" cx="46.6" cy="48.4" r="34.3"/>
<circle class="st1" cx="29.5" cy="79" r="8.1"/>
<circle class="st1" cx="20" cy="26.7" r="8.1"/>
<circle class="st1" cx="80.9" cy="46.8" r="8.1"/>
<path d="M49.5,46.3c-2.1,0.3-3.9,0.5-5.5,2.2c-2.5,2.8-5.3,5.4-8,8c-2,1.9-4.9,2.4-7.4,1.2c-2.4-1.2-3.9-3.6-3.8-6.4
	c0.1-1.6,0.7-3.1,1.9-4.3c3.9-3.9,7.7-7.7,11.6-11.6c1.3-1.3,2.9-2,4.8-2c2.5,0,4.6-1,6.3-2.8c3.1-3.4,6.6-6.2,10.5-8.6
	c3.3-2.1,6.6-4.4,9.9-6.6c3.3-2.2,6.4-1.8,9.4,1.1c2.9,2.9,3.3,6.1,1.1,9.4c-3.3,5-6.7,9.9-9.9,14.9c-0.7,1-1.5,1.5-2.7,1.4
	c-0.8-0.1-1.7,0-2.6,0c-3.4,0-3.8-0.1-6.4-2.1c-3,2.5-5,5.6-5.3,9.6c-0.1,1.4-0.5,2.4-1.5,3.4c-3.1,3-6.2,6.1-9.3,9.2
	c-1,1-1.1,2.2-0.4,3.1c0.8,1.1,2.3,1.3,3.3,0.3c3.9-3.8,7.8-7.7,11.6-11.6c0.4-0.4,0.5-1.3,0.7-1.9c0.3-1.4,0.4-2.8,0.8-4.1
	c0.4-1.4,1.7-2,2.8-1.6c1.3,0.4,1.7,1.6,1.3,3.1c-0.3,0.9-0.5,1.9-0.5,2.8c-0.1,2.1-0.8,3.8-2.3,5.2c-3.7,3.6-7.3,7.3-11,11
	c-2.9,2.9-7,2.9-9.7,0.2c-2.6-2.7-2.5-6.8,0.3-9.6c2.8-2.8,5.5-5.6,8.3-8.3c0.7-0.7,1.2-1.3,1.2-2.4C49.1,47.9,49.4,47.1,49.5,46.3z
	 M65,37.8c0,0.1,0,0.2,0,0.3c0.8-0.3,1.9-0.3,2.3-0.8c3.2-4.6,6.3-9.4,9.4-14.1c0.7-1.1,0.6-2-0.3-3c-0.3-0.3-0.6-0.6-0.9-0.9
	c-1.1-1-2-1.1-3.2-0.3c-4.6,3.1-9.3,6.2-13.9,9.3c-0.3,0.2-0.6,0.7-0.6,1.1c-0.4,2.3,0.2,4.3,2.2,5.7c0.4,0.3,0.8,0.7,1.2,1.2
	C62.2,37.6,63.4,38.2,65,37.8z M53.2,33.2c-0.1,0.1-0.2,0.2-0.4,0.3c-2.6,2.8-5.8,4.3-9.7,4.5c-0.7,0-1.4,0.4-1.9,0.9
	c-2.5,2.4-5,4.9-7.5,7.4c-1.3,1.3-2.6,2.5-3.8,3.8c-1.2,1.3-0.7,3.2,0.9,3.7c1,0.3,1.8-0.1,2.5-0.8c3.2-3.2,6.4-6.5,9.7-9.6
	c0.6-0.6,1.5-1,2.3-1c4.2-0.2,7.5-2.2,10.1-5.2C54.7,35.8,54,34.5,53.2,33.2z"/>
<path class="st2" d="M65,37.8c-1.6,0.4-2.8-0.3-3.7-1.5c-0.3-0.4-0.7-0.9-1.2-1.2c-2-1.4-2.6-3.4-2.2-5.7c0.1-0.4,0.3-0.9,0.6-1.1
	c4.6-3.1,9.3-6.2,13.9-9.3c1.2-0.8,2.1-0.7,3.2,0.3c0.3,0.3,0.6,0.6,0.9,0.9c0.9,1,1,1.9,0.3,3c-3.1,4.7-6.2,9.4-9.4,14.1
	c-0.4,0.5-1.5,0.6-2.3,0.8C65,38.1,65,37.9,65,37.8z M70.7,27.4c-0.5-0.6-0.9-1.4-1.5-1.8c-0.8-0.5-1.7-0.3-2.4,0.3
	c-1.1,1-2.1,2.1-3.1,3.1c-1,1-1,2.3-0.1,3.2c0.9,0.9,2.2,0.9,3.2,0c1-1,2-1.9,3-3C70,28.8,70.2,28.2,70.7,27.4z"/>
<path d="M70.7,27.4c-0.4,0.8-0.6,1.4-1,1.8c-0.9,1-1.9,2-3,3c-1,1-2.4,1-3.2,0c-0.9-0.9-0.9-2.2,0.1-3.2c1-1.1,2.1-2.1,3.1-3.1
	c0.7-0.7,1.6-0.9,2.4-0.3C69.7,26.1,70.1,26.8,70.7,27.4z"/>
</svg>
