<?xml version="1.0" encoding="utf-8"?>
<!-- Generator: Adobe Illustrator 24.0.0, SVG Export Plug-In . SVG Version: 6.00 Build 0)  -->
<svg version="1.1" id="Слой_1" xmlns="http://www.w3.org/2000/svg" xmlns:xlink="http://www.w3.org/1999/xlink" x="0px" y="0px"
	 viewBox="0 0 100 100" style="enable-background:new 0 0 100 100;" xml:space="preserve">
<style type="text/css">
	.st0{fill:#FFFFFF;stroke:#000000;stroke-width:4.7153;stroke-miterlimit:10;}
	.st1{fill:#62A3D9;stroke:#000000;stroke-width:4.715;stroke-miterlimit:10;}
	.st2{fill:#FFFFFF;stroke:#000000;stroke-width:4.715;stroke-miterlimit:10;}
	.st3{fill:#FFFFFF;}
</style>
<circle class="st0" cx="80.9" cy="46.8" r="8.1"/>
<path d="M46.6,85.1c-20.2,0-36.7-16.4-36.7-36.7c0-20.2,16.4-36.7,36.7-36.7s36.7,16.4,36.7,36.7C83.3,68.6,66.8,85.1,46.6,85.1z
	 M46.6,16.5c-17.6,0-31.9,14.3-31.9,31.9C14.7,66,29,80.3,46.6,80.3S78.5,66,78.5,48.4S64.2,16.5,46.6,16.5z"/>
<circle class="st1" cx="47.8" cy="48" r="34.3"/>
<image style="overflow:visible;enable-background:new    ;" width="243" height="292" xlink:href="A697232E.jpg"  transform="matrix(0.998 0 0 0.998 -7893.7544 -7770.3149)">
</image>
<circle class="st0" cx="29.5" cy="79" r="8.1"/>
<circle class="st2" cx="20" cy="26.7" r="8.1"/>
<g>
	<path d="M47.6,74c0-1.5,0-2.8,0-4.2c-2.9,0-5.7,0-8.5,0c-0.9,0-1.8-0.1-2.6-0.2c-3.3-0.8-5.7-3.8-5.7-7.1c0-13.7,0-27.4,0-41.1
		c0-4,3.4-7.3,7.4-7.3c16.4,0,32.7,0,49.1,0c4,0,7.3,3.4,7.3,7.4c0,16.7,0,33.5,0,50.2c0,3.4-2.8,6.2-6.2,6.2c-15.4,0-30.9,0-46.3,0
		c-1.3,0-2.2-0.8-2.1-1.9c0-1.1,0.8-1.8,2.2-1.8C43.9,74,45.7,74,47.6,74z M34.5,57.9c10.6,0,21.1,0,31.6,0c0-1.5,0-2.8,0-4.3
		c-0.7,0-1.2,0-1.7,0c-7.6,0-15.2,0-22.8,0c-2.2,0-2.7-0.5-2.7-2.7c0-8.8,0-17.5,0-26.3c0-0.3,0-0.7,0-1c0.2-1.1,0.8-1.6,1.9-1.6
		c1,0,1.6,0.6,1.8,1.6c0.1,0.4,0.1,0.8,0.1,1.2c0,4.5,0,9.1,0,13.6c0,0.4,0,0.8,0.1,1.2c3.1-4.6,5.9-9.2,8.8-13.8
		c1.5-2.5,2.4-2.6,4.5-0.5c2.2,2.2,4.4,4.5,6.7,6.8c2.8-2.8,5.5-5.5,8.2-8.2c2.5-2.5,2.5-2.5,5.5-0.7c2.5,1.4,4.7,3.2,7.9,2.7
		c1.3-0.2,2.2,0.7,2.2,1.8c0,1.1-0.8,1.8-2.2,1.9c-2.6,0.2-5-0.1-7.2-1.7c-0.6-0.5-1.4-0.7-2-1.2c-0.8-0.6-1.3-0.5-2,0.2
		c-2.8,2.9-5.6,5.7-8.4,8.5c-1.6,1.6-2.3,1.6-3.9,0c-2.2-2.2-4.4-4.4-6.6-6.6c-0.3,0.5-0.5,0.8-0.7,1.2c-3.3,5.4-6.6,10.8-10,16.1
		c-0.8,1.2-0.8,2.4-0.6,3.7c7.8,0,15.6,0,23.5,0c0-1.8,0-3.6,0-5.3c0.1-3.6,2.4-6.4,5.9-6.5c6.2-0.1,12.4,0,18.7,0c0,0,0-0.4,0-0.8
		c0-5,0-10.1,0-15.1c0-3-1.5-4.5-4.5-4.5c-15.7,0-31.5,0-47.2,0c-3.1,0-4.6,1.4-4.6,4.6c0,10.6,0,21.3,0,31.9
		C34.5,55.4,34.5,56.6,34.5,57.9z M74.4,41.9c-3-0.7-4.4,0.4-4.4,3.3c0,8.5,0,17,0,25.6C70,73,71,74,73.3,74c4.8,0,9.6,0,14.3,0
		c2.3,0,3.3-0.9,3.3-3.2c0-8.6,0-17.2,0-25.8c0-2.6-1.5-3.8-4.2-3c0,0.9,0,1.8,0,2.7c-0.2,2.7-1.7,4.1-4.3,4.1c-1.2,0-2.4,0-3.6,0
		c-2.6,0-4.1-1.4-4.3-4C74.4,43.8,74.4,42.8,74.4,41.9z M66.2,61.8c-10.6,0-21.1,0-31.6,0c0,2.6,1.5,4.2,4.1,4.2
		c8.8,0,17.7,0,26.5,0c0.3,0,0.6-0.1,1-0.1C66.2,64.5,66.2,63.2,66.2,61.8z M51.5,73.9c5.1,0,10.1,0,15.1,0
		c-0.2-1.4-0.3-2.7-0.5-4.1c-4.9,0-9.8,0-14.7,0C51.5,71.2,51.5,72.5,51.5,73.9z M78.2,44.9c1.6,0,3.1,0,4.6,0c0-1.1,0-2.1,0-3.1
		c-1.6,0-3.1,0-4.6,0C78.2,42.8,78.2,43.8,78.2,44.9z"/>
	<path class="st3" d="M34.5,57.9c0-1.4,0-2.6,0-3.8c0-10.6,0-21.3,0-31.9c0-3.1,1.5-4.6,4.6-4.6c15.7,0,31.5,0,47.2,0
		c3,0,4.5,1.5,4.5,4.5c0,5,0,10.1,0,15.1c0,0.4,0,0.7,0,0.8c-6.3,0-12.5-0.1-18.7,0c-3.5,0.1-5.8,2.9-5.9,6.5c0,1.7,0,3.5,0,5.3
		c-7.9,0-15.7,0-23.5,0c-0.2-1.4-0.1-2.5,0.6-3.7c3.4-5.3,6.7-10.7,10-16.1c0.2-0.4,0.4-0.7,0.7-1.2c2.2,2.2,4.4,4.4,6.6,6.6
		c1.6,1.6,2.3,1.6,3.9,0c2.8-2.8,5.7-5.6,8.4-8.5c0.7-0.7,1.2-0.8,2-0.2c0.6,0.5,1.4,0.7,2,1.2c2.1,1.7,4.6,1.9,7.2,1.7
		c1.4-0.1,2.2-0.7,2.2-1.9c0-1.1-0.8-2-2.2-1.8c-3.2,0.5-5.4-1.4-7.9-2.7c-3.1-1.7-3.1-1.7-5.5,0.7c-2.7,2.7-5.4,5.4-8.2,8.2
		c-2.3-2.3-4.5-4.5-6.7-6.8c-2.1-2.1-2.9-2-4.5,0.5c-2.8,4.6-5.7,9.2-8.8,13.8c0-0.4-0.1-0.8-0.1-1.2c0-4.5,0-9.1,0-13.6
		c0-0.4,0-0.8-0.1-1.2c-0.2-1-0.8-1.6-1.8-1.6c-1.1,0-1.7,0.6-1.9,1.6c-0.1,0.3,0,0.7,0,1c0,8.8,0,17.5,0,26.3
		c0,2.2,0.5,2.7,2.7,2.7c7.6,0,15.2,0,22.8,0c0.5,0,1.1,0,1.7,0c0,1.5,0,2.8,0,4.3C55.7,57.9,45.2,57.9,34.5,57.9z"/>
	<path class="st3" d="M74.4,41.9c0,0.9,0,1.9,0,2.8c0.1,2.6,1.7,4,4.3,4c1.2,0,2.4,0,3.6,0c2.6,0,4.2-1.4,4.3-4.1
		c0.1-0.9,0-1.8,0-2.7c2.7-0.7,4.2,0.4,4.2,3c0,8.6,0,17.2,0,25.8c0,2.3-0.9,3.2-3.3,3.2c-4.8,0-9.6,0-14.3,0C71,74,70,73,70,70.7
		c0-8.5,0-17,0-25.6C70,42.3,71.4,41.2,74.4,41.9z M80.6,65.9C80.6,65.9,80.6,65.9,80.6,65.9c-0.5,0-0.9,0-1.4,0
		c-1,0.1-1.6,0.7-1.7,1.7c-0.1,1,0.4,1.8,1.4,1.9c1.1,0.1,2.2,0.1,3.3,0c1-0.1,1.4-0.9,1.4-1.9c-0.1-0.9-0.6-1.5-1.6-1.6
		C81.6,65.9,81.1,65.9,80.6,65.9z"/>
	<path class="st3" d="M66.2,61.8c0,1.4,0,2.7,0,4.1c-0.3,0-0.7,0.1-1,0.1c-8.8,0-17.7,0-26.5,0c-2.6,0-4.2-1.6-4.1-4.2
		C45.1,61.8,55.6,61.8,66.2,61.8z"/>
	<path class="st3" d="M51.5,73.9c0-1.4,0-2.7,0-4.1c4.9,0,9.8,0,14.7,0c0.2,1.4,0.3,2.7,0.5,4.1C61.6,73.9,56.6,73.9,51.5,73.9z"/>
	<path class="st3" d="M78.2,44.9c0-1.1,0-2,0-3.1c1.6,0,3.1,0,4.6,0c0,1,0,2,0,3.1C81.3,44.9,79.8,44.9,78.2,44.9z"/>
	<path d="M80.6,65.9c0.5,0,1,0,1.5,0c0.9,0.1,1.5,0.7,1.6,1.6c0.1,1-0.4,1.8-1.4,1.9c-1.1,0.2-2.2,0.2-3.3,0c-1-0.1-1.5-0.9-1.4-1.9
		c0.1-1,0.7-1.6,1.7-1.7C79.7,65.9,80.2,65.9,80.6,65.9C80.6,65.9,80.6,65.9,80.6,65.9z"/>
</g>
</svg>
