<?xml version="1.0" encoding="utf-8"?>
<!-- Generator: Adobe Illustrator 24.0.0, SVG Export Plug-In . SVG Version: 6.00 Build 0)  -->
<svg version="1.1" id="Слой_1" xmlns="http://www.w3.org/2000/svg" xmlns:xlink="http://www.w3.org/1999/xlink" x="0px" y="0px"
	 viewBox="0 0 100 100" style="enable-background:new 0 0 100 100;" xml:space="preserve">
<style type="text/css">
	.st0{fill:#62A3D9;stroke:#000000;stroke-width:4.715;stroke-miterlimit:10;}
	.st1{clip-path:url(#SVGID_2_);}
	.st2{fill:#FFFFFF;}
	.st3{fill:#FFFFFF;stroke:#000000;stroke-width:4.715;stroke-miterlimit:10;}
	.st4{fill:#FFFFFF;stroke:#000000;stroke-width:4.7153;stroke-miterlimit:10;}
</style>
<circle class="st0" cx="46.6" cy="48.4" r="34.3"/>
<path d="M46.6,85.1c-20.2,0-36.7-16.4-36.7-36.7c0-20.2,16.4-36.7,36.7-36.7s36.7,16.4,36.7,36.7C83.3,68.6,66.8,85.1,46.6,85.1z
	 M46.6,16.5c-17.6,0-31.9,14.3-31.9,31.9C14.7,66,29,80.3,46.6,80.3S78.5,66,78.5,48.4S64.2,16.5,46.6,16.5z"/>
<image style="overflow:visible;enable-background:new    ;" width="243" height="292" xlink:href="A697232E.jpg"  transform="matrix(0.998 0 0 0.998 -7893.7544 -7770.3149)">
</image>
<g>
	<defs>
		<path id="SVGID_1_" d="M97.8,9.4H-7.4v38.3h22.1c0,0.2,0,0.5,0,0.7C14.7,66,29,80.3,46.6,80.3c17.6,0,31.9-14.3,31.9-31.9
			c0-0.2,0-0.5,0-0.7h19.3V9.4z"/>
	</defs>
	<clipPath id="SVGID_2_">
		<use xlink:href="#SVGID_1_"  style="overflow:visible;"/>
	</clipPath>
	<g class="st1">
		<path d="M22.3,45.3c3.2-1.2,6.4-2.4,9.6-3.5c1.3-0.5,2.8-0.7,4.1-1.1c0.4-0.1,1-0.6,1-1c0.1-2.4,0-4.7,0-6.9
			c-0.9-0.3-1.7-0.5-2.3-0.9c-1.4-1-1.3-2.9,0.1-4c4.3-3.4,8.6-6.7,12.9-10.1c1.2-0.9,2.3-0.7,3.4,0.2c4,3.1,7.9,6.2,11.9,9.2
			c1.1,0.8,2.1,1.7,1.7,3.3c-0.4,1.6-1.6,2-3.1,2c0,2.4,0,4.8,0,7.2c0,0.3,0.4,0.8,0.7,0.9c4.6,1.5,9.3,2.9,14.1,4.4
			c0-0.6,0.1-1.5,0-2.4c-0.1-0.6-0.4-1.3-0.9-1.5c-2.7-1.6-4-4-4-7.2c0-3.2,0-6.4,0-9.7c0-4.5,3.2-7.8,7.4-7.8
			c4.1,0,7.3,3.4,7.4,7.8c0,3.3,0,6.5,0,9.8c0,3.1-1.3,5.4-3.9,6.9c-0.7,0.4-1,0.8-1,1.7c0.1,1.4,0,2.8,0,4.2c0,1.7,1.1,2.7,2.7,2.7
			c1.3,0,2.5-0.1,3.8-0.1c2.5,0,3.3,0.8,3.3,3.4c0,11.6,0,23.3,0,34.9c0,1.6,0,3.2,0,4.7c0,1.9-0.9,2.8-2.7,2.9c-0.4,0-0.9,0-1.3,0
			c-25.2,0-50.4,0-75.6,0c-3.4,0-4-0.6-4-4.1c0-12.8,0-25.5,0-38.3c0-2.8,0.8-3.6,3.5-3.6c1.2,0,2.4,0.1,3.6,0.1
			c1.7,0,2.7-1,2.7-2.7c0-0.5,0-1,0-1.5c0.2-2.2,0.1-4.1-2.3-5.4c-1.9-1.1-2.6-3.4-2.6-5.7c0-3.4,0-6.8,0-10.2
			c0.1-4.3,3.3-7.7,7.4-7.7c4.1,0,7.3,3.3,7.3,7.7c0,3.4,0,6.9,0,10.3c0,2.5-1,4.8-3.1,6c-1.7,1-2,2.2-1.8,3.9
			C22.3,44.7,22.3,45,22.3,45.3z M69.7,90.3c-2.5-7.8-11.3-18-20.6-24.1c-11.1-7.3-23.4-10.9-36.6-11.5c0,3.5,0,6.8,0,10.1
			c0.1,0.1,0.2,0.2,0.3,0.2c0.3,0.1,0.5,0.1,0.8,0.1c14.7,1.9,25,9.9,30.9,24c0.4,1.1,1,1.4,2.1,1.4c7.2,0,14.4,0,21.6,0
			C68.6,90.4,69,90.3,69.7,90.3z M86.2,90.4c0-12,0-23.8,0-35.5c-7.3-0.9-27,4.5-31.8,8.7c0.1,0.1,0.1,0.2,0.2,0.3
			c8.9,6.7,16,15.1,20.3,25.7c0.1,0.4,0.7,0.8,1,0.8C79.3,90.4,82.6,90.4,86.2,90.4z M74.4,50.5c-8.8-7.8-42.6-7.8-50.4,0.3
			c8.7,1.6,16.9,4.6,24.6,9c0.4,0.2,1.2,0.1,1.8-0.2c3.2-1.5,6.3-3.4,9.6-4.6C64.8,53.3,69.7,51.9,74.4,50.5z M39.5,90.3
			c-2.8-10.1-17.1-20.6-27-20.1c0,6.7,0,13.3,0,20.1C21.6,90.3,30.5,90.3,39.5,90.3z M56.7,39.7c0-3.6,0-7,0-10.5
			c0-0.4-0.5-1-0.9-1.3c-1.8-1.5-3.7-2.8-5.5-4.3c-0.7-0.6-1.2-0.7-2,0c-1,0.9-2.1,1.9-3.3,2.5c-2.7,1.5-3.6,3.7-3.2,6.8
			c0.2,2.2,0,4.5,0,6.8c1.8-0.2,3.3-0.3,5-0.4c0-1.2,0-2.2,0-3.3c0-1.8,1-3,2.4-3c1.4,0,2.4,1.1,2.5,3c0,1.1,0,2.2,0,3.3
			C53.5,39.5,55,39.6,56.7,39.7z M22.2,29.3c0-1.6,0-3.3,0-4.9c0-1.7-1-2.8-2.5-2.7c-1.3,0-2.4,1.1-2.4,2.6c0,3.3,0,6.7,0,10
			c0,1.5,1.1,2.7,2.4,2.7c1.4,0,2.4-1.1,2.5-2.8C22.3,32.5,22.2,30.9,22.2,29.3z M76.4,29.2c0,1.6,0,3.3,0,4.9c0,1.7,1,2.8,2.4,2.8
			c1.4,0,2.5-1.1,2.5-2.8c0-3.3,0-6.5,0-9.8c0-1.7-1.1-2.7-2.5-2.7c-1.4,0-2.3,1.1-2.4,2.7C76.4,25.9,76.4,27.6,76.4,29.2z"/>
		<path class="st2" d="M69.7,90.3c-0.6,0-1.1,0.1-1.6,0.1c-7.2,0-14.4,0-21.6,0c-1.1,0-1.6-0.3-2.1-1.4c-5.9-14.1-16.2-22.1-30.9-24
			c-0.3,0-0.5-0.1-0.8-0.1c-0.1,0-0.2-0.1-0.3-0.2c0-3.3,0-6.6,0-10.1c13.2,0.6,25.4,4.2,36.6,11.5C58.4,72.3,67.1,82.5,69.7,90.3z"
			/>
		<path class="st2" d="M86.2,90.4c-3.5,0-6.9,0-10.3,0c-0.4,0-0.9-0.4-1-0.8c-4.3-10.7-11.4-19-20.3-25.7c-0.1-0.1-0.1-0.2-0.2-0.3
			c4.8-4.2,24.5-9.5,31.8-8.7C86.2,66.6,86.2,78.4,86.2,90.4z"/>
		<path class="st2" d="M74.4,50.5c-4.7,1.5-9.6,2.8-14.4,4.6c-3.3,1.2-6.4,3.1-9.6,4.6c-0.5,0.2-1.3,0.4-1.8,0.2
			c-7.7-4.5-15.9-7.4-24.6-9C31.8,42.7,65.6,42.6,74.4,50.5z"/>
		<path class="st2" d="M39.5,90.3c-9.1,0-18,0-27,0c0-6.7,0-13.4,0-20.1C22.4,69.7,36.8,80.2,39.5,90.3z"/>
		<path class="st2" d="M56.7,39.7c-1.7-0.1-3.2-0.3-5-0.4c0-1.1,0-2.2,0-3.3c-0.1-1.8-1-3-2.5-3c-1.4,0-2.4,1.2-2.4,3
			c0,1.1,0,2.1,0,3.3c-1.7,0.2-3.2,0.3-5,0.4c0-2.4,0.2-4.6,0-6.8c-0.3-3.1,0.5-5.3,3.2-6.8c1.2-0.6,2.2-1.6,3.3-2.5
			c0.7-0.6,1.3-0.5,2,0c1.8,1.5,3.7,2.8,5.5,4.3c0.4,0.3,0.9,0.8,0.9,1.3C56.8,32.7,56.7,36.1,56.7,39.7z"/>
		<path class="st2" d="M22.2,29.3c0,1.6,0,3.3,0,4.9c0,1.7-1.1,2.8-2.5,2.8c-1.3,0-2.4-1.1-2.4-2.7c0-3.3,0-6.7,0-10
			c0-1.6,1.1-2.6,2.4-2.6c1.4,0,2.4,1.1,2.5,2.7C22.3,26,22.2,27.6,22.2,29.3z"/>
		<path class="st2" d="M76.4,29.2c0-1.6,0-3.3,0-4.9c0-1.6,1-2.6,2.4-2.7c1.4,0,2.5,1.1,2.5,2.7c0,3.3,0,6.5,0,9.8
			c0,1.7-1.1,2.8-2.5,2.8c-1.4,0-2.4-1.1-2.4-2.8C76.4,32.5,76.4,30.8,76.4,29.2z"/>
	</g>
</g>
<path class="st3" d="M28.1,26.7c0-4.5-3.6-8.1-8.1-8.1s-8.1,3.6-8.1,8.1c0,1.1,0.2,2.2,0.7,3.2c-0.4,1-0.7,2.1-0.7,3.2
	c0,4.5,3.6,8.1,8.1,8.1s8.1-3.6,8.1-8.1c0-1.1-0.2-2.2-0.7-3.2C27.9,28.9,28.1,27.8,28.1,26.7z"/>
<circle class="st4" cx="29.5" cy="79" r="8.1"/>
</svg>
