<?xml version="1.0" encoding="utf-8"?>
<!-- Generator: Adobe Illustrator 24.0.0, SVG Export Plug-In . SVG Version: 6.00 Build 0)  -->
<svg version="1.1" id="Слой_1" xmlns="http://www.w3.org/2000/svg" xmlns:xlink="http://www.w3.org/1999/xlink" x="0px" y="0px"
	 viewBox="0 0 100 100" style="enable-background:new 0 0 100 100;" xml:space="preserve">
<style type="text/css">
	.st0{fill:#62A3D9;stroke:#000000;stroke-width:4.715;stroke-miterlimit:10;}
	.st1{fill:#FFFFFF;stroke:#000000;stroke-width:4.7153;stroke-miterlimit:10;}
	.st2{fill:#FFFFFF;stroke:#000000;stroke-width:4.715;stroke-miterlimit:10;}
	.st3{fill:#98C6E5;}
	.st4{fill:#FFFFFF;}
</style>
<circle class="st0" cx="46.6" cy="48.4" r="34.3"/>
<path d="M46.6,85.1c-20.2,0-36.7-16.4-36.7-36.7c0-20.2,16.4-36.7,36.7-36.7s36.7,16.4,36.7,36.7C83.3,68.6,66.8,85.1,46.6,85.1z
	 M46.6,16.5c-17.6,0-31.9,14.3-31.9,31.9C14.7,66,29,80.3,46.6,80.3S78.5,66,78.5,48.4S64.2,16.5,46.6,16.5z"/>
<circle class="st1" cx="80.9" cy="46.8" r="8.1"/>
<circle class="st1" cx="29.5" cy="79" r="8.1"/>
<circle class="st2" cx="20" cy="26.7" r="8.1"/>
<g>
	<path d="M-334,26.3c2.9,0,5.6,0,8.4,0c0,2.9,0,5.8,0,8.8c1.1-0.1,2-0.2,3-0.4c0.1,0,0.3-0.4,0.3-0.6c0-1,0-2.1,0-3.1
		c0-0.4,0.3-0.8,0.5-1c2-1.4,4.6-1.4,6.5,0c0.3,0.2,0.5,0.6,0.5,1c0.1,1.1,0,2.1,0,3.2c0,0.2,0.2,0.5,0.4,0.6
		c0.9,0.2,1.9,0.2,2.9,0.4c0-2.9,0-5.8,0-8.8c2.8,0,5.6,0,8.5,0c0,0.3,0,0.6,0,0.9c0,8.2,0,16.4,0,24.6c0,0.5,0.1,0.9,0.5,1.3
		c1.4,1.3,2.7,2.7,4,4c0.2,0.2,0.4,0.5,0.4,0.8c0,3.1,0,6.2,0,9.4c-13.7,0-27.3,0-41.1,0c0-0.2,0-0.4,0-0.7c0-2.8,0-5.6,0-8.4
		c0-0.4,0.2-0.8,0.5-1.1c1.2-1.3,2.5-2.6,3.8-3.8c0.5-0.5,0.7-1,0.7-1.7c0-8.1,0-16.2,0-24.2C-334,27-334,26.7-334,26.3z
		 M-305.3,39.2c-0.1-0.1-0.1-0.1-0.2-0.1c-8.5-2.8-17.1-2.8-25.7-0.1c-0.2,0.1-0.4,0.4-0.4,0.7c0,2.1,0,4.2,0,6.3
		c0,2.4,1.6,4.5,3.9,4.8c1.7,0.3,3.4,0.1,5.2,0.1c0-1.4,0-2.7,0-4.2c2.7,0,5.2,0,7.9,0c0,1.4,0,2.8,0,4.3c1.5,0,2.8,0,4.1,0
		c2.7,0,4.9-2.1,5-4.8C-305.2,43.9-305.3,41.5-305.3,39.2z M-331.6,64.9c8.8,0,17.5,0,26.2,0c0-4.5,0-8.9,0-13.5
		c-2.7,2.6-6,1.8-9.1,2c0,1.8,0,3.5,0,5.2c0,0.3,0,0.7-0.2,0.8c-1.2,1.3-2.5,2.5-3.8,3.8c-0.9-1-1.8-1.9-2.7-2.7
		c-1-0.8-1.3-1.7-1.2-3c0.1-1.4,0-2.8,0-4.2c-3.2-0.1-6.5,0.6-9.2-2C-331.6,56.1-331.6,60.4-331.6,64.9z M-331.6,36.6
		c1.1-0.3,2.2-0.6,3.3-0.9c0.1,0,0.3-0.3,0.3-0.4c0-2.2,0-4.4,0-6.6c-1.2,0-2.4,0-3.6,0C-331.6,31.3-331.6,33.9-331.6,36.6z
		 M-308.9,28.7c0,2.2,0,4.4,0,6.5c0,0.2,0.2,0.4,0.3,0.5c1.1,0.3,2.1,0.6,3.3,0.9c0-2.7,0-5.2,0-7.9
		C-306.5,28.7-307.7,28.7-308.9,28.7z M-334.1,56.1c-0.2,0.2-0.3,0.3-0.5,0.4c-1.7,1.2-2.4,2.8-2.1,4.9c0.2,1.1,0,2.3,0,3.5
		c0.9,0,1.7,0,2.5,0C-334.1,62-334.1,59.1-334.1,56.1z M-300.3,64.9c0-2.1,0-4.1,0-6.1c0-0.1-0.1-0.3-0.2-0.4
		c-0.7-0.8-1.5-1.6-2.4-2.5c0,3.2,0,6.1,0,9C-302,64.9-301.2,64.9-300.3,64.9z M-320,53.5c0,1.2,0.1,2.4,0,3.6
		c-0.2,1.4,0.8,2,1.6,2.7c1.3-0.8,1.8-1.8,1.6-3.3c-0.1-1,0-2.1,0-3.1C-318,53.5-318.9,53.5-320,53.5z M-319.8,34.4c1,0,1.8,0,2.7,0
		c0-0.6,0-1.1,0-1.6c0-1.2-0.2-1.5-1.5-1.4c-0.3,0-0.6,0-0.9,0.2c-0.2,0.1-0.4,0.3-0.4,0.5C-319.8,32.8-319.8,33.6-319.8,34.4z
		 M-316.9,49.2c-1.1,0-2,0-3,0c0,0.6,0,1.2,0,1.8c1,0,2,0,3,0C-316.9,50.3-316.9,49.8-316.9,49.2z"/>
	<path class="st3" d="M-305.3,39.2c0,2.4,0.1,4.7,0,7.1c-0.1,2.7-2.3,4.7-5,4.8c-1.3,0-2.7,0-4.1,0c0-1.4,0-2.8,0-4.3
		c-2.7,0-5.3,0-7.9,0c0,1.4,0,2.8,0,4.2c-1.8,0-3.6,0.2-5.2-0.1c-2.3-0.4-3.9-2.5-3.9-4.8c0-2.1,0-4.2,0-6.3c0-0.2,0.2-0.6,0.4-0.7
		c8.6-2.7,17.1-2.7,25.7,0.1C-305.4,39.1-305.4,39.1-305.3,39.2z M-314.6,40.3c-2.6,0-5.1,0-7.6,0c0,0.8,0,1.6,0,2.3
		c2.6,0,5.1,0,7.6,0C-314.6,41.8-314.6,41.1-314.6,40.3z"/>
	<path class="st3" d="M-331.6,64.9c0-4.5,0-8.9,0-13.5c2.7,2.6,5.9,1.9,9.2,2c0,1.4,0.1,2.8,0,4.2c-0.1,1.3,0.3,2.2,1.2,3
		c1,0.8,1.8,1.8,2.7,2.7c1.3-1.3,2.6-2.6,3.8-3.8c0.2-0.2,0.2-0.5,0.2-0.8c0-1.7,0-3.4,0-5.2c3.1-0.2,6.4,0.6,9.1-2
		c0,4.6,0,9,0,13.5C-314.1,64.9-322.8,64.9-331.6,64.9z"/>
	<path class="st4" d="M-331.6,36.6c0-2.7,0-5.2,0-7.9c1.2,0,2.4,0,3.6,0c0,2.2,0,4.4,0,6.6c0,0.1-0.2,0.4-0.3,0.4
		C-329.3,36-330.4,36.3-331.6,36.6z"/>
	<path class="st4" d="M-308.9,28.7c1.3,0,2.4,0,3.6,0c0,2.6,0,5.2,0,7.9c-1.1-0.3-2.2-0.6-3.3-0.9c-0.1,0-0.3-0.3-0.3-0.5
		C-308.9,33.1-308.9,30.9-308.9,28.7z"/>
	<path class="st4" d="M-334.1,56.1c0,3,0,5.9,0,8.8c-0.8,0-1.6,0-2.5,0c0-1.1,0.1-2.3,0-3.5c-0.3-2.1,0.4-3.7,2.1-4.9
		C-334.4,56.4-334.3,56.3-334.1,56.1z"/>
	<path class="st4" d="M-300.3,64.9c-0.9,0-1.7,0-2.5,0c0-2.9,0-5.8,0-9c0.9,0.9,1.6,1.7,2.4,2.5c0.1,0.1,0.2,0.3,0.2,0.4
		C-300.3,60.9-300.3,62.9-300.3,64.9z"/>
	<path class="st4" d="M-320,53.5c1.1,0,2,0,3.1,0c0,1-0.1,2.1,0,3.1c0.2,1.4-0.3,2.5-1.6,3.3c-0.8-0.7-1.7-1.3-1.6-2.7
		C-319.9,55.9-320,54.7-320,53.5z"/>
	<path class="st4" d="M-319.8,34.4c0-0.8,0-1.6,0-2.4c0-0.2,0.2-0.4,0.4-0.5c0.3-0.1,0.6-0.1,0.9-0.2c1.2-0.1,1.5,0.2,1.5,1.4
		c0,0.5,0,1.1,0,1.6C-318,34.4-318.9,34.4-319.8,34.4z"/>
	<path class="st4" d="M-316.9,49.2c0,0.6,0,1.1,0,1.8c-1,0-2,0-3,0c0-0.6,0-1.1,0-1.8C-319,49.2-318,49.2-316.9,49.2z"/>
	<path d="M-314.6,40.3c0,0.8,0,1.5,0,2.3c-2.5,0-5.1,0-7.6,0c0-0.8,0-1.5,0-2.3C-319.7,40.3-317.2,40.3-314.6,40.3z"/>
</g>
<g>
	<path d="M-262.3,48.7c0.8,0.1,1.4,0.1,1.9,0.4c1.6,0.6,2.4,1.8,2.5,3.4c0.1,2.6,0.1,5.2,0,7.8c-0.1,2.2-1.7,3.7-3.9,3.7
		c-0.7,0-1.2,0.1-1.7,0.8c-1,1.4-2.5,2.1-4.2,2.1c-4.8,0-9.5,0-14.3,0c-1.8,0-3.3-0.8-4.3-2.2c-0.4-0.5-0.8-0.7-1.4-0.6
		c-1.2,0.1-2.2-0.3-3.1-1.1c-0.7-0.7-1-1.7-1-2.7c0-2.5,0-4.9,0-7.4c0-2.3,1.5-3.8,3.9-3.9c0.1,0,0.2,0,0.5,0c0-2.8,0-5.7,0-8.6
		c-0.9,0-2,0-3.1,0c0-3.4,0-6.8,0-10.2c10.4,0,20.7,0,31.1,0c0,3.4,0,6.7,0,10.1c-1.1,0-2.1,0-3.1,0
		C-262.3,43.1-262.3,45.9-262.3,48.7z M-264.4,52.1c0-0.3,0-0.5,0-0.7c0-3.1,0-6.1,0-9.2c0-2.3-1.3-3.6-3.5-3.6c-4.5,0-9.1,0-13.6,0
		c-2.3,0-3.5,1.3-3.6,3.6c0,3.1,0,6.1,0,9.2c0,0.2,0,0.5,0,0.7c1,0,2,0,3.1,0c0-1.4,0-2.8,0-4.2c0.8,0,1.4,0,2.2,0
		c0,1.4,0,2.8,0,4.2c3.4,0,6.7,0,10.1,0c0-1.4,0-2.8,0-4.2c0.8,0,1.4,0,2.2,0c0,1.4,0,2.8,0,4.3C-266.5,52.1-265.5,52.1-264.4,52.1z
		 M-279.8,54.3c0,3.5,0,6.9,0,10.3c3.4,0,6.7,0,10,0c0-3.4,0-6.8,0-10.3C-273.1,54.3-276.4,54.3-279.8,54.3z M-269.4,32.2
		c-3.7,0-7.2,0-10.8,0c0,1.4,0,2.8,0,4.1c3.6,0,7.2,0,10.8,0C-269.4,34.9-269.4,33.6-269.4,32.2z M-282.4,32.2c-2,0-3.9,0-5.8,0
		c0,1.9,0,3.8,0,5.8c0.6,0,1.2,0,1.8,0c0.3,0,0.6,0,0.8-0.2c0.9-0.8,2-1.3,3.2-1.4C-282.4,35-282.4,33.6-282.4,32.2z M-261.4,32.2
		c-2,0-3.9,0-5.8,0c0,1.4,0,2.8,0,4.2c1.2,0.2,2.3,0.6,3.2,1.4c0.1,0.1,0.2,0.2,0.4,0.2c0.7,0,1.5,0,2.2,0
		C-261.4,36-261.4,34.1-261.4,32.2z M-285.1,54.3c0,2.5-0.1,5,0,7.5c0,1.6,1.6,2.9,3,2.8c0-3.4,0-6.8,0-10.2
		C-283.1,54.3-284.1,54.3-285.1,54.3z M-267.5,64.6c1.7-0.1,3.1-1.4,3.1-3.1c0-2.3,0-4.5,0-6.8c0-0.1,0-0.2-0.1-0.3c-1,0-2,0-3,0
		C-267.5,57.7-267.5,61.1-267.5,64.6z M-287.3,51c-1.5-0.1-2.2,0.4-2.2,1.8c0,2.4,0,4.7,0,7.1c0,1.4,0.8,2,2.2,1.7
		C-287.3,58.1-287.3,54.6-287.3,51z M-262.2,61.7c1.4,0.1,2.2-0.4,2.2-1.7c0-2.4,0-4.9,0-7.3c0-1.3-0.9-1.9-2.2-1.6
		C-262.2,54.6-262.2,58.1-262.2,61.7z"/>
	<path class="st4" d="M-264.4,52.1c-1.1,0-2.1,0-3.1,0c0-1.4,0-2.8,0-4.3c-0.7,0-1.4,0-2.2,0c0,1.4,0,2.8,0,4.2c-3.4,0-6.7,0-10.1,0
		c0-1.4,0-2.8,0-4.2c-0.8,0-1.4,0-2.2,0c0,1.4,0,2.8,0,4.2c-1.1,0-2.1,0-3.1,0c0-0.2,0-0.5,0-0.7c0-3.1,0-6.1,0-9.2
		c0-2.3,1.3-3.6,3.6-3.6c4.5,0,9.1,0,13.6,0c2.2,0,3.5,1.3,3.5,3.6c0,3.1,0,6.1,0,9.2C-264.4,51.6-264.4,51.8-264.4,52.1z
		 M-278.5,44.4c0,2.1,1.7,3.8,3.7,3.8c2.1,0,3.7-1.7,3.8-3.7c0-2.1-1.6-3.8-3.7-3.8C-276.9,40.7-278.5,42.4-278.5,44.4z"/>
	<path class="st3" d="M-279.8,54.3c3.4,0,6.7,0,10,0c0,3.4,0,6.8,0,10.3c-3.3,0-6.7,0-10,0C-279.8,61.2-279.8,57.8-279.8,54.3z"/>
	<path class="st3" d="M-269.4,32.2c0,1.4,0,2.7,0,4.1c-3.6,0-7.2,0-10.8,0c0-1.4,0-2.7,0-4.1C-276.6,32.2-273,32.2-269.4,32.2z"/>
	<path class="st3" d="M-282.4,32.2c0,1.4,0,2.8,0,4.2c-1.2,0.2-2.3,0.6-3.2,1.4c-0.2,0.2-0.5,0.2-0.8,0.2c-0.6,0-1.2,0-1.8,0
		c0-2,0-3.9,0-5.8C-286.3,32.2-284.4,32.2-282.4,32.2z"/>
	<path class="st3" d="M-261.4,32.2c0,1.9,0,3.8,0,5.8c-0.8,0-1.5,0-2.2,0c-0.1,0-0.3-0.1-0.4-0.2c-0.9-0.8-2-1.3-3.2-1.4
		c0-1.4,0-2.8,0-4.2C-265.2,32.2-263.3,32.2-261.4,32.2z"/>
	<path class="st3" d="M-285.1,54.3c1.1,0,2,0,3.1,0c0,3.4,0,6.8,0,10.2c-1.4,0.1-3-1.2-3-2.8C-285.2,59.3-285.1,56.8-285.1,54.3z"/>
	<path class="st3" d="M-267.5,64.6c0-3.4,0-6.8,0-10.3c1,0,2,0,3,0c0,0.1,0.1,0.2,0.1,0.3c0,2.3,0,4.5,0,6.8
		C-264.5,63.2-265.8,64.5-267.5,64.6z"/>
	<path class="st4" d="M-287.3,51c0,3.6,0,7.1,0,10.6c-1.4,0.3-2.2-0.4-2.2-1.7c0-2.4,0-4.7,0-7.1C-289.5,51.4-288.8,50.9-287.3,51z"
		/>
	<path class="st4" d="M-262.2,61.7c0-3.6,0-7.1,0-10.6c1.3-0.3,2.2,0.3,2.2,1.6c0,2.4,0,4.9,0,7.3
		C-260.1,61.3-260.8,61.8-262.2,61.7z"/>
	<path d="M-278.5,44.4c0-2.1,1.7-3.7,3.8-3.7c2.1,0,3.8,1.7,3.7,3.8c0,2.1-1.7,3.7-3.8,3.7C-276.9,48.2-278.5,46.5-278.5,44.4z
		 M-274.8,42.9c-0.9,0-1.6,0.7-1.6,1.6c0,0.9,0.7,1.7,1.6,1.6c0.9,0,1.6-0.7,1.6-1.6C-273.2,43.6-273.9,42.9-274.8,42.9z"/>
	<path class="st4" d="M-274.8,42.9c0.9,0,1.6,0.7,1.6,1.6c0,0.9-0.7,1.6-1.6,1.6c-0.9,0-1.6-0.7-1.6-1.6
		C-276.4,43.5-275.7,42.9-274.8,42.9z"/>
</g>
<g>
	<path d="M48.9,25.4c3.1,0,6.2,0,9.4,0c0-6.3,0-12.5,0-18.8c5.1,0,10,0,15.1,0c0,6.2,0,12.5,0,18.7c3.2,0,6.3,0,9.4,0
		c0.1-0.7,0.2-1.3,0.4-2c1-3.5,4.5-5.9,8-5.5c3.9,0.5,6.8,3.6,6.8,7.4c0,12.7,0,25.5,0,38.2c0,4-3.3,7.4-7.4,7.4
		c-16.5,0-33,0-49.5,0c-4.2,0-7.4-3.4-7.4-7.7c0-12.4,0-24.9,0-37.3c0-4.5,2.9-7.6,7.2-7.9c4.1-0.3,7.3,2.6,7.9,7
		C48.8,25.1,48.8,25.2,48.9,25.4z M73.4,29.3c0,0.5,0,1,0,1.4c0,5,0,10,0,15c0,0.6-0.1,1.3-0.4,1.8c-2.2,4.8-4.4,9.7-6.6,14.5
		c-0.1,0.3-0.3,0.6-0.6,1.1c-2.4-5.3-4.7-10.3-7-15.4c-0.3-0.6-0.4-1.4-0.5-2c0-5,0-10,0-15c0-0.4,0-0.9,0-1.4c-3.2,0-6.3,0-9.5,0
		c0,11.4,0,22.6,0,33.9c-1.3,0-2.5,0-3.7,0c-0.1-0.3-0.1-0.6-0.2-0.9c-0.5-1.9-2.1-3-4.1-2.8c-1.9,0.2-3.3,1.7-3.4,3.6
		c-0.1,1.8,1.2,3.4,3,3.8c0.5,0.1,1,0.1,1.5,0.1c15.9,0,31.7,0,47.6,0c0.5,0,1,0,1.5-0.1c2-0.4,3.4-2.2,3.1-4.2
		c-0.3-2.1-2.1-3.5-4.2-3.2c-2.1,0.3-3,1.7-3.4,3.6c-1.2,0-2.4,0-3.7,0c0-11.3,0-22.6,0-33.9C79.7,29.3,76.6,29.3,73.4,29.3z
		 M94.2,56.6c0-6.6,0-13,0-19.4c0-3.8,0-7.6,0-11.4c0-2-1-3.4-2.6-3.8c-2.6-0.8-4.9,1-4.9,3.8c0,10,0,20.1,0,30.1
		c0,0.2,0,0.5,0.1,0.7C90.8,55.6,90.8,55.6,94.2,56.6z M45,56.6c0-0.6,0-1,0-1.5c0-6.5,0-13.1,0-19.6c0-3.3,0-6.6,0-9.9
		c0-1.9-1-3.3-2.7-3.7c-2.7-0.7-4.8,1.1-4.8,4.1c0,9.9,0,19.8,0,29.8c0,0.3,0,0.6,0,0.9C41.6,55.6,41.6,55.6,45,56.6z M62.1,44.3
		c2.5,0,5,0,7.4,0c0-8.8,0-17.6,0-26.4c-2.5,0-4.9,0-7.4,0C62.1,26.8,62.1,35.5,62.1,44.3z M62.1,14c2.5,0,5,0,7.4,0
		c0-1.3,0-2.5,0-3.6c-2.5,0-4.9,0-7.4,0C62.1,11.6,62.1,12.8,62.1,14z M65.8,54.1c1-2.1,1.8-3.9,2.7-5.8c-1.9,0-3.5,0-5.3,0
		C64.1,50.2,64.9,52,65.8,54.1z"/>
	<path class="st4" d="M73.4,29.3c3.2,0,6.3,0,9.5,0c0,11.3,0,22.6,0,33.9c1.3,0,2.5,0,3.7,0c0.3-1.9,1.3-3.4,3.4-3.6
		c2.1-0.3,3.9,1.1,4.2,3.2c0.3,2-1,3.8-3.1,4.2c-0.5,0.1-1,0.1-1.5,0.1c-15.9,0-31.7,0-47.6,0c-0.5,0-1,0-1.5-0.1
		c-1.8-0.4-3.1-2-3-3.8c0.1-1.9,1.5-3.4,3.4-3.6c2-0.2,3.5,0.9,4.1,2.8c0.1,0.3,0.1,0.6,0.2,0.9c1.2,0,2.3,0,3.7,0
		c0-11.3,0-22.6,0-33.9c3.2,0,6.3,0,9.5,0c0,0.5,0,0.9,0,1.4c0,5,0,10,0,15c0,0.7,0.2,1.4,0.5,2c2.3,5.1,4.6,10.1,7,15.4
		c0.3-0.5,0.4-0.8,0.6-1.1c2.2-4.8,4.5-9.6,6.6-14.5c0.2-0.5,0.4-1.2,0.4-1.8c0-5,0-10,0-15C73.4,30.3,73.4,29.9,73.4,29.3z"/>
	<path class="st4" d="M94.2,56.6c-3.5-1-3.5-1-7.5-0.1c0-0.2-0.1-0.5-0.1-0.7c0-10,0-20.1,0-30.1c0-2.8,2.3-4.5,4.9-3.8
		c1.6,0.5,2.6,1.9,2.6,3.8c0,3.8,0,7.6,0,11.4C94.2,43.6,94.2,50,94.2,56.6z"/>
	<path class="st4" d="M45,56.6c-3.4-1-3.4-1-7.5,0c0-0.3,0-0.6,0-0.9c0-9.9,0-19.8,0-29.8c0-3,2.1-4.7,4.8-4.1
		c1.7,0.4,2.7,1.8,2.7,3.7c0,3.3,0,6.6,0,9.9c0,6.5,0,13.1,0,19.6C45,55.6,45,56,45,56.6z"/>
	<path class="st3" d="M62.1,44.3c0-8.8,0-17.6,0-26.4c2.5,0,4.9,0,7.4,0c0,8.8,0,17.5,0,26.4C67.1,44.3,64.6,44.3,62.1,44.3z"/>
	<path class="st4" d="M62.1,14c0-1.2,0-2.4,0-3.6c2.5,0,4.9,0,7.4,0c0,1.2,0,2.3,0,3.6C67.1,14,64.7,14,62.1,14z"/>
	<path class="st4" d="M65.8,54.1c-1-2.1-1.8-3.9-2.7-5.8c1.8,0,3.5,0,5.3,0C67.6,50.2,66.8,52,65.8,54.1z"/>
</g>
</svg>
