<?xml version="1.0" encoding="utf-8"?>
<!-- Generator: Adobe Illustrator 24.0.0, SVG Export Plug-In . SVG Version: 6.00 Build 0)  -->
<svg version="1.1" id="Слой_1" xmlns="http://www.w3.org/2000/svg" xmlns:xlink="http://www.w3.org/1999/xlink" x="0px" y="0px"
	 viewBox="0 0 100 100" style="enable-background:new 0 0 100 100;" xml:space="preserve">
<style type="text/css">
	.st0{fill:#62A3D9;stroke:#000000;stroke-width:4.715;stroke-miterlimit:10;}
	.st1{fill:#FFFFFF;}
	.st2{fill:#FFFFFF;stroke:#000000;stroke-width:4.7153;stroke-miterlimit:10;}
	.st3{fill:#FFFFFF;stroke:#000000;stroke-width:4.715;stroke-miterlimit:10;}
</style>
<circle class="st0" cx="46.6" cy="48.4" r="34.3"/>
<g>
	<path class="st1" d="M57.9,85.1c0,2.1,0,3.9,0,5.8c0,1.3-1.7,2.9-2.9,2.9c-5.6,0-11.2,0-16.8,0c-1.2,0-2.9-1.7-2.9-2.9
		c0-1.9,0-3.8,0-5.8C42.8,85.1,50.2,85.1,57.9,85.1z"/>
</g>
<path d="M46.6,85.1c-20.2,0-36.7-16.4-36.7-36.7c0-20.2,16.4-36.7,36.7-36.7s36.7,16.4,36.7,36.7C83.3,68.6,66.8,85.1,46.6,85.1z
	 M46.6,16.5c-17.6,0-31.9,14.3-31.9,31.9C14.7,66,29,80.3,46.6,80.3S78.5,66,78.5,48.4S64.2,16.5,46.6,16.5z"/>
<circle class="st2" cx="80.9" cy="46.8" r="8.1"/>
<circle class="st3" cx="20" cy="26.7" r="8.1"/>
<circle class="st2" cx="29.5" cy="79" r="8.1"/>
<image style="overflow:visible;" width="243" height="291" xlink:href="786C2655.jpg"  transform="matrix(1 0 0 1 -7894 -7770.1104)">
</image>
<g>
	<path d="M89.4,53.4c0,2.4,0.2,5,0,7.5c-0.5,5.4-2.8,10.1-6.8,13.9c-4,3.7-8.1,7.3-12.2,10.9c-0.3,0.3-0.9,0.5-1.3,0.5
		c-4,0-8.1,0-12.1,0c-0.5,0-1.2-0.2-1.6-0.6c-3.8-3.3-7.6-6.6-11.3-10c-5.2-4.7-7.7-10.6-7.8-17.6c0-1.5,0-3,0-4.6
		c-2.8-0.6-5.1-1.9-6.7-4.3c-1.5-2.2-1.6-4.8-1.5-7.3c0.2-4.3,3-7.5,8-8.9c0.3-1.5,0.4-3,0.8-4.4c2-7.1,8.4-12,15.8-12
		c6.6,0,13.2,0,19.9,0c9.2,0,16.1,6.4,16.9,15.6c0,0.3,0.1,0.5,0.1,0.8c6.3,2.2,8.3,4.9,8.1,11.3C97.7,48.6,95,51.7,89.4,53.4z
		 M74.4,76.5c-0.5-0.4-0.9-0.6-1.2-0.9C65.8,70.1,61.6,62.7,61,53.5c-0.3-3.9-0.1-7.8-0.2-11.7c0-0.5-0.4-1.2-0.7-1.3
		c-3.5-1.5-5.3-4.1-5.3-7.8c0-3.7,1.9-6.2,5.3-7.7c0.3-0.1,0.7-0.6,0.7-0.9c0.1-1.2,0-2.3,0-3.7c-2.8,0-5.5,0-8.1,0
		c-6.8,0.1-12.3,5.5-12.3,12.3c-0.1,8.6-0.1,17.1,0,25.7c0.1,5.4,2.2,10,6.1,13.6c3.4,3.1,6.9,6.2,10.4,9.2c0.4,0.3,1,0.6,1.5,0.6
		c3,0.1,6,0,9,0c0.5,0,1-0.2,1.3-0.4C70.7,79.9,72.5,78.3,74.4,76.5z M81.4,24.1c0,4.9,0,9.8,0,14.8c-0.8,0-1.5-0.2-2.1,0
		c-0.7,0.3-1.5,0.8-1.9,1.5c-0.5,0.9,0.5,1.1,1,1.4c3.2,2,4.1,6.7,1.3,9.2c-1.8,1.6-2.4,3.3-2.9,5.4c-1.1,4.3-4.3,6.5-8.7,7
		c0,0.2,0,0.3,0.1,0.4c2.1,3.8,5.1,6.9,8.8,9.2c0.3,0.2,1,0.1,1.2-0.2c4.5-3.7,7.1-8.5,7.2-14.4c0.2-8.7,0.1-17.4,0-26.1
		C85.5,29.2,84.1,26.3,81.4,24.1z M65,20.7c0,0.9,0,1.9,0,2.9c-0.1,0.8,0.2,1.2,1.1,1.6c3.3,1.4,5,4,5,7.5c0.1,3.4-1.8,6.3-5.1,7.6
		c-0.8,0.3-1,0.7-1,1.5c0,3.3-0.1,6.6,0.1,9.9c0.1,2.2,0.5,4.5,0.9,6.7c0.1,0.4,0.5,0.9,0.9,0.9c3.4,0.4,6.2-1.9,6.3-5.3
		c0-0.7-0.1-1.1-0.8-1.5c-2.2-1.1-3.2-3-3.2-5.4c0-2.4,1.1-4.2,3.2-5.5c0.4-0.2,0.8-0.8,0.9-1.3c0.3-2.1,1.3-3.8,3.2-4.8
		c0.7-0.4,0.9-0.8,0.9-1.6c0-3.8-0.1-7.5,0-11.3c0-1.4-0.5-2-1.7-2C72.2,20.7,68.7,20.7,65,20.7z M62.9,36.8c2.4,0,4.1-1.7,4.1-4.1
		c0-2.2-1.9-4.1-4.1-4c-2.2,0-4.1,1.9-4,4.1C58.9,35.1,60.6,36.8,62.9,36.8z M36.2,37.1c-2.9,0.6-4.3,2.9-4,7c0.2,2.4,1.9,4.5,4,4.7
		C36.2,44.9,36.2,41,36.2,37.1z M89.7,48.9c3-0.8,4.2-2.9,4-6.8c-0.1-2.5-1.7-4.5-4-4.9C89.7,41,89.7,44.9,89.7,48.9z M75.2,45.1
		c-1.1,0-2,0.8-2,2c0,1.2,0.9,2.1,2,2c1.1,0,2-0.9,2-2C77.3,46,76.4,45.1,75.2,45.1z"/>
	<path class="st1" d="M74.4,76.5c-2,1.7-3.8,3.4-5.6,5c-0.3,0.3-0.9,0.4-1.3,0.4c-3,0-6,0-9,0c-0.5,0-1.2-0.3-1.5-0.6
		c-3.5-3-7-6.1-10.4-9.2c-4-3.7-6.1-8.3-6.1-13.6c-0.1-8.6-0.1-17.1,0-25.7c0.1-6.8,5.6-12.2,12.3-12.3c2.7,0,5.3,0,8.1,0
		c0,1.3,0.1,2.5,0,3.7c0,0.3-0.4,0.8-0.7,0.9c-3.4,1.4-5.3,4-5.3,7.7c0,3.7,1.8,6.3,5.3,7.8c0.4,0.2,0.7,0.9,0.7,1.3
		c0.1,3.9-0.1,7.8,0.2,11.7c0.6,9.2,4.8,16.6,12.2,22.1C73.6,75.9,73.9,76.2,74.4,76.5z M50.6,47c0-1.4,0-2.7,0-3.9
		c-1.4,0-2.6,0-3.9,0c0,1.4,0,2.6,0,3.9C48,47,49.3,47,50.6,47z"/>
	<path class="st1" d="M81.4,24.1c2.8,2.2,4.1,5.1,4.1,8.4c0.1,8.7,0.1,17.4,0,26.1c-0.1,5.8-2.7,10.6-7.2,14.4
		c-0.3,0.2-1,0.4-1.2,0.2c-3.7-2.3-6.7-5.4-8.8-9.2c-0.1-0.1,0-0.3-0.1-0.4c4.4-0.5,7.6-2.7,8.7-7c0.5-2.1,1.1-3.8,2.9-5.4
		c2.8-2.5,1.9-7.3-1.3-9.2c-0.5-0.3-1.5-0.5-1-1.4c0.4-0.6,1.1-1.2,1.9-1.5c0.6-0.2,1.3,0,2.1,0C81.4,33.9,81.4,29,81.4,24.1z"/>
	<path class="st1" d="M65,20.7c3.7,0,7.2,0,10.6,0c1.2,0,1.8,0.6,1.7,2c-0.1,3.8-0.1,7.5,0,11.3c0,0.8-0.2,1.2-0.9,1.6
		c-1.9,1-2.9,2.6-3.2,4.8c-0.1,0.5-0.5,1-0.9,1.3c-2.1,1.3-3.2,3-3.2,5.5c0,2.4,1.1,4.3,3.2,5.4c0.7,0.4,0.9,0.8,0.8,1.5
		c-0.2,3.4-3,5.8-6.3,5.3c-0.3,0-0.8-0.5-0.9-0.9c-0.4-2.2-0.8-4.5-0.9-6.7c-0.2-3.3,0-6.6-0.1-9.9c0-0.8,0.2-1.2,1-1.5
		c3.3-1.3,5.2-4.2,5.1-7.6c-0.1-3.5-1.7-6.1-5-7.5c-0.8-0.3-1.1-0.7-1.1-1.6C65.1,22.6,65,21.6,65,20.7z"/>
	<path class="st1" d="M62.9,36.8c-2.3,0-4-1.7-4-4c0-2.2,1.8-4.1,4-4.1c2.2,0,4.1,1.8,4.1,4C67.1,35.1,65.3,36.8,62.9,36.8z"/>
	<path class="st1" d="M36.2,37.1c0,3.9,0,7.8,0,11.6c-2.1-0.2-3.9-2.2-4-4.7C32,40.1,33.3,37.7,36.2,37.1z"/>
	<path class="st1" d="M89.7,48.9c0-4,0-7.9,0-11.8c2.3,0.4,3.9,2.4,4,4.9C93.9,46.1,92.7,48.1,89.7,48.9z"/>
	<path class="st1" d="M75.2,45.1c1.2,0,2.1,0.9,2.1,2c0,1.1-0.9,2-2,2c-1.2,0-2.1-0.9-2-2C73.3,45.9,74.1,45.1,75.2,45.1z"/>
	<path d="M50.6,47c-1.3,0-2.6,0-3.9,0c0-1.3,0-2.6,0-3.9c1.3,0,2.6,0,3.9,0C50.6,44.4,50.6,45.6,50.6,47z"/>
</g>
</svg>
