<?xml version="1.0" encoding="utf-8"?>
<!-- Generator: Adobe Illustrator 24.0.0, SVG Export Plug-In . SVG Version: 6.00 Build 0)  -->
<svg version="1.1" id="Слой_1" xmlns="http://www.w3.org/2000/svg" xmlns:xlink="http://www.w3.org/1999/xlink" x="0px" y="0px"
	 viewBox="0 0 100 100" style="enable-background:new 0 0 100 100;" xml:space="preserve">
<style type="text/css">
	.st0{fill:#62A3D9;stroke:#000000;stroke-width:4.715;stroke-miterlimit:10;}
	.st1{fill:#FFFFFF;stroke:#000000;stroke-width:4.7153;stroke-miterlimit:10;}
	.st2{fill:#FFFFFF;stroke:#000000;stroke-width:4.715;stroke-miterlimit:10;}
	.st3{fill:#FFFFFF;}
	.st4{fill:#98C6E5;}
</style>
<circle class="st0" cx="46.6" cy="48.4" r="34.3"/>
<path d="M46.6,85.1c-20.2,0-36.7-16.4-36.7-36.7c0-20.2,16.4-36.7,36.7-36.7s36.7,16.4,36.7,36.7C83.3,68.6,66.8,85.1,46.6,85.1z
	 M46.6,16.5c-17.6,0-31.9,14.3-31.9,31.9C14.7,66,29,80.3,46.6,80.3S78.5,66,78.5,48.4S64.2,16.5,46.6,16.5z"/>
<circle class="st1" cx="80.9" cy="46.8" r="8.1"/>
<circle class="st2" cx="20" cy="26.7" r="8.1"/>
<g>
	<path d="M-294,46.6c0.8,0.1,1.4,0.1,1.9,0.4c1.6,0.6,2.4,1.8,2.5,3.4c0.1,2.6,0.1,5.2,0,7.8c-0.1,2.2-1.6,3.7-3.9,3.7
		c-0.7,0-1.2,0.1-1.7,0.8c-1,1.4-2.5,2.1-4.2,2.1c-4.8,0-9.5,0-14.3,0c-1.8,0-3.3-0.8-4.3-2.2c-0.4-0.5-0.8-0.7-1.4-0.6
		c-1.2,0.1-2.2-0.3-3.1-1.1c-0.7-0.7-1-1.7-1-2.7c0-2.5,0-4.9,0-7.4c0-2.3,1.5-3.8,3.9-3.9c0.1,0,0.2,0,0.5,0c0-2.8,0-5.7,0-8.6
		c-0.9,0-2,0-3.1,0c0-3.4,0-6.8,0-10.2c10.4,0,20.7,0,31.1,0c0,3.4,0,6.7,0,10.1c-1.1,0-2.1,0-3.1,0C-294,41-294,43.8-294,46.6z
		 M-296.1,50c0-0.3,0-0.5,0-0.7c0-3.1,0-6.1,0-9.2c0-2.3-1.3-3.6-3.5-3.6c-4.5,0-9.1,0-13.6,0c-2.3,0-3.5,1.3-3.6,3.6
		c0,3.1,0,6.1,0,9.2c0,0.2,0,0.5,0,0.7c1,0,2,0,3.1,0c0-1.4,0-2.8,0-4.2c0.8,0,1.4,0,2.2,0c0,1.4,0,2.8,0,4.2c3.4,0,6.7,0,10.1,0
		c0-1.4,0-2.8,0-4.2c0.8,0,1.4,0,2.2,0c0,1.4,0,2.8,0,4.3C-298.1,50-297.2,50-296.1,50z M-311.5,52.2c0,3.5,0,6.9,0,10.3
		c3.4,0,6.7,0,10,0c0-3.4,0-6.8,0-10.3C-304.8,52.2-308.1,52.2-311.5,52.2z M-301,30.1c-3.7,0-7.2,0-10.8,0c0,1.4,0,2.8,0,4.1
		c3.6,0,7.2,0,10.8,0C-301,32.8-301,31.5-301,30.1z M-314.1,30.1c-2,0-3.9,0-5.8,0c0,1.9,0,3.8,0,5.8c0.6,0,1.2,0,1.8,0
		c0.3,0,0.6,0,0.8-0.2c0.9-0.8,2-1.3,3.2-1.4C-314.1,32.9-314.1,31.5-314.1,30.1z M-293,30.1c-2,0-3.9,0-5.8,0c0,1.4,0,2.8,0,4.2
		c1.2,0.2,2.3,0.6,3.2,1.4c0.1,0.1,0.2,0.2,0.4,0.2c0.7,0,1.5,0,2.2,0C-293,33.9-293,32-293,30.1z M-316.8,52.2c0,2.5-0.1,5,0,7.5
		c0,1.6,1.6,2.9,3,2.8c0-3.4,0-6.8,0-10.2C-314.8,52.2-315.7,52.2-316.8,52.2z M-299.2,62.5c1.7-0.1,3.1-1.4,3.1-3.1
		c0-2.3,0-4.5,0-6.8c0-0.1,0-0.2-0.1-0.3c-1,0-2,0-3,0C-299.2,55.6-299.2,59-299.2,62.5z M-319,48.9c-1.5-0.1-2.2,0.4-2.2,1.8
		c0,2.4,0,4.7,0,7.1c0,1.4,0.8,2,2.2,1.7C-319,56-319,52.5-319,48.9z M-293.9,59.6c1.4,0.1,2.2-0.4,2.2-1.7c0-2.4,0-4.9,0-7.3
		c0-1.3-0.9-1.9-2.2-1.6C-293.9,52.5-293.9,56-293.9,59.6z"/>
	<path class="st3" d="M-296.1,50c-1.1,0-2.1,0-3.1,0c0-1.4,0-2.8,0-4.3c-0.7,0-1.4,0-2.2,0c0,1.4,0,2.8,0,4.2c-3.4,0-6.7,0-10.1,0
		c0-1.4,0-2.8,0-4.2c-0.8,0-1.4,0-2.2,0c0,1.4,0,2.8,0,4.2c-1.1,0-2.1,0-3.1,0c0-0.2,0-0.5,0-0.7c0-3.1,0-6.1,0-9.2
		c0-2.3,1.3-3.6,3.6-3.6c4.5,0,9.1,0,13.6,0c2.2,0,3.5,1.3,3.5,3.6c0,3.1,0,6.1,0,9.2C-296.1,49.5-296.1,49.7-296.1,50z
		 M-310.2,42.3c0,2.1,1.7,3.8,3.7,3.8c2.1,0,3.7-1.7,3.8-3.7c0-2.1-1.6-3.8-3.7-3.8C-308.5,38.6-310.2,40.3-310.2,42.3z"/>
	<path class="st4" d="M-311.5,52.2c3.4,0,6.7,0,10,0c0,3.4,0,6.8,0,10.3c-3.3,0-6.7,0-10,0C-311.5,59.1-311.5,55.7-311.5,52.2z"/>
	<path class="st4" d="M-301,30.1c0,1.4,0,2.7,0,4.1c-3.6,0-7.2,0-10.8,0c0-1.4,0-2.7,0-4.1C-308.3,30.1-304.7,30.1-301,30.1z"/>
	<path class="st4" d="M-314.1,30.1c0,1.4,0,2.8,0,4.2c-1.2,0.2-2.3,0.6-3.2,1.4c-0.2,0.2-0.5,0.2-0.8,0.2c-0.6,0-1.2,0-1.8,0
		c0-2,0-3.9,0-5.8C-317.9,30.1-316,30.1-314.1,30.1z"/>
	<path class="st4" d="M-293,30.1c0,1.9,0,3.8,0,5.8c-0.8,0-1.5,0-2.2,0c-0.1,0-0.3-0.1-0.4-0.2c-0.9-0.8-2-1.3-3.2-1.4
		c0-1.4,0-2.8,0-4.2C-296.9,30.1-295,30.1-293,30.1z"/>
	<path class="st4" d="M-316.8,52.2c1.1,0,2,0,3.1,0c0,3.4,0,6.8,0,10.2c-1.4,0.1-3-1.2-3-2.8C-316.8,57.2-316.8,54.7-316.8,52.2z"/>
	<path class="st4" d="M-299.2,62.5c0-3.4,0-6.8,0-10.3c1,0,2,0,3,0c0,0.1,0.1,0.2,0.1,0.3c0,2.3,0,4.5,0,6.8
		C-296.1,61.1-297.4,62.4-299.2,62.5z"/>
	<path class="st3" d="M-319,48.9c0,3.6,0,7.1,0,10.6c-1.4,0.3-2.2-0.4-2.2-1.7c0-2.4,0-4.7,0-7.1C-321.2,49.3-320.5,48.8-319,48.9z"
		/>
	<path class="st3" d="M-293.9,59.6c0-3.6,0-7.1,0-10.6c1.3-0.3,2.2,0.3,2.2,1.6c0,2.4,0,4.9,0,7.3
		C-291.7,59.2-292.4,59.7-293.9,59.6z"/>
	<path d="M-310.2,42.3c0-2.1,1.7-3.7,3.8-3.7c2.1,0,3.8,1.7,3.7,3.8c0,2.1-1.7,3.7-3.8,3.7C-308.5,46.1-310.2,44.4-310.2,42.3z
		 M-306.4,40.8c-0.9,0-1.6,0.7-1.6,1.6c0,0.9,0.7,1.7,1.6,1.6c0.9,0,1.6-0.7,1.6-1.6C-304.8,41.5-305.5,40.8-306.4,40.8z"/>
	<path class="st3" d="M-306.4,40.8c0.9,0,1.6,0.7,1.6,1.6c0,0.9-0.7,1.6-1.6,1.6c-0.9,0-1.6-0.7-1.6-1.6
		C-308,41.4-307.3,40.8-306.4,40.8z"/>
</g>
<circle class="st1" cx="29.5" cy="79" r="8.1"/>
<g>
	<path d="M24.2,35.5c4.1,0,8,0,12,0c0,4.2,0,8.3,0,12.6c1.5-0.2,2.9-0.3,4.3-0.5c0.2,0,0.4-0.6,0.4-0.9c0-1.5,0-3,0.1-4.5
		c0-0.5,0.4-1.2,0.8-1.5c2.8-2.1,6.5-2,9.3,0c0.4,0.3,0.7,0.9,0.7,1.4c0.1,1.5,0,3,0.1,4.6c0,0.3,0.3,0.8,0.5,0.8
		c1.3,0.2,2.7,0.4,4.1,0.5c0-4.2,0-8.3,0-12.5c4,0,8,0,12.1,0c0,0.4,0,0.8,0,1.3c0,11.7,0,23.3,0,35c0,0.8,0.2,1.3,0.8,1.9
		c1.9,1.9,3.9,3.8,5.7,5.7c0.3,0.3,0.6,0.8,0.6,1.1c0,4.4,0,8.8,0,13.3c-19.5,0-38.9,0-58.5,0c0-0.3-0.1-0.6-0.1-0.9c0-4,0-8,0-12
		c0-0.5,0.3-1.2,0.6-1.6c1.8-1.9,3.6-3.7,5.4-5.4c0.7-0.7,1.1-1.4,1-2.5c0-11.5,0-23,0-34.5C24.2,36.5,24.2,36,24.2,35.5z M65,53.8
		c-0.1-0.1-0.2-0.1-0.2-0.1c-12.2-4-24.4-4-36.6-0.1c-0.3,0.1-0.6,0.6-0.6,1c0,3-0.1,6,0,9c0.1,3.4,2.3,6.3,5.6,6.9
		c2.4,0.4,4.9,0.1,7.5,0.1c0-1.9,0-3.9,0-5.9c3.8,0,7.5,0,11.3,0c0,2.1,0,4,0,6.1c2.1,0,4,0,5.9,0c3.8-0.1,7-2.9,7.1-6.8
		C65.2,60.5,65,57.2,65,53.8z M27.6,90.5c12.5,0,24.9,0,37.3,0c0-6.3,0-12.6,0-19.2c-3.8,3.7-8.5,2.6-13,2.9c0,2.6,0,5,0,7.5
		c0,0.4,0,0.9-0.2,1.2c-1.8,1.8-3.6,3.6-5.5,5.5c-1.3-1.4-2.5-2.7-3.9-3.9c-1.4-1.2-1.9-2.5-1.8-4.3c0.2-2,0-3.9,0-6
		c-4.6-0.2-9.2,0.8-13-2.9C27.6,77.8,27.6,84.1,27.6,90.5z M27.7,50.1c1.6-0.4,3.1-0.8,4.7-1.2c0.2-0.1,0.4-0.4,0.4-0.6
		c0-3.1,0-6.2,0-9.4c-1.8,0-3.4,0-5.1,0C27.7,42.7,27.7,46.3,27.7,50.1z M59.9,38.9c0,3.1,0,6.2,0,9.3c0,0.2,0.2,0.6,0.4,0.7
		c1.5,0.4,3.1,0.8,4.6,1.2c0-3.8,0-7.5,0-11.2C63.3,38.9,61.7,38.9,59.9,38.9z M24.1,77.9c-0.3,0.3-0.5,0.5-0.7,0.6
		c-2.4,1.7-3.4,4-3,7c0.2,1.6,0,3.3,0,4.9c1.3,0,2.5,0,3.6,0C24.1,86.3,24.1,82.2,24.1,77.9z M72.2,90.5c0-3,0-5.8,0-8.6
		c0-0.2-0.1-0.5-0.2-0.6c-1-1.1-2.1-2.2-3.4-3.6c0,4.5,0,8.6,0,12.8C69.8,90.5,70.9,90.5,72.2,90.5z M44.1,74.2c0,1.8,0.2,3.5,0,5.2
		c-0.2,2,1.1,2.9,2.2,3.9c1.8-1.1,2.5-2.6,2.3-4.6c-0.2-1.4,0-2.9,0-4.4C47,74.2,45.6,74.2,44.1,74.2z M44.4,47c1.4,0,2.6,0,3.9,0
		c0-0.8,0-1.6,0-2.3c0-1.8-0.3-2.1-2.1-2c-0.4,0-0.9,0.1-1.2,0.2c-0.2,0.1-0.5,0.5-0.6,0.7C44.3,44.7,44.4,45.8,44.4,47z M48.5,68.1
		c-1.5,0-2.9,0-4.3,0c0,0.9,0,1.7,0,2.5c1.5,0,2.9,0,4.3,0C48.5,69.7,48.5,68.9,48.5,68.1z"/>
	<path class="st4" d="M65,53.8c0,3.4,0.1,6.7,0,10.1c-0.2,3.8-3.3,6.7-7.1,6.8c-1.9,0-3.8,0-5.9,0c0-2.1,0-4,0-6.1
		c-3.8,0-7.5,0-11.3,0c0,2,0,4,0,5.9c-2.6,0-5.1,0.3-7.5-0.1c-3.3-0.5-5.5-3.5-5.6-6.9c-0.1-3,0-6,0-9c0-0.3,0.3-0.9,0.6-1
		c12.2-3.9,24.4-3.9,36.6,0.1C64.9,53.7,64.9,53.7,65,53.8z M51.8,55.4c-3.7,0-7.3,0-10.9,0c0,1.1,0,2.2,0,3.3c3.7,0,7.3,0,10.9,0
		C51.8,57.5,51.8,56.5,51.8,55.4z"/>
	<path class="st4" d="M27.6,90.5c0-6.4,0-12.6,0-19.2c3.8,3.7,8.5,2.7,13,2.9c0,2.1,0.1,4,0,6c-0.1,1.8,0.4,3.1,1.8,4.3
		c1.4,1.2,2.5,2.5,3.9,3.9c1.9-1.9,3.7-3.6,5.5-5.5C52,82.6,52,82,52,81.6c0-2.4,0-4.9,0-7.5c4.5-0.2,9.2,0.9,13-2.9
		c0,6.5,0,12.8,0,19.2C52.5,90.5,40.1,90.5,27.6,90.5z"/>
	<path class="st3" d="M27.7,50.1c0-3.8,0-7.4,0-11.2c1.7,0,3.3,0,5.1,0c0,3.2,0,6.3,0,9.4c0,0.2-0.2,0.5-0.4,0.6
		C30.8,49.3,29.3,49.7,27.7,50.1z"/>
	<path class="st3" d="M59.9,38.9c1.8,0,3.4,0,5.1,0c0,3.7,0,7.4,0,11.2c-1.6-0.4-3.1-0.8-4.6-1.2c-0.2-0.1-0.4-0.4-0.4-0.7
		C59.9,45.1,59.9,42.1,59.9,38.9z"/>
	<path class="st3" d="M24.1,77.9c0,4.3,0,8.4,0,12.6c-1.1,0-2.3,0-3.6,0c0-1.6,0.2-3.3,0-4.9c-0.4-3,0.5-5.3,3-7
		C23.6,78.4,23.8,78.2,24.1,77.9z"/>
	<path class="st3" d="M72.2,90.5c-1.3,0-2.4,0-3.6,0c0-4.2,0-8.3,0-12.8c1.3,1.3,2.3,2.4,3.4,3.6c0.1,0.1,0.2,0.4,0.2,0.6
		C72.2,84.7,72.2,87.5,72.2,90.5z"/>
	<path class="st3" d="M44.1,74.2c1.5,0,2.9,0,4.4,0c0,1.5-0.1,3,0,4.4c0.2,2.1-0.5,3.5-2.3,4.6c-1.1-1-2.4-1.9-2.2-3.9
		C44.3,77.7,44.1,76,44.1,74.2z"/>
	<path class="st3" d="M44.4,47c0-1.1,0-2.3,0-3.4c0-0.3,0.3-0.6,0.6-0.7c0.4-0.2,0.8-0.2,1.2-0.2c1.8-0.1,2.1,0.2,2.1,2
		c0,0.8,0,1.5,0,2.3C47,47,45.7,47,44.4,47z"/>
	<path class="st3" d="M48.5,68.1c0,0.8,0,1.6,0,2.5c-1.4,0-2.8,0-4.3,0c0-0.8,0-1.6,0-2.5C45.6,68.1,47,68.1,48.5,68.1z"/>
	<path d="M51.8,55.4c0,1.1,0,2.2,0,3.3c-3.6,0-7.2,0-10.9,0c0-1.1,0-2.2,0-3.3C44.5,55.4,48.1,55.4,51.8,55.4z"/>
</g>
</svg>
