<?xml version="1.0" encoding="utf-8"?>
<!-- Generator: Adobe Illustrator 24.0.0, SVG Export Plug-In . SVG Version: 6.00 Build 0)  -->
<svg version="1.1" id="Слой_1" xmlns="http://www.w3.org/2000/svg" xmlns:xlink="http://www.w3.org/1999/xlink" x="0px" y="0px"
	 viewBox="0 0 100 100" style="enable-background:new 0 0 100 100;" xml:space="preserve">
<style type="text/css">
	.st0{fill:#62A3D9;stroke:#000000;stroke-width:4.715;stroke-miterlimit:10;}
	.st1{fill:#FFFFFF;stroke:#000000;stroke-width:4.7153;stroke-miterlimit:10;}
	.st2{fill:#FFFFFF;}
</style>
<path d="M46.6,85.1c-20.2,0-36.7-16.4-36.7-36.7c0-20.2,16.4-36.7,36.7-36.7s36.7,16.4,36.7,36.7C83.3,68.6,66.8,85.1,46.6,85.1z
	 M46.6,16.5c-17.6,0-31.9,14.3-31.9,31.9C14.7,66,29,80.3,46.6,80.3S78.5,66,78.5,48.4S64.2,16.5,46.6,16.5z"/>
<circle class="st0" cx="47.8" cy="48" r="34.3"/>
<image style="overflow:visible;enable-background:new    ;" width="243" height="292" xlink:href="A697232E.jpg"  transform="matrix(0.998 0 0 0.998 -7893.7544 -7770.3149)">
</image>
<circle class="st1" cx="29.5" cy="79" r="8.1"/>
<g>
	<path d="M28.2,51.2c-2.5,0-4.8,0-7.1,0C12.7,51,6.1,44.9,5.8,36.9C5.3,27.7,12.8,20.4,22.1,21c0.7,0.1,1.5,0.1,2.3,0.2
		c0.3-1.3,0.4-2.5,0.8-3.7C28,8.2,34.3,2.3,43.9,0.8c9.2-1.5,16.8,2,22.4,9.5c0.7,0.9,1.3,1.3,2.5,1.2c10.6-0.3,19.7,8.1,20.3,18.6
		c0.6,10.9-7.4,20.1-18.1,21c-1.3,0.1-2.7,0.1-4.3,0.2c0,1,0,1.9,0,2.9c0,3.2-0.1,6.4,0,9.6c0.2,3.4-1.3,5.7-4.2,6.8
		c-3.1,1.2-6.4,2.2-9.6,2.7c-5.9,0.8-11.8,0.5-17.5-1.4c-1.2-0.4-2.4-0.9-3.5-1.6c-2.4-1.4-3.7-3.3-3.6-6.2c0.1-3.7,0-7.4,0-11.1
		C28.2,52.5,28.2,51.9,28.2,51.2z M66.6,46.5c2-0.2,3.9-0.1,5.8-0.5C80,44.3,85.2,37,84.1,29.6c-1.1-8.1-7.9-13.8-16.1-13
		c-2.6,0.2-4-0.4-5.3-2.7C57.2,4.7,45,2.5,36.5,9c-4.9,3.8-7.3,8.9-7.2,15.1c0,2.2-1,3.4-2.7,3.2c-0.6-0.1-1.1-0.4-1.7-0.6
		c-5.5-2.3-11.8,0.5-13.7,6.2c-1.9,5.6,1.3,11.8,7.1,13.1c3.2,0.7,6.5,0.4,10,0.6c0-1.4,0.1-2.5,0-3.6c-0.3-3,1.2-5,3.7-6.3
		c1.1-0.6,2.2-1.1,3.4-1.5c5.8-1.9,11.8-2.1,17.8-1.4c3.5,0.4,6.8,1.2,9.9,2.9c2.4,1.4,3.9,3.4,3.6,6.4C66.6,44,66.6,45.1,66.6,46.5
		z M33.1,59.3c0,1.3,0,2.4,0,3.6c0,2.8,0.2,3.1,2.8,4.1c0.4,0.2,0.8,0.3,1.2,0.4c5.1,1.6,10.3,1.8,15.4,1c2.6-0.4,5.2-1.3,7.8-2.2
		c0.6-0.2,1.3-1,1.3-1.6c0.2-1.7,0.1-3.5,0.1-5.3C52.1,62.5,42.7,62.5,33.1,59.3z M33.1,47.9c0,1.1,0,2,0,2.9c0,2.9,0.1,3.1,2.8,4.2
		c0.7,0.3,1.3,0.5,2,0.7c5,1.3,10.2,1.6,15.3,0.7c2.4-0.4,4.8-1.3,7.1-2.1c0.6-0.2,1.3-1,1.4-1.6c0.2-1.6,0.1-3.2,0.1-4.8
		C52.1,51.2,42.7,51.1,33.1,47.9z M61.8,41.6c-1-0.6-1.9-1.2-2.8-1.5c-7.7-2.6-15.5-2.6-23.3,0c-1,0.3-1.8,1-2.7,1.6
		C38,46.6,57,46.6,61.8,41.6z"/>
	<path class="st2" d="M66.6,46.5c0-1.4-0.1-2.5,0-3.5c0.2-3-1.2-5-3.6-6.4c-3.1-1.8-6.4-2.5-9.9-2.9c-6-0.7-12-0.5-17.8,1.4
		c-1.2,0.4-2.3,0.9-3.4,1.5c-2.5,1.4-3.9,3.4-3.7,6.3c0.1,1.1,0,2.2,0,3.6c-3.4-0.2-6.8,0.1-10-0.6c-5.8-1.3-9-7.5-7.1-13.1
		c1.9-5.7,8.2-8.5,13.7-6.2c0.5,0.2,1.1,0.5,1.7,0.6c1.7,0.2,2.7-1,2.7-3.2c-0.1-6.2,2.3-11.3,7.2-15.1c8.4-6.5,20.7-4.3,26.2,4.9
		c1.4,2.3,2.8,2.9,5.3,2.7c8.1-0.7,14.9,4.9,16.1,13c1,7.4-4.1,14.7-11.7,16.4C70.6,46.3,68.7,46.3,66.6,46.5z"/>
	<path class="st2" d="M33.1,59.3c9.6,3.3,19,3.3,28.6,0c0,1.8,0.1,3.6-0.1,5.3c-0.1,0.6-0.8,1.4-1.3,1.6c-2.5,0.8-5.1,1.8-7.8,2.2
		c-5.2,0.7-10.4,0.5-15.4-1c-0.4-0.1-0.8-0.3-1.2-0.4c-2.7-1.1-2.8-1.3-2.8-4.1C33.1,61.7,33.1,60.5,33.1,59.3z"/>
	<path class="st2" d="M33.1,47.9c9.6,3.3,19,3.3,28.6,0c0,1.6,0.1,3.3-0.1,4.8c-0.1,0.6-0.8,1.4-1.4,1.6c-2.3,0.8-4.7,1.7-7.1,2.1
		c-5.1,0.8-10.3,0.6-15.3-0.7c-0.7-0.2-1.3-0.4-2-0.7c-2.7-1.1-2.8-1.3-2.8-4.2C33.1,49.9,33.1,49,33.1,47.9z"/>
	<path class="st2" d="M61.8,41.6c-4.8,5-23.8,5-28.8,0.1c1-0.6,1.8-1.2,2.7-1.6c7.7-2.6,15.5-2.6,23.3,0C60,40.4,60.8,41,61.8,41.6z
		"/>
</g>
<circle class="st1" cx="80.9" cy="46.8" r="8.1"/>
</svg>
