[
    { "role": "user", "resource": "*", "action": "changeTask", "attributes": ["*"] },
    { "role": "user", "resource": "*", "action": "getTasks", "attributes": ["*"] },
    { "role": "user", "resource": "*", "action": "getTask", "attributes": ["*"] }
]