[
    { "role": "user", "resource": "*", "action": "changeProblem", "attributes": ["*"] },
    { "role": "user", "resource": "*", "action": "getProblems", "attributes": ["*"] },
    { "role": "user", "resource": "*", "action": "getProblem", "attributes": ["*"] }
]