[
    { "role": "administrator", "resource": "*", "action": "insertFestival", "attributes": ["*"] },
    { "role": "administrator", "resource": "*", "action": "changeFestival", "attributes": ["*"] },
    { "role": "administrator", "resource": "*", "action": "deleteFestival", "attributes": ["*"] },
    { "role": "administrator", "resource": "*", "action": "insertProject", "attributes": ["*"] },
    { "role": "administrator", "resource": "*", "action": "changeProject", "attributes": ["*"] },
    { "role": "administrator", "resource": "*", "action": "deleteProject", "attributes": ["*"] },
    { "role": "administrator", "resource": "*", "action": "getFestival", "attributes": ["*"] },
    { "role": "administrator", "resource": "*", "action": "getFestivals", "attributes": ["*"] },
    { "role": "administrator", "resource": "*", "action": "getFestivalCount", "attributes": ["*"] },
    { "role": "administrator", "resource": "*", "action": "getFestFamily", "attributes": ["*"] },
    { "role": "administrator", "resource": "*", "action": "getFestFamilies", "attributes": ["*"] },
    { "role": "administrator", "resource": "*", "action": "getFestFamilyCount", "attributes": ["*"] },
    { "role": "administrator", "resource": "*", "action": "getDomainType", "attributes": ["*"] },
    { "role": "administrator", "resource": "*", "action": "getDomainTypes", "attributes": ["*"] },
    { "role": "administrator", "resource": "*", "action": "getDomainTypeCount", "attributes": ["*"] },
    { "role": "administrator", "resource": "*", "action": "getExtendFields", "attributes": ["*"] },
    { "role": "administrator", "resource": "*", "action": "getPosts", "attributes": ["*"] },
    { "role": "administrator", "resource": "*", "action": "getProject", "attributes": ["*"] },
    { "role": "administrator", "resource": "*", "action": "getProjects", "attributes": ["*"] },
    { "role": "administrator", "resource": "*", "action": "getProjectCount", "attributes": ["*"] },
    { "role": "administrator", "resource": "*", "action": "getTrack", "attributes": ["*"] },
    { "role": "administrator", "resource": "*", "action": "getTracks", "attributes": ["*"] },
    { "role": "administrator", "resource": "*", "action": "getTrackCount", "attributes": ["*"] },
    { "role": "administrator", "resource": "*", "action": "getHoneycombs", "attributes": ["*"] },
    { "role": "administrator", "resource": "*", "action": "getHoneycombss", "attributes": ["*"] },
    { "role": "administrator", "resource": "*", "action": "getHoneycombsCount", "attributes": ["*"] },
    { "role": "administrator", "resource": "*", "action": "getCategory", "attributes": ["*"] },
    { "role": "administrator", "resource": "*", "action": "getCategories", "attributes": ["*"] },
    { "role": "administrator", "resource": "*", "action": "getCategoryCount", "attributes": ["*"] },
    { "role": "administrator", "resource": "*", "action": "getCritery", "attributes": ["*"] },
    { "role": "administrator", "resource": "*", "action": "getCriteries", "attributes": ["*"] },
    { "role": "administrator", "resource": "*", "action": "getCriteryCount", "attributes": ["*"] },
    { "role": "administrator", "resource": "*", "action": "getGanre", "attributes": ["*"] },
    { "role": "administrator", "resource": "*", "action": "getGanres", "attributes": ["*"] },
    { "role": "administrator", "resource": "*", "action": "getGanreCount", "attributes": ["*"] },
    { "role": "administrator", "resource": "*", "action": "insertFestFamily", "attributes": ["*"] },
    { "role": "administrator", "resource": "*", "action": "insertDomainType", "attributes": ["*"] },
    { "role": "administrator", "resource": "*", "action": "insertTrack", "attributes": ["*"] },
    { "role": "administrator", "resource": "*", "action": "insertHoneycombs", "attributes": ["*"] },
    { "role": "administrator", "resource": "*", "action": "insertGanre", "attributes": ["*"] },
    { "role": "administrator", "resource": "*", "action": "insertPost", "attributes": ["*"] },
    { "role": "administrator", "resource": "*", "action": "correctRating", "attributes": ["*"] },

    { "role": "Track_moderator", "resource": "*", "action": "correctRating", "attributes": ["*"] },

    { "role": "User", "resource": "*", "action": "insertFestival", "attributes": ["*"] },
    { "role": "User", "resource": "*", "action": "changeFestival", "attributes": ["*"] },
    { "role": "User", "resource": "*", "action": "deleteFestival", "attributes": ["*"] },
    { "role": "User", "resource": "*", "action": "insertProject", "attributes": ["*"] },
    { "role": "User", "resource": "*", "action": "changeProject", "attributes": ["*"] },
    { "role": "User", "resource": "*", "action": "deleteProject", "attributes": ["*"] },
    { "role": "User", "resource": "*", "action": "getFestival", "attributes": ["*"] },
    { "role": "User", "resource": "*", "action": "getFestivals", "attributes": ["*"] },
    { "role": "User", "resource": "*", "action": "getFestivalCount", "attributes": ["*"] },
    { "role": "User", "resource": "*", "action": "getFestFamily", "attributes": ["*"] },
    { "role": "User", "resource": "*", "action": "getFestFamilies", "attributes": ["*"] },
    { "role": "User", "resource": "*", "action": "getFestFamilyCount", "attributes": ["*"] },
    { "role": "User", "resource": "*", "action": "getDomainType", "attributes": ["*"] },
    { "role": "User", "resource": "*", "action": "getDomainTypes", "attributes": ["*"] },
    { "role": "User", "resource": "*", "action": "getDomainTypeCount", "attributes": ["*"] },
    { "role": "User", "resource": "*", "action": "getExtendFields", "attributes": ["*"] },
    { "role": "User", "resource": "*", "action": "getProject", "attributes": ["*"] },
    { "role": "User", "resource": "*", "action": "getProjects", "attributes": ["*"] },
    { "role": "User", "resource": "*", "action": "getProjectCount", "attributes": ["*"] },
    { "role": "User", "resource": "*", "action": "getPosts", "attributes": ["*"] },
    { "role": "User", "resource": "*", "action": "getTrack", "attributes": ["*"] },
    { "role": "User", "resource": "*", "action": "getTracks", "attributes": ["*"] },
    { "role": "User", "resource": "*", "action": "getTrackCount", "attributes": ["*"] }, 
    { "role": "User", "resource": "*", "action": "getHoneycombs", "attributes": ["*"] },
    { "role": "User", "resource": "*", "action": "getHoneycombss", "attributes": ["*"] },
    { "role": "User", "resource": "*", "action": "getHoneycombsCount", "attributes": ["*"] },
    { "role": "User", "resource": "*", "action": "getCategory", "attributes": ["*"] },
    { "role": "User", "resource": "*", "action": "getCategories", "attributes": ["*"] },
    { "role": "User", "resource": "*", "action": "getCategoryCount", "attributes": ["*"] }, 
    { "role": "User", "resource": "*", "action": "getCritery", "attributes": ["*"] },
    { "role": "User", "resource": "*", "action": "getCriteries", "attributes": ["*"] },
    { "role": "User", "resource": "*", "action": "getCriteryCount", "attributes": ["*"] }, 
    { "role": "User", "resource": "*", "action": "getGanre", "attributes": ["*"] },
    { "role": "User", "resource": "*", "action": "getGanres", "attributes": ["*"] },
    { "role": "User", "resource": "*", "action": "getGanreCount", "attributes": ["*"] },
    { "role": "User", "resource": "*", "action": "insertFestFamily", "attributes": ["*"] },
    { "role": "User", "resource": "*", "action": "insertDomainType", "attributes": ["*"] },
    { "role": "User", "resource": "*", "action": "insertTrack", "attributes": ["*"] },
    { "role": "User", "resource": "*", "action": "insertHoneycombs", "attributes": ["*"] },
    { "role": "User", "resource": "*", "action": "insertGanre", "attributes": ["*"] },
    { "role": "User", "resource": "*", "action": "insertPost", "attributes": ["*"] } 
]