<?xml version="1.0" encoding="utf-8"?>
<!-- Generator: Adobe Illustrator 24.0.0, SVG Export Plug-In . SVG Version: 6.00 Build 0)  -->
<svg version="1.1" id="Слой_1" xmlns="http://www.w3.org/2000/svg" xmlns:xlink="http://www.w3.org/1999/xlink" x="0px" y="0px"
	 viewBox="0 0 170.1 170.1" style="enable-background:new 0 0 170.1 170.1;" xml:space="preserve">
<style type="text/css">
	.st0{display:none;}
	.st1{display:inline;stroke:#FFFFFF;stroke-miterlimit:10;}
	.st2{display:inline;}
	.st3{fill:#FFFFFB;}
	.st4{display:inline;fill:none;stroke:#000000;stroke-width:40;stroke-miterlimit:10;}
	.st5{fill:none;stroke:#FAFAFA;stroke-width:3;stroke-miterlimit:10;}
	.st6{fill:none;stroke:#FAFAFA;stroke-width:3;stroke-miterlimit:10;stroke-dasharray:11.9585,11.9585;}
	.st7{display:inline;fill:none;stroke:#000000;stroke-width:5;stroke-miterlimit:10;}
	.st8{display:inline;fill:none;stroke:#000000;stroke-width:3;stroke-miterlimit:10;}
	.st9{display:inline;fill:#010202;}
	.st10{fill:#FCF6C2;}
	.st11{fill:none;stroke:#010202;stroke-width:10;stroke-miterlimit:10;}
	.st12{clip-path:url(#SVGID_2_);}
</style>
<g id="Слой_1_1_" class="st0">
	
		<ellipse transform="matrix(8.248055e-02 -0.9966 0.9966 8.248055e-02 -3.3928 170.3148)" class="st1" cx="90.8" cy="87" rx="43.6" ry="43.6"/>
	<g class="st2">
		<path class="st3" d="M89.5,84.5c0,7.3-2.7,11.3-7.5,11.3c-4.2,0-7-3.9-7.1-11c0-7.2,3.1-11.2,7.5-11.2
			C86.9,73.6,89.5,77.6,89.5,84.5z M77.8,84.8c0,5.6,1.7,8.8,4.4,8.8c3,0,4.4-3.5,4.4-9c0-5.3-1.4-8.8-4.4-8.8
			C79.7,75.9,77.8,79,77.8,84.8z"/>
		<path class="st3" d="M98.5,76.7L98.5,76.7l-3.8,2l-0.6-2.2l4.7-2.5h2.5v21.5h-2.8C98.5,95.5,98.5,76.7,98.5,76.7z"/>
	</g>
</g>
<g id="Слой_1_копия_2" class="st0">
	<circle class="st1" cx="84" cy="85" r="38.7"/>
	<g class="st2">
		<path class="st3" d="M82.9,82.8c0,6.5-2.4,10.1-6.6,10.1c-3.7,0-6.3-3.5-6.3-9.8c0-6.4,2.8-9.9,6.6-9.9
			C80.6,73.1,82.9,76.7,82.9,82.8z M72.5,83.1c0,5,1.5,7.8,3.9,7.8c2.6,0,3.9-3.1,3.9-8c0-4.7-1.2-7.8-3.9-7.8
			C74.2,75.1,72.5,77.9,72.5,83.1z"/>
		<path class="st3" d="M90.9,75.8L90.9,75.8l-3.4,1.8l-0.5-2l4.2-2.2h2.2v19.1h-2.5C90.9,92.5,90.9,75.8,90.9,75.8z"/>
	</g>
	<path class="st4" d="M21.7,170.1V85c0-34.4,27.9-62.3,62.3-62.3s62.3,27.9,62.3,62.3v36.5c0,0,5.7,29.6,25.5,28.6"/>
	<g class="st2">
		<g>
			<line class="st5" x1="21.7" y1="170.1" x2="21.7" y2="164.1"/>
			<path class="st6" d="M21.7,152.1V85c0-34.4,27.9-62.3,62.3-62.3s62.3,27.9,62.3,62.3v36.5c0,0,3.4,17.8,14.2,25.3"/>
			<path class="st5" d="M165.8,149.4c1.8,0.5,3.8,0.8,5.9,0.7"/>
		</g>
	</g>
</g>
<g id="Слой_1__x28_копия_x29_" class="st0">
	
		<ellipse transform="matrix(8.248055e-02 -0.9966 0.9966 8.248055e-02 -3.3928 170.3148)" class="st1" cx="90.8" cy="87" rx="43.6" ry="43.6"/>
	<g class="st2">
		<path class="st3" d="M89.5,84.5c0,7.3-2.7,11.3-7.5,11.3c-4.2,0-7-3.9-7.1-11c0-7.2,3.1-11.2,7.5-11.2
			C86.9,73.6,89.5,77.6,89.5,84.5z M77.8,84.8c0,5.6,1.7,8.8,4.4,8.8c3,0,4.4-3.5,4.4-9c0-5.3-1.4-8.8-4.4-8.8
			C79.7,75.9,77.8,79,77.8,84.8z"/>
		<path class="st3" d="M98.5,76.7L98.5,76.7l-3.8,2l-0.6-2.2l4.7-2.5h2.5v21.5h-2.8C98.5,95.5,98.5,76.7,98.5,76.7z"/>
	</g>
	<path class="st7" d="M127.2,55.7c7.2,8.4,11.6,19.3,11.6,31.3c0,13.3-5.4,25.3-14.1,33.9"/>
	<line class="st8" x1="138.8" y1="85" x2="170.1" y2="85"/>
	<g id="Слой_4" class="st2">
	</g>
</g>
<g id="Слой_5" class="st0">
	<polygon class="st9" points="0,170.1 0,0 170.1,0 	"/>
	<g class="st2">
		<path class="st10" d="M49.2,44.6c0,13.5-5,21-13.8,21c-7.8,0-13-7.3-13.2-20.5c0-13.3,5.8-20.7,13.8-20.7
			C44.4,24.4,49.2,31.9,49.2,44.6z M27.5,45.2c0,10.3,3.2,16.2,8.1,16.2c5.5,0,8.1-6.4,8.1-16.6c0-9.8-2.5-16.2-8.1-16.2
			C31,28.6,27.5,34.3,27.5,45.2z"/>
		<path class="st10" d="M65.8,30.1L65.8,30.1l-7,3.7l-1-4.1l8.7-4.7H71v39.8h-5.2V30.1z"/>
	</g>
</g>
<g id="Слой_5__x28_копия_x29_" class="st0">
	<polygon class="st9" points="170.1,170.1 170.1,0 0,0 	"/>
	<g class="st2">
		<path class="st10" d="M123,44.6c0,13.5-5,21-13.8,21c-7.8,0-13-7.3-13.2-20.5c0-13.3,5.8-20.7,13.8-20.7
			C118.3,24.4,123,31.9,123,44.6z M101.4,45.2c0,10.3,3.2,16.2,8.1,16.2c5.5,0,8.1-6.4,8.1-16.6c0-9.8-2.5-16.2-8.1-16.2
			C104.9,28.6,101.4,34.3,101.4,45.2z"/>
		<path class="st10" d="M139.7,30.1h-0.1l-6.9,3.7l-1-4.1l8.7-4.7h4.6v39.8h-5.2V30.1H139.7z"/>
	</g>
</g>
<g id="Слой_5__x28_копия3_x29_" class="st0">
	<polygon class="st9" points="0,0 0,170.1 170.1,170.1 	"/>
	<g class="st2">
		<path class="st10" d="M52.6,119.1c0,13.5-5,21-13.8,21c-7.8,0-13-7.3-13.2-20.5c0-13.3,5.8-20.7,13.8-20.7
			C47.8,99,52.6,106.5,52.6,119.1z M31,119.7c0,10.3,3.2,16.2,8.1,16.2c5.5,0,8.1-6.4,8.1-16.6c0-9.8-2.5-16.2-8.1-16.2
			C34.4,103.1,31,108.9,31,119.7z"/>
		<path class="st10" d="M69.2,104.7L69.2,104.7l-7,3.7l-1-4.1l8.7-4.7h4.6v39.8h-5.2L69.2,104.7L69.2,104.7z"/>
	</g>
</g>
<rect x="5.7" y="5.5" class="st11" width="159.2" height="159.2"/>
<g>
	<g>
		<g>
			<defs>
				<rect id="SVGID_1_" x="16.2" y="1.3" width="138.6" height="168.7"/>
			</defs>
			<clipPath id="SVGID_2_">
				<use xlink:href="#SVGID_1_"  style="overflow:visible;"/>
			</clipPath>
			<g class="st12">
				<circle cx="86" cy="48.8" r="37.9"/>
				<ellipse cx="84.7" cy="204" rx="60" ry="102"/>
			</g>
		</g>
	</g>
</g>
</svg>
