<?xml version="1.0" encoding="utf-8"?>
<!-- Generator: Adobe Illustrator 24.0.0, SVG Export Plug-In . SVG Version: 6.00 Build 0)  -->
<svg version="1.1" id="Слой_1" xmlns="http://www.w3.org/2000/svg" xmlns:xlink="http://www.w3.org/1999/xlink" x="0px" y="0px"
	 viewBox="0 0 344 358" style="enable-background:new 0 0 344 358;" xml:space="preserve">
<path d="M156.2,15.3c35.8,0,71.7,0.1,107.5-0.1c12-0.1,22,4,30.4,12.6c7.2,7.4,14.6,14.6,21.9,22c16.9,17,16.8,39.1-0.1,56.2
	c-7.3,7.3-14.7,14.5-21.9,21.9c-8.4,8.6-18.4,12.5-30.4,12.5c-71.8-0.1-143.7,0-215.5-0.1c-6.1,0-10.9,1.8-13.5,7.5
	c-3.9,8.5,2.2,17.5,12,17.5c16.3,0.1,32.7,0,49,0c8.2,0,16.3-0.1,24.5,0c7.8,0.1,13.4,5.3,13.4,12.5c0,7.1-5.6,12.5-13.4,12.5
	c-25,0.1-50,0.1-75,0c-19.8-0.1-36.5-16.9-36.6-36.8c-0.1-33.7-0.1-67.3,0-101c0.1-20.4,16.8-37.1,37.3-37.2
	C82.5,15.3,119.4,15.3,156.2,15.3z M33.4,116.6c5.7-0.5,10.8-1.2,15.9-1.2c71.3-0.1,142.6-0.1,213.9,0c5.4,0,9.6-1.6,13.3-5.5
	c7.3-7.6,14.8-14.8,22.2-22.3c6.4-6.5,6.4-13.2,0-19.6c-7.3-7.4-14.8-14.5-21.9-22c-4-4.2-8.4-5.8-14.2-5.8
	c-71.1,0.1-142.3,0.1-213.4,0.1c-1.3,0-2.7-0.1-4,0c-6.6,0.5-11.7,5.3-11.8,12C33.3,73.8,33.4,95.3,33.4,116.6z"/>
<path d="M180.9,335.4c-35.8,0-71.7-0.1-107.5,0.1c-12,0.1-22.1-3.8-30.4-12.4c-7.4-7.6-15.1-15-22.6-22.7
	c-16.2-16.5-16.1-38.5,0.1-55.1c7.5-7.6,15.1-15,22.6-22.7c8.3-8.5,18.2-12.3,30-12.3c71.7,0.1,143.3,0.1,215,0
	c3.2,0,6.7-0.7,9.5-2.1c4.8-2.4,6.8-8.3,5.4-13.3c-1.6-6-6.3-9.5-13-9.5c-24.2-0.1-48.3-0.1-72.5,0c-5.9,0-10.5-2-13-7.5
	c-4-8.7,2.3-17.5,12.5-17.5c24.8-0.1,49.7,0,74.5,0c2.1,0,4.3,0.4,6.4,0.8c17.5,3.2,30.4,18.5,30.4,36.3c0.1,33.7,0.1,67.3,0,101
	c-0.1,20.1-16.8,36.8-37,36.9C254.6,335.5,217.7,335.4,180.9,335.4z M303.4,234.4c-7.3,0.3-14.4,1-21.5,1
	c-69.3,0.1-138.6,0.1-207.9,0c-5.8,0-10.2,1.7-14.1,5.9c-6.6,7-13.6,13.7-20.4,20.5c-8.1,8.1-8.2,14.1-0.2,22.1
	c6.8,6.8,13.8,13.5,20.4,20.6c4.1,4.3,8.6,6.1,14.6,6.1c71.1-0.1,142.3-0.1,213.4-0.1c1.3,0,2.7,0.1,4,0c6.4-0.6,11.6-5.2,11.6-11.6
	C303.6,277.1,303.4,255.5,303.4,234.4z"/>
<path d="M168.4,90.3c-24.3,0-48.7,0-73,0c-8.9,0-14.3-4.8-14.4-12.4c-0.1-7.7,5.4-12.6,14.2-12.6c48.8,0,97.7,0,146.5,0
	c8.7,0,14.2,4.9,14.1,12.6c-0.1,7.5-5.5,12.3-13.9,12.3C217.4,90.3,192.9,90.3,168.4,90.3z"/>
<path d="M168.2,285.4c-24.7,0-49.3,0-74,0c-6.5,0-11.3-3.6-12.8-9.1c-1.5-5.6,0.8-11.5,5.9-14.1c2.1-1.1,4.7-1.7,7.1-1.7
	c49.3-0.1,98.7-0.1,148-0.1c8,0,13.3,5.1,13.4,12.3c0.1,7.5-5.4,12.6-13.7,12.6C217.5,285.4,192.8,285.4,168.2,285.4z"/>
</svg>
