<?xml version="1.0" encoding="utf-8"?>
<!-- Generator: Adobe Illustrator 24.0.0, SVG Export Plug-In . SVG Version: 6.00 Build 0)  -->
<svg version="1.1" id="Слой_1" xmlns="http://www.w3.org/2000/svg" xmlns:xlink="http://www.w3.org/1999/xlink" x="0px" y="0px"
	 viewBox="0 0 170.1 170.1" style="enable-background:new 0 0 170.1 170.1;" xml:space="preserve">
<style type="text/css">
	.st0{display:none;}
	.st1{display:inline;opacity:0.31;fill:#020203;enable-background:new    ;}
</style>
<g id="Слой_2_1_" class="st0">
	<rect x="9.2" y="14.3" class="st1" width="53" height="10.2"/>
	<rect x="111.8" y="14.3" class="st1" width="53" height="10.2"/>
	<rect x="9.2" y="141" class="st1" width="53" height="10.2"/>
	<rect x="111.8" y="141" class="st1" width="53" height="10.2"/>
</g>
<polygon points="71.1,47.9 57.3,60.1 90.9,87.1 58.4,112.9 71.1,126.2 121,87.1 "/>
</svg>
