{
	"app": {
		"title": "Говорю как краевед",
		"name": "Говорю как краевед",
		"external_systems": [],
		"scopes": "",
		"adapter": "wp",
		"user_model": "User",
		"help_url":"http://ux.protopia-home.ru/",
		"roles": [
			{
				"_id": "subscriber",
				"title": "subscriber"
			},
			{
				"_id": "administrator",
				"title": "administrator"
			},
			{
				"_id": "pupil",
				"title": "Pupil"
			},
			{
				"_id": "tutor",
				"title": "Tutor"
			},
			{
				"_id": "courseleader",
				"title": "CourseLeader"
			},
			{
				"_id": "editor",
				"title": "Editor"
			}
		]
	},
	"template": {
		"menu_left": 1,
		"header": 1,
		"icon": "/assets/img/037-talkshow.svg",
		"icon_width": 25,
		"icon_height": 25,
		"avatar": "/assets/img/user1.svg",
		"login": "/login",
		"style": "/assets/css/style.css",
		"styles": [
			{
				"_id": 1,
				"title": "Standart",
				"url": "/assets/css/style.css"
			},
			{
				"_id": 2,
				"title": "Light",
				"url": "/assets/css/style_light.css"
			},
			{
				"_id": 3,
				"title": "minimal",
				"url": "/assets/css/style_minimal.css"
			},
			{
				"_id": "4",
				"title": "wpfest",
				"url": "/assets/css/style_wp_ferst.css"
			}
		],
		"left_menu": "pictogramm"
	},
	"modules": {
		"pe-basic-module----": {
			"commentary": "",
			"id": "pe-basic",
			"title": "PE Basic",
			"description": "Basic visual structure",
			"preority": 1,
			"version": "0.1.0",
			"author": "genag1@list.ru",
			"documentation": "",
			"git": "",
			"views": {
				"SettingsView": {
					"title": "Settings View",
					"description": ""
				},
				"SingledDataTypeView": {
					"title": "Singled Data Type View",
					"description": ""
				},
				"FeedDataTypeView": {
					"title": "Feed Data Type View",
					"description": "",
					"fields":[
						{
							"extend_params" : 
							{
								"type": "object",
								"title" : "Extended feed parameters",
								"fields": {										
									"id" 		: 
									{
										"type": "number",
										"commentary" : "Item cards are arranged in rows",
										"title" : "Column count"
									}
								}	
							}
						}
					]
				},
				"SearchView": {
					"title": "Search View",
					"description": ""
				},
				"HTMLView": {
					"title": "HTML View",
					"description": "",
					"admin_hidden":true
				},
				"HTMLSourceVew": {
					"title": "HTML Source Vew",
					"description": "",
					"admin_hidden":true
				},
				"RegisterView": {
					"title": "RegisterView",
					"description": "",
					"admin_hidden":true
				},
				"LoginView": {
					"title": "Login View",
					"description": "",
					"admin_hidden":true
				},
				"ProfileView": {
					"title": "Profile View",
					"description": ""
				},
				"ResetPasswordView": {
					"title": "Reset Password View",
					"description": "",
					"admin_hidden":true
				},
				"VerifyUserView": {
					"title": "Verify User View",
					"description": "",
					"admin_hidden":true
				},
				"RememberPasswordView": {
					"title": "Remember Password View",
					"description": "",
					"admin_hidden":true
				},
				"NoMatchView": {
					"title": "404 View",
					"description": ""
				},
				"ChangeEmailView": {
					"title": "Change Email View",
					"description": "",
					"admin_hidden":true
				},
				"FinishRestorePasswordView": {
					"title": "Finish Restore Password View",
					"description": "",
					"admin_hidden":true
				}
			},
			"widgets": {
				"Aside": {
					"title": "Aside",
					"description": " ",
					"preority": 1,
					"area": []
				},
				"FreeHTMLWidget": {
					"title": "FreeHTMLWidget",
					"description": " ",
					"preority": 1,
					"area": []
				},
				"FreeMenu": {
					"title": "FreeMenu",
					"description": " ",
					"preority": 1,
					"area": []
				},
				"FreeNavLinkWidget": {
					"title": "FreeNavLinkWidget ",
					"description": " ",
					"preority": 1,
					"area": []
				},
				"FreeRouteWidget": {
					"title": "FreeRouteWidget ",
					"description": " ",
					"preority": 1,
					"area": [],
					"fields":[
						{
							"id": "link_route",
							"type":"string, [string]",
							"description":""
						},
						{
							"id": "preroute",
							"type":"string",
							"description":""
						},
						{
							"id": "label",
							"type":"string",
							"description":""
						},
						{
							"id": "components",
							"type":"[Component]",
							"description":""
						},
						{
							"id": "component_names",
							"type":"[string]",
							"description":""
						},
						{
							"id": "className",
							"type":"string",
							"description":""
						},
						{
							"id": "style",
							"type":"object",
							"description":""
						}
					]
				},
				"PEExporter": {
					"title": "PEExporter ",
					"description": " ",
					"preority": 1,
					"hidden": 1,
					"fields":[
						{
							"id": "data_type",
							"type":"string",
							"description":""
						},
						{
							"id": "data",
							"type":"object",
							"description":""
						},
						{
							"id": "state_element",
							"type":"string",
							"description":""
						}
					],
					"area": []
				},
				"SearchBlock": {
					"title": "SearchBlock ",
					"description": " ",
					"preority": 1,
					"area": []
				},
				"UsersLockLabelWidget": {
					"title": "UsersLockLabelWidget ",
					"description": " ",
					"preority": 1,
					"area": []
				}
			},
			"extentions": {
				"PagiWidget": {
					"title": "PagiWidget ",
					"description": " ",
					"preority": 1,
					"area": []
				},
				"CurrentUserPanelWidget": {
					"title": "Панель текущего пользователя",
					"description": "",
					"preority": 1,
					"area": [ 
						{
							"id": "layout-after-left-menu"
						}
					]	
				}
			}
		},
		"pe-admin-module": {
			"commentary": "pe Admin Views collection",
			"id": "pe-admin-module",
			"title": "Администратор",
			"description": "Структура создания клиентского админского управления серверными данными",
			"preority": 1,
			"version": "0.1.0",
			"author": "genag1@list.ru",
			"documentation": "",
			"git": "https://gitlab.com/protopiahome/inner-projects/protopia-home-public-portal/protopia-home-public-admin/-/tree/master",
			"views": {
				"AdminSettingView": {
					"title": "View «App settings»",
					"description": "Управление глобальными настройками приложения"
				},
				"AdminWidgetView": {
					"title": "View «Widgets»",
					"description": "Навигация по всем зарегистрированным в системе Гнёздам виджетов. Регистрация и настройка виджетов и расширений в Гнёзда."
				},
				"AdminMenuView": {
					"title": "View «Site Map, Views, Menus»",
					"description": "Создание и редактирование карты сайта. Редактирование групп меню и создание новых"
				},
				"AdminPluginView": {
					"title": "View Modules",
					"description": "Страница редактирования текущего стека плагинов (сторонних расширений функциональности платформы)."
				},
				"MainAdminView": {
					"title": "Страница-оглавление",
					"description": "Страница отображает ссылки и описания на свои дочерние страницы. Использовать для удобства навигации по админке"
				},
				"DataTableView": {
					"title": "Раздел редактирования определённогя Типа Данных",
					"description": "Техническая Страница. Демонстрирует список объектов определённого Типа данных, предоставляет возможность поиска и редактирования каждого объекта. Эту страницу платформа использует самостоятельно, если в Карте Сайта указывается «Администрирование Типа Данных»",
					"admin_hidden":true
				},
				"DataView": {
					"title": "Страница редактирования объекта",
					"description": "Техническая Страница. Предоставляет интерфейс редактирования полей выбранного объекта, которые система указывает как редактируемые. Эту Страницу не надо специально всключать в Карту Сайта - она подключается автоматически.",
					"admin_hidden":true
				}
			},
			"widgets": {},
			"extentions": {}
		},
		"pe-landing-module": {
			"commentary": "pe landing",
			"id": "pe-landing-module",
			"title": "Вёрстка",
			"description": "Graphic | WYSIWYG editor for perfect user Interfaces.",
			"preority": 1,
			"version": "0.1.0",
			"author": "genag1@list.ru",
			"documentation": "",
			"git": "https://gitlab.com/protopiahome/inner-projects/protopia-home-public-portal/protopia-home-public-admin/-/tree/master",
			"views": {
				"LandingView": {
					"title": "Landing generator",
					"description": "Default PE View for generation perfect user Interfaces.",
					"fields":[
						{
							"extend_params" : 
							{
								"type": "object",
								"title" : "Extended landing parameters",
								"fields": {										
									"id" 		: 
									{
										"type": "string",
										"commentary" : "This unique identificator for source data",
										"title" : "Unique landing ID"
									}
								}	
							}
						}
					]
				}
			},
			"widgets": {},
			"extentions": {
				"LandingObject": {
					"title": "Расширение форм редактирования полей",
					"description": "",
					"preority": 1,
					"area": [
						{
							"id": "landing-object"
						}
					]
				}
			}
		},
		"pe-oraculi-module": {
			"commentary": "PE Oraculi ",
			"id": "pe-oraculi-module",
			"title": "Наставник",
			"description": "<p>Образовательная платформа для поддержки онлайн и оффлайн образовательных проектов.</p><p>Включает в себя: <ul><li>Факультеты</li><li>Курсы</li><li>Предметные области</li><li>Классы</li><li>Уроки и Лекции</li><li>Образовательные события (Олимпиады, конкурсы)</li><li>Тесты</li></ul></p><p>Синхронизован с сервисами <b>PE-Fest</b> <i>(образовательные фестивали и конкурсы)</i> и <b>PE-Jitsi</b> <i>(Видеотрансляции и переговорные комнаты)</i></p><p>Серверная поддержка реализована на платформе Wordpress.</p>",
			"preority": 1,
			"version": "0.1.0",
			"author": "genag1@list.ru",
			"documentation": "",
			"git": "https://gitlab.com/protopiahome/inner-projects/protopia-home-public-portal/protopia-home-public-admin/-/tree/master",
			"views": {
				"TutorFacultets": {
					"title": "Лента Факультетов",
					"description": "",
					"data_type": "Bio_Facultet",
					"is_feed" : true

				},
				"TutorFacultet": {
					"title": "Страница Факультета",
					"description": "",
					"admin_hidden":true,
					"data_type": "Bio_Facultet",
					"is_feed" : false
				},
				"TutorCourses": {
					"title": "Лента Курсов",
					"description": " ",
					"data_type": "Bio_Course",
					"is_feed" : true
				},
				"TutorCourse": {
					"title": "Страница Курса",
					"description": " ",
					"admin_hidden":true,
					"data_type": "Bio_Course",
					"is_feed" : false
				},
				"TutorTheme": {
					"title": "Страница Разделов знаний. ",
					"description": "",
					"data_type": "Bio_Biology_Theme",
					"admin_hidden":true,
					"is_feed" : false
				},
				"TutorThemes": {
					"title": "Лента Разделов знаний. ",
					"description": "",
					"data_type": "Bio_Biology_Theme",
					"admin_hidden":true,
					"is_feed" : true
				},
				"TutorUser": {
					"title": "Страница User",
					"description": " ",
					"admin_hidden":true,
					"data_type": "User",
					"is_feed" : false
				},
				"TutorCourseLessons": {
					"title": "Лента Уроков. Фильтрация по Курсу.",
					"description": " "
				},
				"TutorArticlesFavorite": {
					"title": "Страница любимых Уроков Пользователя",
					"description": ""
				},
				"TutorClassLessons": {
					"title": "Лента Уроков. Фильтрация по Классу.",
					"description": " "
				},
				"TutorEvent": {
					"title": "Страница События",
					"description": "",
					"admin_hidden":true
				},
				"TutorLesson": {
					"title": "Страница Урока ",
					"description": "",
					"admin_hidden":true,
					"data_type": "Bio_Article",
					"is_feed" : false
				},
				"TutorLessons": {
					"title": "Лента Уроков",
					"description": " ",
					"admin_hidden":true,
					"data_type": "Bio_Article",
					"is_feed" : true
				},
				"TutorRemoteAccountAdmin": {
					"title": "Страница администрирования аккаунтов подключения сторонних сервисов. ",
					"description": ""
				},
				"TutorRemoteAdmin": {
					"title": "Страница администрирования сторонних сервисов. ",
					"description": ""
				},
				"TutorResult": {
					"title": "Страница Результата. ",
					"description": "",
					"admin_hidden":true,
					"data_type": "Bio_Result",
					"is_feed" : false
				},
				"TutorTest": {
					"title": "Страница Теста ",
					"description": "",
					"admin_hidden":true,
					"data_type": "Bio_Test",
					"is_feed" : false
				},
				"TutorTests": {
					"title": "Лента Тестов ",
					"description": "",
					"data_type": "Bio_Test",
					"is_feed" : true
				},
				"TutorThemeLessons": {
					"title": "Дета Уроков. Фильтрация по Разделу знаний. ",
					"description": ""
				},
				"TutorUserTestResults": {
					"title": "Страница резульаьов прохождения Тестов текущим Пользователем. ",
					"description": ""
				}
			},
			"widgets": {
				"CourseFilesWidget": {
					"title": "CourseFilesWidget",
					"description": " ",
					"preority": 1,
					"area": []
				},
				"EventCalendar": {
					"title": "EventCalendar",
					"description": "",
					"preority": 1,
					"area": []
				},
				"EventMembersWidget": {
					"title": "EventMembersWidget",
					"description": "",
					"preority": 1,
					"area": []
				},
				"EventRequestLabelWidget": {
					"title": "EventRequestLabelWidget",
					"description": "",
					"preority": 1,
					"area": []
				},
				"EventsRequestLabelWidget": {
					"title": "EventsRequestLabelWidget",
					"description": "",
					"preority": 1,
					"area": []
				},
				"PriceLabel": {
					"title": "PriceLabel",
					"description": "",
					"preority": 1,
					"area": []
				},
				"QuestionHiddenLabelWidget": {
					"title": "QuestionHiddenLabelWidget",
					"description": "",
					"preority": 1,
					"area": []
				},
				"TestCategoryForm": {
					"title": "TestCategoryForm",
					"description": "",
					"preority": 1,
					"area": []
				},
				"TutorLikerWidget": {
					"title": "TutorLikerWidget",
					"description": "",
					"preority": 1,
					"area": []
				},
				"TutorPagiWidget": {
					"title": "TutorPagiWidget",
					"description": "",
					"preority": 1,
					"area": []
				},
				"TutorSubCoursesWidget": {
					"title": "TutorSubCoursesWidget",
					"description": "",
					"preority": 1,
					"area": []
				}
			},
			"extentions": {
				"CourseTypeSelector": {
					"title": "CourseTypeSelector",
					"description": "",
					"preority": 1,
					"area": [
						{
							"id": "single_course"
						},
						{
							"id": "curent-course-content"
						},
						{
							"id": "single-course-left-aside"
						},
						{
							"id": "single-course-lessons-left-aside"
						},
						{
							"id": "current-course-aside"
						}
					]
				},
				"CurrentCourseTranslation": {
					"title": "CurrentCourseTranslation",
					"description": "",
					"preority": 1,
					"area": [
						{
							"id": "single_course"
						},
						{
							"id": "curent-course-content"
						},
						{
							"id": "single-course-left-aside"
						},
						{
							"id": "single-course-lessons-left-aside"
						},
						{
							"id": "current-course-aside"
						}
					]
				},
				"GotoCourseLessons": {
					"title": "GotoCourseLessons",
					"description": "",
					"preority": 1,
					"area": [
						{
							"id": "single_course"
						},
						{
							"id": "curent-course-content"
						},
						{
							"id": "single-course-left-aside"
						},
						{
							"id": "single-course-lessons-left-aside"
						},
						{
							"id": "current-course-aside"
						}
					]
				},
				"TutorCourseFreeLessonsWidget": {
					"title": "Links to free lessons of Course",
					"description": "",
					"preority": 1,
					"area": [
						{
							"id": "single_course"
						},
						{
							"id": "curent-course-content"
						},
						{
							"id": "single-course-left-aside"
						},
						{
							"id": "single-course-lessons-left-aside"
						},
						{
							"id": "current-course-aside"
						}
					]
				},
				"TutorCurContentWidget": {
					"title": "Content of current",
					"description": "",
					"preority": 1,
					"area": [
						{
							"id": "single_course"
						},
						{
							"id": "curent-course-content"
						},
						{
							"id": "single-facultet-left-aside"
						},
						{
							"id": "lesson-quote-footer"
						},
						{
							"id": "single-result-left-aside"
						},
						{
							"id": "single-course-left-aside"
						},
						{
							"id": "single-course-lessons-left-aside"
						},
						{
							"id": "single-article-left-aside"
						},
						{
							"id": "single-article-right-aside"
						},
						{
							"id": "single-event-left-aside"
						},
						{
							"id": "single-test-left-aside"
						},
						{
							"id": "translation-menu"
						},
						{
							"id": "current-course-aside"
						},
						{
							"id": "room"
						}
					]
				},
				"TutorCurrentClassWidget": {
					"title": "Buttons List of Classes of current",
					"description": "",
					"preority": 1,
					"area": [
						{
							"id": "lesson-quote-footer"
						},
						{
							"id": "single-result-left-aside"
						},
						{
							"id": "single-article-left-aside"
						},
						{
							"id": "single-article-right-aside"
						},
						{
							"id": "single-event-left-aside"
						},
						{
							"id": "single-test-left-aside"
						}
					]
				},
				"TutorCurrentCourseWidget": {
					"title": "Buttons List of Courses of current",
					"description": "",
					"preority": 1,
					"area": [
						{
							"id": "lesson-quote-footer"
						},
						{
							"id": "single-result-left-aside"
						},
						{
							"id": "single-article-left-aside"
						},
						{
							"id": "single-article-right-aside"
						},
						{
							"id": "single-event-left-aside"
						},
						{
							"id": "single-test-left-aside"
						}
					]
				},
				"TutorCurrentFacultetWidget": {
					"title": "Buttons List of Facultets of current",
					"description": "",
					"preority": 1,
					"area": [
						{
							"id": "single_course"
						},
						{
							"id": "curent-course-content"
						},
						{
							"id": "single-result-left-aside"
						},
						{
							"id": "single-course-left-aside"
						},
						{
							"id": "single-course-lessons-left-aside"
						},
						{
							"id": "current-course-aside"
						}
					]
				},
				"TutorCurrentThemeWidget": {
					"title": "Buttons List of Themes of current",
					"description": "",
					"preority": 1,
					"area": [
						{
							"id": "lesson-quote-footer"
						},
						{
							"id": "single-result-left-aside"
						},
						{
							"id": "single-article-left-aside"
						},
						{
							"id": "single-article-right-aside"
						},
						{
							"id": "single-test-left-aside"
						}
					]
				},
				"TutorFacultetResultsWidget": {
					"title": "Results carousel",
					"description": "",
					"preority": 1,
					"area": [
						{
							"id": "single-facultet-left-aside"
						}
					]
				},
				"TutorLessonFilesWidget": {
					"title": "Links to Lesson's includes",
					"description": "",
					"preority": 1,
					"area": [
						{
							"id": "lesson-quote-footer"
						},
						{
							"id": "single-article-left-aside"
						}
					]
				}
			}
		},
		"pe-fest-module": {
			"commentary": "pe fest",
			"id": "pe-fest-module",
			"title": "WP Fest remote services",
			"description": "WP Fest",
			"preority": 1,
			"required": "pe_remotes",
			"version": "0.1.0",
			"author": "genag1@list.ru",
			"documentation": "",
			"git": "https://gitlab.com/protopiahome/inner-projects/protopia-home-public-portal/protopia-home-public-admin/-/tree/master",
			"views": {
				"TutorWPFest": {
					"title": "Страница «Фестиваль»",
					"description": "Лицевая страница сервиса PE-Fest. Включает все экраны.",
					"fields": [
						{
							"route_data": {
								"type": "object",
								"title" : "External Fest data",
								"fields": {											
									"url": {
										"type": "url",
										"commentary" : "",
										"title" : "source Fest URL"
									},
									"blog_id": {
										"type": "string",
										"commentary" : "",
										"title" : "source Fest blog ID"
									}
								}
							}
						}

					]
				},
				"WPFESTAdmiState": {
					"title": "WPFESTAdmiState",
					"description": ""
				}
			},
			"widgets": {
				"WPFestHeader": {
					"title": "WPFestHeader",
					"description": ""
				}
			},
			"extentions": {}
		}
	},
	"widgets": {
		"Aside": {
			"title": "Aside Area widgets",
			"description": ""
		},
		"SearchBlock": {
			"description": "",
			"title": "Search form"
		},
		"FreeHTMLWidget": {
			"title": "Free html text",
			"description": "",
			"fields": [
				{
					"title": "html",
					"type": "code"
				},
				{
					"title": "container_class",
					"type": "string"
				}
			]
		},
		"FreeNavLinkWidget": {
			"title": "Free NavLink ",
			"description": "",
			"fields": [
				{
					"title": "link_route",
					"type": "string"
				},
				{
					"title": "className",
					"type": "string"
				},
				{
					"title": "activeClassName",
					"type": "string"
				},
				{
					"title": "label",
					"type": "string"
				}
			]
		},
		"FreeRouteWidget": {
			"title": "Free Route",
			"description": "Добавляет новую страницу в Карту Сайта. Будьте внимательны - роутинг добавится в ту родительскую область бла-бла-бла",
			"fields": [
				{
					"title": "preroute",
					"type": "string"
				},
				{
					"title": "link_route",
					"type": "string"
				},
				{
					"title": "component_names",
					"type": "string"
				},
				{
					"title": "className",
					"type": "string"
				},
				{
					"title": "activeClassName",
					"type": "string"
				},
				{
					"title": "label",
					"type": "string"
				}
			]
		},
		"UsersLockLabelWidget": {
			"title": "Users Lock Label Widget",
			"description": "",
			"fields": [
				{
					"title": "data_type",
					"type": "string"
				}
			]
		}
	},
	"extentions": {
		"CurrentUserPanelWidget": {
			"title": "Панель текущего пользователя",
			"description": "",
			"preority": 1,
			"area": [
				{
					"id": "layout-before-left-menu"
				},
				{
					"id": "layout-after-left-menu"
				}
			],
			"fields":[
				{
					"title": "user",
					"type": "User"
				}
			],
			"module" : "pe-basic"	
		}
	},
	"widget-area": {
		"layout-app": {
			"title": "Main layout application",
			"description": "Main layout application",
			"preority": 1,
			"area": [ ]
		},		
		"main-routes": {
			"title": "main routes area",
			"description": "Add route to main content area",
			"preority": 1,
			"area": [
				{
					"component": "FreeRouteWidget",
					"component_names" : ["AdminMenuView"],
					"preroute": "hidden-routes",
					"link_route" : ["site-map"]
				}
			],
			"module":"pe-basic"
		},
		"layout-left": {
			"title": "Header Link",
			"description": "Полностью заменить ту часть шапки, где находятся лого и название сайта",
			"area": []
		},
		"before-profile": {
			"title": "Before Profile",
			"description": "В правлй части шапки находится область пользовательского профиля. Данное гнездо заполняет область слева от профиля.",
			"area": [
				{
					"component": "SearchBlock"
				}
			]
		},
		"layout-header": {
			"title": "Header",
			"description": "Заменить полностью шапку сайта. Демонстрируется на каждой странице.",
			"area": []
		},
		"before-layout-header": {
			"title": "Before Header",
			"description": "Гнездо находится в центре шапки, слева от области Главного меню.",
			"area": []
		},
		"layout-header-after-menu": {
			"title": "Header after Menu",
			"description": "Гнездо находится в центре шапки, права от области Главного меню и слева от пользовательского профиля.",
			"area": []
		},
		"unlogin_panel": {
			"title": "Unlogin Panel",
			"description": "Гнездо находится в шапке сайта и подменяет область Профиля текущего Пользователя, когда он зарегистрирован.",
			"area": []
		},
		"login_panel": {
			"title": "Login Panel",
			"description": "Гнездо находится в шапке сайта и подменяет область Профиля текущего Пользователя, когда пользавотель ещё не залогинился.",
			"area": []
		},
		"layout-before-left-menu" : {
			"title": "До кнопок левого меню",
			"description": "Гнездо находится в группе Меню слева от контента, сразу перед первой кнопкой меню.",
			"area": []
		}, 
		"layout-after-left-menu" : {
			"title": "После кнопок левого меню",
			"description": "Гнездо находится в группе Меню слева от контента, сразу после последней кнопкой меню.",
			"area": [
				{
					"component": "SearchBlock"
				}	
			]
		}, 
		"pagination": {
			"title": "Pagination",
			"description": "Гнездо находится во всех областях пагинации (области кнопок переключения страниц)",
			"area": [
				{
					"component": "PagiWidget"
				}
			]
		},
		"layout-footer": {
			"title": "Заменить полностью подвал сайта. Демонстрируется на каждой странице.",
			"description": "Main Footer.",
			"area": []
		},
		"aside-left": {
			"description": "Некоторые страницы имеют вертикальные области (справа или слева от области контента), предназначенные для монтирования контентных виджетов.",
			"title": "Widget area in every Area. Config by routing",
			"area": [
				{
					"component": "Aside"
				}
			]
		},
		"menu-left-element": {
			"title": "Left Menu element",
			"description": "Гнездо монтирует виджеты в каждый элемент левого меню сайта",
			"area": []
		},
		"ontableRow": {
			"description": "В адинке сайта, на страницах таблиц Типов данных это Гнездо подменяет значения каждой ячейки таблицы.",
			"title": "Cell",
			"fields": [
				{
					"title": "state",
					"type": "code"
				},
				{
					"title": "id",
					"type": "string"
				},
				{
					"title": "data_type",
					"type": "string"
				},
				{
					"title": "elem",
					"type": "data"
				},
				{
					"title": "location",
					"type": "data"
				},
				{
					"title": "level",
					"type": "number"
				},
				{
					"title": "route",
					"type": "string"
				},
				{
					"title": "isNew",
					"type": "boolean"
				},
				{
					"title": "trColor",
					"type": "color"
				},
				{
					"title": "query",
					"type": "string"
				},
				{
					"title": "mutation_delete",
					"type": "string"
				},
				{
					"title": "query_name",
					"type": "string"
				},
				{
					"title": "mutation_name",
					"type": "string"
				},
				{
					"title": "i",
					"type": "number"
				},
				{
					"title": "current",
					"type": "number"
				}
			],
			"area": []
		},
		"single_course": {
			"title": "Before Course's Guest ",
			"description": "Before every Course's Guest Page",
			"area": [
				{
					"component": "GotoCourseLessons"
				},
				{
					"component": "PriceLabel"
				}
			]
		},
		"landing-object": {
			"title": "Landing object's parameter",
			"description": "in admin From",
			"area": [
				{
					"component": "LandingObject"
				}
			]
		}
	},
	"schema": {
		"Options": {
			"admin_data": {
				"fill": [
					"#426d8c",
					"#223746"
				]
			},
			"apollo_fields": {
				"id": {
					"type": "string",
					"title": "id",
					"thread": 0,
					"editable": 0
				},
				"name":{
					"type": "string",
					"title": "App title",
					"tab":"app",
					"thread": 0,
					"editable": 1
				},
				"description":{
					"type": "string",
					"title": "App description",
					"tab":"app",
					"thread": 0,
					"editable": 1
				},
				"email": {
					"type": "email",
					"title": "Administrator email",
					"thread": 0,
					"editable": 1
				},
				"adress": {
					"type": "string",
					"title": "Public address",
					"thread": 0,
					"editable": 1
				},    
				"help_url": {
					"type": "URL",
					"title": "Help site URL",
					"thread": 0,
					"editable": 1
				},  
				"vk": {
					"type": "URL",
					"title": "VK link",
					"thread": 0,
					"editable": 1
				},  
				"youtube": {
					"type": "URL",
					"title": "youtube link",
					"thread": 0,
					"editable": 1
				},  
				"default_img_name": {
					"type": "text",
					"title": "Название иконки",
					"thread": 0,
					"editable": 0,
					"hidden": 1
				},
				"default_img_id": {
					"type": "text",
					"title": "id иконки",
					"thread": 0,
					"editable": 1,
					"hidden": 1
				},
				"default_img": {
					"type": "media",
					"title": "Default image",
					"thread": 0,
					"editable": 1
				},
				"thumbnail_name": {
					"type": "text",
					"title": "Название иконки",
					"thread": 0,
					"editable": 0,
					"hidden": 1
				},
				"thumbnail_id": {
					"type": "text",
					"title": "id иконки",
					"thread": 0,
					"editable": 0,
					"hidden": 1
				},
				"thumbnail": {
					"type": "media",
					"title": "Main thumbnail",
					"thread": 0,
					"editable": 1
				} ,
				"user_verify_account":
				{
					"type": "boolean",
					"title": "New User must e-mail acivate account",
					"thread": 0,
					"editable": 1,
					"hidden": 0
				}
			},
			"visibled_value": "post_title",
			"name": "Option",
			"plural": "Option",
			"module":"pe-admin-module"
		},
		"Bio_Facultet": {
			"admin_data": {
				"filter": {
					"parent": {
						"type": "string",
						"value": "0"
					},
					"order_by_meta": {
						"type": "string",
						"value": "order"
					},
					"order": {
						"type": "string",
						"value": "ASC"
					}
				},
				"fill": [
					"#B6D94C",
					"#728C23"
				]
			},
			"apollo_fields": {
				"id": {
					"type": "string",
					"title": "id",
					"thread": 0,
					"editable": 0
				},
				"post_title": {
					"type": "string",
					"title": "Заголовок",
					"thread": 1,
					"editable": 1
				},
				"post_content": {
					"type": "text",
					"title": "Подробное описание",
					"thread": 0,
					"editable": 1
				},
				"post_author": {
					"kind": "type",
					"type": "external",
					"component": "User",
					"title": "Автор",
					"external_fields": [
						"id",
						"display_name"
					],
					"thread": 0,
					"editable": 1
				},
				"thumbnail_id": {
					"type": "string",
					"title": "Thumbnail id",
					"thread": 0,
					"editable": 0,
					"hidden": 1
				},
				"thumbnail_name": {
					"type": "string",
					"title": "Thumbnail name",
					"thread": 0,
					"editable": 1,
					"hidden": 1
				},
				"thumbnail": {
					"type": "media",
					"title": "Thumbnail",
					"thread": 1,
					"editable": 1
				},
				"icon_id": {
					"type": "string",
					"title": "Icon id",
					"thread": 0,
					"editable": 1,
					"hidden": 1
				},
				"icon_name": {
					"type": "text",
					"title": "Icon name",
					"thread": 0,
					"editable": 1,
					"hidden": 1
				},
				"icon": {
					"type": "media",
					"title": "Icon",
					"thread": 1,
					"editable": 1
				},
				"price": {
					"type": "int",
					"title": "Price",
					"thread": 1,
					"editable": 1
				},
				"order": {
					"type": "int",
					"title": "Порядковый номер",
					"thread": 1,
					"editable": 1
				}
			},
			"visibled_value": "post_title",
			"name": "Facultet",
			"plural": "Facultets",
			"module":"pe-oraculi-module"
		},
		"Bio_Course": {
			"admin_data": {
				"filter": {
					"parent": {
						"type": "string",
						"value": "0"
					},
					"order_by_meta": {
						"type": "string",
						"value": "order"
					},
					"order": {
						"type": "string",
						"value": "ASC"
					}
				},
				"fill": [
					"#B6D94C",
					"#728C23"
				]
			},
			"apollo_fields": {
				"id": {
					"type": "string",
					"title": "id",
					"thread": 0,
					"editable": 0,
					"hidden":1
				},
				"post_title": {
					"type": "string",
					"title": "Title",
					"thread": 1,
					"editable": 1
				},
				"post_content": {
					"type": "text",
					"title": "Content",
					"thread": 0,
					"editable": 1
				},
				"thumbnail_name": {
					"type": "text",
					"title": "Thumbnail name",
					"thread": 0,
					"editable": 1,
					"hidden": 1
				},
				"thumbnail": {
					"type": "media",
					"title": "Thumbnail",
					"thread": 1,
					"editable": 1
				},
				"bio_facultet": {
					"type": "external",
					"kind": "type",
					"component": "Bio_Facultet",
					"filter_type": "taxonomies",
					"external_fields": [
						"id",
						"post_title"
					],
					"title": "Facultet",
					"thread": 1,
					"editable": 1,
					"hidden": 0
				},
				"parent": {
					"type": "external",
					"kind": "type",
					"component": "Bio_Course",
					"external_fields": [
						"id",
						"post_title"
					],
					"title": "Parent",
					"thread": 1,
					"editable": 0,
					"hidden": 1
				},
				"children": {
					"title": "Дочерние Курсы",
					"type": "array",
					"kind": "type",
					"component": "Bio_Course",
					"external_fields": [
						"id",
						"post_title",
						"post_content",
						"post_date",
						"parent",
						"thumbnail_name",
						"thumbnail",
						"children",
						"price",
						"order"
					],
					"thread": 0,
					"editable": 0,
					"hidden": 1
				},
				"price": {
					"type": "int",
					"title": "Price",
					"thread": 1,
					"editable": 1
				},
				"order": {
					"type": "int",
					"title": "Order",
					"thread": 1,
					"editable": 1
				},
				"locked": {
					"type": "boolean",
					"title": "Locked",
					"thread": 1,
					"editable": 1,
					"col_width": 80
				},
				"is_closed": {
					"type": "boolean",
					"title": "Hide request membership",
					"thread": 1,
					"editable": 1,
					"col_width": 70
				},
				"is_member": {
					"type": "boolean",
					"title": "Current User is member",
					"thread": 0,
					"editable": 0,
					"col_width": 80
				}
			},
			"visibled_value": "post_title",
			"name": "Course",
			"plural": "Courses",
			"module":"pe-oraculi-module"
		},
		"Bio_Class": {
			"admin_data": {
				"filter": {
					"parent": {
						"type": "string",
						"value": "0"
					},
					"order_by_meta": {
						"type": "string",
						"value": "order"
					},
					"order": {
						"type": "string",
						"value": "ASC"
					}
				},
				"fill": [
					"#426d8c",
					"#223746"
				]
			},
			"apollo_fields": {
				"id": {
					"type": "string",
					"title": "id",
					"thread": 0,
					"editable": 0
				},
				"post_title": {
					"type": "string",
					"title": "Title",
					"thread": 1,
					"editable": 1
				},
				"post_content": {
					"type": "text",
					"title": "Content",
					"thread": 0,
					"editable": 1
				},
				"order": {
					"type": "int",
					"title": "Order",
					"thread": 1,
					"editable": 1
				}
			},
			"visibled_value": "post_title",
			"name": "Class",
			"plural": "Classes",
			"module":"pe-oraculi-module"
		},
		"Bio_Biology_Theme": {
			"admin_data": {
				"fill": [
					"#bb5fac",
					"#8a497f"
				]
			},
			"apollo_fields": {
				"id": {
					"type": "string",
					"title": "id",
					"thread": 0,
					"editable": 0,
					"hidden":1
				},
				"post_title": {
					"type": "string",
					"title": "Заголовок",
					"thread": 1,
					"editable": 1
				},
				"thumbnail": {
					"type": "media",
					"title": "Thumbnail",
					"thread": 1,
					"editable": 1
				},
				"thumbnail_id": {
					"type": "string",
					"title": "Thumbnail id",
					"thread": 0,
					"editable": 0,
					"hidden": 1
				},
				"icon_id": {
					"type": "string",
					"title": "Icon id",
					"thread": 0,
					"editable": 1,
					"hidden": 1
				},
				"icon": {
					"type": "media",
					"title": "Icon",
					"thread": 1,
					"editable": 1
				},
				"post_content": {
					"type": "text",
					"title": "Подробное описание",
					"thread": 0,
					"editable": 1
				},
				"order": {
					"type": "int",
					"title": "Order",
					"thread": 1,
					"editable": 1
				},
				"articles": {
					"title": "Articles",
					"type": "array",
					"kind": "type",
					"component": "Bio_Article",
					"external_fields": [
						"id",
						"post_title",
						"post_content",
						"post_date",
						"parent",
						"thumbnail_name",
						"thumbnail"
					],
					"thread": 0,
					"editable": 0,
					"hidden": 1
				},
				"bio_test": {
					"title": "Tests",
					"type": "array",
					"kind": "type",
					"component": "Bio_Test",
					"external_fields": [
						"id",
						"post_title",
						"post_content",
						"post_date",
						"parent",
						"thumbnail_name",
						"thumbnail"
					],
					"thread": 0,
					"editable": 0,
					"hidden": 1
				}
			},
			"visibled_value": "post_title",
			"name": "Theme",
			"plural": "Themes",
			"module":"pe-oraculi-module"
		},
		"Bio_Test_Category": {
			"admin_data": {
				"fill": [
					"#6cc76b",
					"#539452"
				]
			},
			"apollo_fields": {
				"id": {
					"type": "string",
					"title": "id",
					"thread": 0,
					"editable": 0
				},
				"post_title": {
					"type": "string",
					"title": "Заголовок",
					"thread": 1,
					"editable": 1
				},
				"post_content": {
					"type": "text",
					"title": "Подробное описание",
					"thread": 0,
					"editable": 1
				}
			},
			"visibled_value": "post_title",
			"name": "Test Category",
			"plural": "Test Categories",
			"module":"pe-oraculi-module"
		},
		"Bio_Role_Taxonomy": {
			"admin_data": {
				"fill": [
					"#B6D94C",
					"#728C23"
				]
			},
			"apollo_fields": {
				"id": {
					"type": "string",
					"title": "id",
					"thread": 0,
					"editable": 0
				},
				"post_title": {
					"type": "string",
					"title": "Title",
					"thread": 1,
					"editable": 1
				},
				"post_content": {
					"type": "text",
					"title": "Content",
					"thread": 0,
					"editable": 1
				}
			},
			"visibled_value": "post_title",
			"name": "Role Taxonomy",
			"plural": "Role Taxonomies",
			"module":"pe-oraculi-module"
		},
		"Bio_Olimpiad_Type": {
			"admin_data": {
				"fill": [
					"#ce8c3b",
					"#ad7734"
				]
			},
			"apollo_fields": {
				"id": {
					"type": "string",
					"title": "id",
					"thread": 0,
					"editable": 0
				},
				"post_title": {
					"type": "string",
					"title": "Заголовок",
					"thread": 1,
					"editable": 1
				},
				"post_content": {
					"type": "text",
					"title": "Подробное описание",
					"thread": 0,
					"editable": 1
				}
			},
			"visibled_value": "post_title",
			"name": "Olympiad Type",
			"plural": "Olympiad Types",
			"module":"pe-oraculi-module"
		},
		"Bio_Mailing_Group": {
			"admin_data": {
				"fill": [
					"#B6D94C",
					"#728C23"
				]
			},
			"apollo_fields": {
				"id": {
					"type": "string",
					"title": "id",
					"thread": 0,
					"editable": 0
				},
				"post_title": {
					"type": "string",
					"title": "Title",
					"thread": 1,
					"editable": 1
				},
				"post_content": {
					"type": "text",
					"title": "Description",
					"thread": 0,
					"editable": 1
				}
			},
			"visibled_value": "post_title",
			"name": "Mailing Group",
			"plural": "Mailing Groups",
			"module":"pe-oraculi-module"
		},
		"Bio_Article": {
			"admin_data": {
				"filter": {
					"order_by_meta": {
						"type": "string",
						"value": "order"
					},
					"order": {
						"type": "string",
						"value": "ASC"
					}
				},
				"fill": [
					"#41d8a0",
					"#3abf8e"
				],
				"__table_type__": "tab",
				"__tab_field__": "bio_course"
			},
			"apollo_fields": {
				"id": {
					"type": "string",
					"title": "id",
					"thread": 0,
					"editable": 0
				},
				"post_title": {
					"type": "string",
					"title": "Title",
					"thread": 1,
					"editable": 1
				},
				"post_content": {
					"type": "text",
					"title": "Content",
					"thread": 0,
					"editable": 1
				},
				"thumbnail": {
					"type": "media",
					"title": "Thumbnail",
					"thread": 0,
					"editable": 1
				},
				"bio_course": {
					"type": "array",
					"kind": "type",
					"filter_type": "taxonomies",
					"component": "Bio_Course",
					"title": "Courses",
					"external_fields": [
						"id",
						"post_title"
					],
					"thread": 1,
					"editable": 1
				},
				"bio_class": {
					"type": "array",
					"kind": "type",
					"filter_type": "taxonomies",
					"component": "Bio_Class",
					"title": "Classes",
					"external_fields": [
						"id",
						"post_title"
					],
					"thread": 1,
					"editable": 1
				},
				"bio_biology_theme": {
					"type": "array",
					"kind": "type",
					"filter_type": "taxonomies",
					"component": "Bio_Biology_Theme",
					"title": "Themes",
					"external_fields": [
						"id",
						"post_title"
					],
					"thread": 1,
					"editable": 1
				},
				"bio_olimpiad_type": {
					"type": "array",
					"kind": "type",
					"filter_type": "taxonomies",
					"component": "Bio_Olimpiad_Type",
					"title": "Olimpiad Types",
					"external_fields": [
						"id",
						"post_title"
					],
					"thread": 1,
					"editable": 1
				},
				"bio_role_taxonomy": {
					"type": "array",
					"kind": "type",
					"filter_type": "taxonomies",
					"component": "Bio_Role_Taxonomy",
					"title": "Role Taxonomies",
					"external_fields": [
						"id",
						"post_title"
					],
					"thread": 0,
					"editable": 1
				},
				"order": {
					"type": "int",
					"title": "Order",
					"thread": 1,
					"editable": 1
				},
				"post_date": {
					"type": "date",
					"title": "Date",
					"thread": 0,
					"editable": 1
				},
				"post_author": {
					"kind": "type",
					"type": "external",
					"component": "User",
					"title": "Автор",
					"external_fields": [
						"id",
						"display_name"
					],
					"thread": 0,
					"editable": 1
				},
				"is_favorite": {
					"type": "boolean",
					"title": "Is Favorite for current User",
					"thread": 0,
					"editable": 0
				},
				"is_member": {
					"type": "boolean",
					"title": "Current User is member",
					"thread": 1,
					"editable": 0
				},
				"is_free": {
					"type": "boolean",
					"filter_type": "meta",
					"title": "Free content",
					"thread": 1,
					"editable": 1
				},
				"is_logged_in": {
					"type": "boolean",
					"filter_type": "meta",
					"title": "Hide for unloggeds",
					"thread": 1,
					"editable": 1
				}
			},
			"visibled_value": "post_title",
			"name": "Урок",
			"plural": "Уроки",
			"module":"pe-oraculi-module",
			"view": "TutorLesson"
		},
		"Bio_Event": {
			"admin_data": {
				"fill": [
					"#B6D94C",
					"#728C23"
				]
			},
			"apollo_fields": {
				"id": {
					"type": "string",
					"title": "id",
					"thread": 0,
					"editable": 0
				},
				"post_title": {
					"type": "string",
					"title": "Заголовок",
					"thread": 1,
					"editable": 1
				},
				"post_content": {
					"type": "text",
					"title": "Подробное описание",
					"thread": 0,
					"editable": 1
				},
				"thumbnail": {
					"type": "media",
					"title": "Thumbnail",
					"thread": 0,
					"editable": 1
				},
				"bio_course": {
					"type": "array",
					"kind": "type",
					"filter_type": "taxonomies",
					"component": "Bio_Course",
					"title": "Course",
					"external_fields": [
						"id",
						"post_title"
					],
					"thread": 1,
					"editable": 1
				},
				"bio_class": {
					"type": "array",
					"kind": "type",
					"filter_type": "taxonomies",
					"component": "Bio_Class",
					"title": "Classes",
					"external_fields": [
						"id",
						"post_title"
					],
					"thread": 1,
					"editable": 1
				},
				"bio_biology_theme": {
					"type": "array",
					"kind": "type",
					"filter_type": "taxonomies",
					"component": "Bio_Biology_Theme",
					"title": "Themes",
					"external_fields": [
						"id",
						"post_title"
					],
					"thread": 1,
					"editable": 1
				},
				"bio_olimpiad_type": {
					"type": "array",
					"kind": "type",
					"filter_type": "taxonomies",
					"component": "Bio_Olimpiad_Type",
					"title": "Olimpiad Types",
					"external_fields": [
						"id",
						"post_title"
					],
					"thread": 1,
					"editable": 1
				},
				"test_id": {
					"type": "external",
					"kind": "type",
					"filter_type": "meta",
					"component": "Bio_Test",
					"title": "Test",
					"external_fields": [
						"id",
						"post_title"
					],
					"thread": 1,
					"editable": 1
				},
				"time": {
					"type": "date",
					"title": "Date",
					"thread": 1,
					"editable": 1
				},
				"request_count": {
					"type": "number",
					"title": "Request Count",
					"thread": 0,
					"editable": 0,
					"hidden": 1
				},
				"post_author": {
					"kind": "type",
					"type": "external",
					"component": "User",
					"title": "Автор",
					"external_fields": [
						"id",
						"display_name"
					],
					"thread": 0,
					"editable": 1
				}
			},
			"visibled_value": "post_title",
			"name": "Event",
			"plural": "Events",
			"module":"pe-oraculi-module"
		},
		"Bio_Test": {
			"admin_data": {
				"fill": [
					"#B6D94C",
					"#728C23"
				]
			},
			"apollo_fields": {
				"id": {
					"type": "string",
					"title": "id",
					"thread": 0,
					"editable": 0
				},
				"post_title": {
					"type": "string",
					"title": "Title",
					"thread": 1,
					"editable": 1
				},
				"post_content": {
					"type": "text",
					"title": "Content",
					"thread": 0,
					"editable": 1
				},
				"bio_course": {
					"type": "array",
					"kind": "type",
					"filter_type": "taxonomies",
					"component": "Bio_Course",
					"title": "Course",
					"external_fields": [
						"id",
						"post_title"
					],
					"thread": 1,
					"editable": 1
				},
				"bio_biology_theme": {
					"type": "array",
					"kind": "type",
					"filter_type": "taxonomies",
					"component": "Bio_Biology_Theme",
					"title": "Themes",
					"external_fields": [
						"id",
						"post_title"
					],
					"thread": 1,
					"editable": 1
				},
				"bio_olimpiad_type": {
					"type": "array",
					"kind": "type",
					"filter_type": "taxonomies",
					"component": "Bio_Olimpiad_Type",
					"title": "Olimpiad Types",
					"external_fields": [
						"id",
						"post_title"
					],
					"thread": 1,
					"editable": 1
				},
				"bio_class": {
					"type": "array",
					"kind": "type",
					"filter_type": "taxonomies",
					"component": "Bio_Class",
					"title": "Class",
					"external_fields": [
						"id",
						"post_title"
					],
					"thread": 1,
					"editable": 1
				},
				"bio_test_category": {
					"type": "array",
					"kind": "type",
					"filter_type": "taxonomies",
					"component": "Bio_Test_Category",
					"title": "Test Category",
					"external_fields": [
						"id",
						"post_title"
					],
					"thread": 1,
					"editable": 1
				},
				"is_show_answer": {
					"type": "boolean",
					"filter_type": "meta",
					"title": "Show right answer after choose",
					"thread": 0,
					"editable": 1
				},
				"is_show_results": {
					"type": "boolean",
					"filter_type": "meta",
					"title": "Show result after test",
					"thread": 0,
					"editable": 1
				},
				"is_shuffle": {
					"type": "boolean",
					"filter_type": "meta",
					"title": "Shuffle Questions?",
					"thread": 0,
					"editable": 1
				},
				"is_timed": {
					"type": "boolean",
					"filter_type": "meta",
					"title": "With time limit",
					"thread": 1,
					"editable": 1
				},
				"duration": {
					"type": "int",
					"title": "Duration per sec",
					"thread": 1,
					"editable": 1
				},
				"try_count": {
					"type": "int",
					"title": "Try count.",
					"thread": 1,
					"editable": 1
				},
				"publish_type": {
					"type": "radio",
					"filter_type": "meta",
					"values": [
						{
							"_id": 1,
							"title": "Standart"
						},
						{
							"_id": 2,
							"title": "Course Electronic"
						},
						{
							"_id": 3,
							"title": "Course Intramural"
						}
					],
					"title": "Publish type",
					"thread": 1,
					"editable": 1
				},
				"questions": {
					"type": "array",
					"kind": "type",
					"component": "Bio_TestQuestion",
					"title": "Questions",
					"external_fields": [
						"id",
						"post_title"
					],
					"thread": 0,
					"editable": 1,
					"hidden": 1
				}
			},
			"visibled_value": "post_title",
			"name": "Test",
			"plural": "Tests",
			"module":"pe-oraculi-module"
		},
		"Bio_TestQuestion": {
			"admin_data": {
				"fill": [
					"#B6D94C",
					"#728C23"
				]
			},
			"apollo_fields": {
				"id": {
					"type": "string",
					"title": "id",
					"thread": 0,
					"editable": 0
				},
				"post_title": {
					"type": "string",
					"title": "Заголовок",
					"thread": 0,
					"editable": 0,
					"hidden": 1
				},
				"thumbnail": {
					"type": "media",
					"title": "Thumbnail",
					"thread": 1,
					"editable": 1
				},
				"post_content": {
					"type": "text",
					"title": "Подробное описание",
					"thread": 1,
					"editable": 1
				},
				"answers": {
					"type": "array",
					"kind": "type",
					"component": "Bio_TestQuestionAnswer",
					"title": "Answers",
					"external_fields": [
						"id",
						"post_content"
					],
					"thread": 0,
					"editable": 0
				},
				"hidden": {
					"type": "boolean",
					"title": "Need approve",
					"description": "Question wait approve by Administartors and hidden for Pupils (YES) or available add to Test (NO).",
					"filter_type": "meta",
					"thread": 1,
					"editable": 1
				},
				"is_deleted": {
					"type": "boolean",
					"title": "Deleted",
					"thread": 0,
					"editable": 1,
					"hidden": 1
				},
				"single": {
					"type": "boolean",
					"title": "Need single answer",
					"filter_type": "meta",
					"thread": 1,
					"editable": 1
				},
				"type": {
					"type": "radio",
					"title": "Type",
					"filter_type": "meta",
					"values": [
						"multichoice",
						"truefalse",
						"matching"
					],
					"thread": 1,
					"editable": 1
				},
				"penalty": {
					"type": "String",
					"title": "penalty",
					"thread": 1,
					"editable": 1
				},
				"bio_test": {
					"type": "array",
					"kind": "type",
					"filter_type": "meta",
					"component": "Bio_Test",
					"title": "Test",
					"external_fields": [
						"id",
						"post_title"
					],
					"thread": 1,
					"editable": 1
				},
				"bio_biology_theme": {
					"kind": "type",
					"type": "external",
					"filter_type": "taxonomies",
					"component": "Bio_Biology_Theme",
					"title": "Theme",
					"external_fields": [
						"id",
						"post_title"
					],
					"thread": 1,
					"editable": 1
				},
				"post_author": {
					"kind": "type",
					"type": "external",
					"component": "User",
					"title": "Автор",
					"external_fields": [
						"id",
						"display_name"
					],
					"thread": 0,
					"editable": 1
				}
			},
			"visibled_value": "post_title",
			"name": "Test's Question",
			"plural": "Test's Questions",
			"module":"pe-oraculi-module"
		},
		"Bio_TestQuestionAnswer": {
			"admin_data": {
				"fill": [
					"#B6D94C",
					"#728C23"
				]
			},
			"apollo_fields": {
				"id": {
					"type": "string",
					"title": "id",
					"thread": 0,
					"editable": 0
				},
				"question_id": {
					"kind": "type",
					"type": "external",
					"component": "Bio_TestQuestion",
					"title": "Question",
					"external_fields": [
						"id",
						"post_title"
					],
					"thread": 0,
					"editable": 0
				},
				"is_deleted": {
					"type": "boolean",
					"title": "Is deleted",
					"thread": 0,
					"editable": 1
				},
				"is_subquestion": {
					"type": "boolean",
					"title": "Is subquestion",
					"thread": 0,
					"editable": 1
				},
				"subquestion_answer_id": {
					"type": "string",
					"title": "corresponding answer's ID",
					"thread": 0,
					"editable": 1
				},
				"order": {
					"type": "number",
					"title": "Order",
					"thread": 0,
					"editable": 1
				},
				"post_content": {
					"type": "text",
					"title": "Подробное описание",
					"thread": 0,
					"editable": 1
				}
			},
			"visibled_value": "post_content",
			"name": "Test's Question's Answer",
			"plural": "Test's Question's Answers",
			"module":"pe-oraculi-module"
		},
		"PE_ContactFormMessage": {
			"admin_data": {
				"fill": [
					"#394B59",
					"#30404D"
				]
			},
			"apollo_fields": {
				"id": {
					"type": "string",
					"title": "id",
					"thread": 0,
					"editable": 0
				},
				"post_title": {
					"type": "string",
					"title": "Заголовок",
					"thread": 1,
					"editable": 0
				},
				"post_content": {
					"type": "text",
					"title": "Content",
					"thread": 1,
					"editable": 0
				},
				"post_date": {
					"type": "date",
					"title": "Date",
					"thread": 1,
					"editable": 0
				},
				"post_author": {
					"kind": "type",
					"type": "external",
					"component": "User",
					"title": "Автор",
					"external_fields": [
						"id",
						"display_name"
					],
					"thread": 1,
					"editable": 0
				}
			},
			"visibled_value": "post_title",
			"name": "ContanctForm Message",
			"plural": "ContanctForm Messages",
			"module":"pe-landing-module"
		},
		"PEVideoPoint": {
			"admin_data": {
				"fill": [
					"#394B59",
					"#30404D"
				]
			},
			"apollo_fields": {
				"id": {
					"type": "string",
					"title": "id",
					"thread": 0,
					"editable": 0
				},
				"post_title": {
					"type": "string",
					"title": "Заголовок",
					"thread": 1,
					"editable": 1
				},
				"post_content": {
					"type": "text",
					"title": "Content",
					"thread": 0,
					"editable": 1
				},
				"post_date": {
					"type": "date",
					"title": "Date",
					"thread": 1,
					"editable": 1
				},
				"post_author": {
					"kind": "type",
					"type": "external",
					"component": "User",
					"title": "Автор",
					"external_fields": [
						"id",
						"display_name"
					],
					"thread": 1,
					"editable": 1
				},
				"geo_point": {
					"type": "geo",
					"title": "Geo coordinates",
					"thread": 1,
					"editable": 1
				},
				"type": {
					"type": "string",
					"title": "Point Type",
					"thread": 1,
					"editable": 0
				},
				"action_type": {
					"type": "radio",
					"title": "Paying tyoe",
					"values": [
						{
							"_id": "inner_link",
							"title": "inner link"
						},
						{
							"_id": "outer_url",
							"title": "outer url"
						},
						{
							"_id": "simple_text_dialog",
							"title": "Yandex simple text dialog"
						},
						{
							"_id": "youtube_dialog",
							"title": "youtube dialog"
						}
					],
					"thread": 0,
					"editable": 1
				},
				"service": {
					"type": "radio",
					"title": "Video service source",
					"values": [
						{
							"_id": "vimeo",
							"title": "Vimeo"
						},
						{
							"_id": "youtube",
							"title": "Youtube"
						}
					],
					"thread": 0,
					"editable": 1
				},
				"action_youtube_id": {
					"type": "string",
					"title": "Youtube ID",
					"thread": 1,
					"editable": 1
				},
				"description": {
					"type": "text",
					"title": "Description",
					"thread": 0,
					"editable": 1
				},
				"modestbranding": {
					"type": "boolean",
					"title": "Show hosting brand",
					"thread": 1,
					"editable": 1
				},
				"autoplay": {
					"type": "boolean",
					"title": "Autoplay",
					"thread": 1,
					"editable": 1
				},
				"controls": {
					"type": "boolean",
					"title": "Show controls",
					"thread": 1,
					"editable": 1
				},
				"mute": {
					"type": "boolean",
					"title": "Mute sound",
					"thread": 1,
					"editable": 1
				},
				"width": {
					"type": "string",
					"title": "Width",
					"thread": 0,
					"editable": 1
				},
				"height": {
					"type": "string",
					"title": "Height",
					"thread": 0,
					"editable": 1
				},
				"video_group": {
					"type": "string",
					"title": "Video groups",
					"thread": 0,
					"editable": 1
				},
				"author_name": {
					"type": "string",
					"title": "Video author",
					"thread": 1,
					"editable": 1
				},
				"author_link": {
					"type": "string",
					"title": "Video author's link",
					"thread": 0,
					"editable": 1
				}
			},
			"visibled_value": "post_title",
			"name": "Video Point",
			"plural": "Video Points",
			"module":"pe-landing-module"
		},
		"Comment": {
			"admin_data": {
				"fill": [
					"#B6D94C",
					"#728C23"
				]
			},
			"apollo_fields": {
				"id": {
					"type": "id",
					"title": "id",
					"thread": 0,
					"editable": 0
				},
				"discussion_id": {
					"type": "number",
					"title": "discussion_id",
					"thread": 0,
					"editable": 0
				},
				"discussion_type": {
					"type": "string",
					"title": "discussion_type",
					"thread": 0,
					"editable": 0
				},
				"discussion": {
					"kind": "type",
					"type": "external",
					"component": "Post",
					"title": "Дискуссия",
					"external_fields": [
						"id",
						"post_title"
					],
					"thread": 1,
					"editable": 0
				},
				"content": {
					"type": "text",
					"title": "Содержание",
					"thread": 1,
					"editable": 1
				},
				"parent": {
					"kind": "type",
					"type": "external",
					"component": "Comment",
					"title": "Родительский",
					"visibled_value": "content",
					"external_fields": [
						"id",
						"content"
					],
					"thread": 1,
					"editable": 0
				},
				"author": {
					"kind": "type",
					"type": "external",
					"component": "User",
					"title": "Автор",
					"external_fields": [
						"id",
						"display_name"
					],
					"thread": 0,
					"editable": 1
				}
			},
			"visibled_value": "content",
			"name": "Comment",
			"plural": "Comments",
			"module":"pe-basic-module"
		},
		"Post": {
			"admin_data": {
				"fill": []
			},
			"apollo_fields": {
				"id": {
					"type": "id",
					"title": "id",
					"thread": 0,
					"editable": 0
				},
				"post_title": {
					"type": "string",
					"title": "Заголовок",
					"thread": 1,
					"editable": 0
				},
				"post_content": {
					"type": "string",
					"title": "Описание",
					"thread": 1,
					"editable": 0
				}
			},
			"visibled_value": "post_title",
			"name": "Post",
			"plural": "Posts",
			"module":"pe-basic-module"
		},
		"MPayment": {
			"admin_data": {
				"fill": [
					"#B6D94C",
					"#728C23"
				]
			},
			"apollo_fields": {
				"id": {
					"type": "id",
					"title": "id",
					"thread": 0,
					"editable": 0
				},
				"post_title": {
					"type": "string",
					"title": "Заголовок",
					"thread": 1,
					"editable": 0
				},
				"post_content": {
					"type": "string",
					"title": "Описание",
					"thread": 1,
					"editable": 0
				},
				"summae": {
					"type": "int",
					"title": "Сумма",
					"thread": 1,
					"editable": 0
				},
				"is_success": {
					"type": "boolean",
					"title": "Is Success",
					"thread": 0,
					"editable": 0
				}
			},
			"name": "Payment",
			"plural": "Payments",
			"module":"pe-basic-module"
		},
		"Page": {
			"admin_data": {
				"fill": [
					"#B6D94C",
					"#728C23"
				]
			},
			"apollo_fields": {
				"id": {
					"type": "id",
					"title": "id",
					"thread": 0,
					"editable": 0
				},
				"post_title": {
					"type": "string",
					"title": "Заголовок",
					"thread": 1,
					"editable": 1
				}
			},
			"visibled_value": "post_title",
			"name": "Page",
			"plural": "Pages",
			"module":"pe-basic-module"
		},
		"PE_Translation": {
			"admin_data": {
				"fill": [
					"#394B59",
					"#30404D"
				]
			},
			"apollo_fields": {
				"id": {
					"type": "string",
					"title": "id",
					"thread": 0,
					"editable": 0
				},
				"post_title": {
					"type": "string",
					"title": "Title",
					"thread": 1,
					"editable": 1
				},
				"post_content": {
					"type": "text",
					"title": "Description",
					"thread": 0,
					"editable": 1
				},
				"start_date": {
					"type": "date",
					"title": "Start",
					"thread": 1,
					"editable": 1
				},
				"end_date": {
					"type": "date",
					"title": "Finish",
					"thread": 1,
					"editable": 1
				},
				"external_id": {
					"type": "string",
					"title": "Main Room ID",
					"thread": 0,
					"editable": 0,
					"hidden": 1
				},
				"external_title": {
					"type": "string",
					"title": "Main Room Title",
					"thread": 0,
					"editable": 0,
					"hidden": 1
				},
				"is_locked": {
					"type": "boolean",
					"title": "Is locked by password?",
					"thread": 1,
					"editable": 1
				},
				"pe_room": {
					"title": "Rooms",
					"type": "array",
					"kind": "type",
					"component": "PE_Room",
					"external_fields": [
						"id",
						"post_title"
					],
					"thread": 1,
					"editable": 0
				}
			},
			"visibled_value": "post_title",
			"name": "Transaction",
			"plural": "Transactions",
			"module":"pe-jitsi-module"
		},
		"PE_Room": {
			"admin_data": {
				"fill": [
					"#394B59",
					"#30404D"
				]
			},
			"apollo_fields": {
				"id": {
					"type": "string",
					"title": "id",
					"thread": 0,
					"editable": 0
				},
				"post_title": {
					"type": "string",
					"title": "Заголовок",
					"thread": 1,
					"editable": 1
				},
				"post_content": {
					"type": "text",
					"title": "Description",
					"thread": 0,
					"editable": 1
				},
				"external_id": {
					"type": "string",
					"title": "Main Room ID",
					"thread": 0,
					"editable": 0,
					"hidden": 1
				},
				"is_locked": {
					"type": "boolean",
					"title": "is locked by password?",
					"thread": 0,
					"editable": 0
				},
				"password": {
					"type": "string",
					"title": "password",
					"thread": 0,
					"editable": 0,
					"hidden": 1
				},
				"post_author": {
					"kind": "type",
					"type": "external",
					"component": "User",
					"title": "Автор",
					"external_fields": [
						"id",
						"display_name"
					],
					"thread": 1,
					"editable": 0
				},
				"pe_translation": {
					"title": "Трансляция",
					"kind": "type",
					"type": "external",
					"component": "PE_Translation",
					"external_fields": [
						"id",
						"post_title"
					],
					"thread": 1,
					"editable": 1
				}
			},
			"visibled_value": "post_title",
			"name": "Translation Room",
			"plural": "Translation Rooms",
			"module":"pe-jitsi-module"
		},
		"User": {
			"admin_data": {
				"fill": [
					"#5C255C",
					"#A854A8"
				]
			},
			"apollo_fields": {
				"id": {
					"type": "string",
					"title": "id",
					"thread": 0,
					"editable": 0
				},
				"user_login": {
					"type": "string",
					"title": "Email",
					"thread": 0,
					"editable": 0,
					"hidden": 1
				},
				"user_email": {
					"type": "string",
					"title": "Email",
					"thread": 1,
					"editable": 1
				},
				"post_content": {
					"type": "string",
					"title": "Content",
					"thread": 0,
					"editable": 1
				},
				"is_blocked": {
					"type": "boolean",
					"title": "Заблокирован?",
					"thread": 1,
					"editable": 1
				},
				"phone": {
					"type": "phone",
					"title": "Телефон",
					"thread": 0,
					"editable": 1
				},
				"first_name": {
					"type": "string",
					"title": "Имя",
					"thread": 0,
					"editable": 0,
					"hidden": 1
				},
				"last_name": {
					"type": "string",
					"title": "Фамилия",
					"thread": 0,
					"editable": 0,
					"hidden": 1
				},
				"display_name": {
					"type": "string",
					"title": "Экранное имя",
					"thread": 1,
					"editable": 1
				},
				"avatar": {
					"type": "media",
					"title": "Аватар",
					"thread": 1,
					"editable": 1,
					"isURLHide" : 0
				}, 
				"avatar_name": {
					"type": "string",
					"title": "Аватар название картинки",
					"thread": 0,
					"editable": 0
				}, 
				"roles": {
					"type": "checkbox",
					"component": "string",
					"values": [
						"administrator",
						"editor",
						"CourseLeader",
						"TestEditor",
						"contributor",
						"subscriber"
					],
					"title": "Roles",
					"thread": 1,
					"editable": 1
				}
			},
			"visibled_value": "display_name",
			"name": "Пользователь",
			"plural": "Пользователи",
			"module":"pe-basic-module"
		}
	},
	"routing": {
		"profile": [
			{
				"title": "Favorites",
				"icon": "fas fa-heart",
				"route": "favorites",
				"component": "TutorArticlesFavorite",
				"is_left": 0
			},
			{
				"title": "My tests",
				"icon": "fas fa-vial",
				"route": "tests-tesult",
				"component": "TutorUserTestResults",
				"is_left": 0
			},
			{
				"title": "Личные данные",
				"icon": "/assets/img/pe/profile.svg",
				"route": "profile",
				"component": "ProfileView",
				"is_left": 0
			},
			{
				"title": "Администрирование",
				"icon": "fas fa-tools",
				"target_id": "admin-settings"
			}
		],
		"extended_routes": [
			{
				"title": "Last issue",
				"icon": "",
				"route": "",
				"component": "LandingView",
				"id": "landing",
				"is_left": 0,
				"extend_params": {
					"id": "newKraeved"
				}
			},
			{
				"title": "#1 2020",
				"icon": "",
				"route": "1",
				"component": "LandingView",
				"id": "landing",
				"is_left": 0,
				"extend_params": {
					"id": "kraeved_1_2020"
				}
			},
			{
				"title": "#2 2020",
				"icon": "",
				"route": "2",
				"component": "LandingView",
				"id": "landing",
				"is_left": 0,
				"extend_params": {
					"id": "kraeved_2_2020"
				}
			},
			{
				"title": "#3 2021",
				"icon": "",
				"route": "3",
				"component": "LandingView",
				"id": "landing",
				"is_left": 0,
				"extend_params": {
					"id": "kraeved_3_2020"
				}
			},
			{
				"title": "Архив номеров",
				"icon": "",
				"route": "archive",
				"component": "LandingView",
				"id": "landing",
				"is_left": 0,
				"extend_params": {
					"id": "kraeved_archive"
				}
			},
			{
				"title": "разработка",
				"icon": "",
				"route": "exemm",
				"component": "LandingView",
				"id": "landing",
				"is_left": 0,
				"extend_params": {
					"id": "cards_drawer"
				}
			},
			{
				"title": "разработка",
				"icon": "",
				"route": "exemm2",
				"component": "LandingView",
				"id": "landing",
				"is_left": 0,
				"extend_params": {
					"id": "cards_drawer2"
				}
			},
			{
				"title": "Краевед №2.2020",
				"icon": "",
				"route": "2-2020",
				"component": "LandingView",
				"id": "landing",
				"is_left": 0,
				"extend_params": {
					"id": "kraeved_2_2020"
				}
			},
			{
				"title": "Личный кабинет",
				"icon": "",
				"route": "cabinet",
				"component": "MCabinet",
				"is_left": 0
			},
			{
				"title": "Удачная покупка",
				"icon": "fas fa-cog",
				"route": "paymentsuccess",
				"is_left": 0,
				"component": "RobokassaSuccessState"
			},
			{
				"title": "Неудачная попытка оплаты",
				"icon": "fas fa-cog",
				"route": "paymentfailure",
				"is_left": 0,
				"component": "RobokassaFailureState"
			}, 
			{
				"title": "404",
				"icon": "",
				"route": "404",
				"component": "NoMatchView"
			}, 
			{
				"title": "Facultet",
				"icon": "/assets/img/minimal/033-content writing.svg",
				"route": "facultet",
				"singled_data_type": "Bio_Facultet",
				"component": "TutorFacultet",
				"is_left": 0
			},
			{
				"title": "Image Result",
				"icon": "",
				"route": "result",
				"singled_data_type": "Bio_Result",
				"component": "TutorResult",
				"is_left": 0
			},
			{
				"title": "Event",
				"icon": "fas fa-calendar-alt",
				"singled_data_type": "Bio_Event",
				"route": "event",
				"component": "TutorEvent",
				"is_left": 0
			},
			{
				"title": "Test",
				"icon": "fas fa-vial",
				"route": "test",
				"singled_data_type": "Bio_Test",
				"component": "TutorTest",
				"is_left": 0
			},
			{
				"title": "Course",
				"icon": "fas fa-book",
				"route": "course",
				"singled_data_type": "Bio_Course",
				"component": "TutorCourse",
				"is_left": 0
			},
			{
				"title": "Course feed",
				"icon": "",
				"route": "course-lessons",
				"component": "TutorCourseLessons",
				"is_left": 0
			},
			{
				"title": "Theme",
				"icon": "",
				"route": "theme-lessons",
				"singled_data_type": "Bio_Biology_Theme",
				"component": "TutorThemeLessons",
				"is_left": 0
			},
			{
				"title": "Class",
				"icon": "",
				"route": "class-lessons",
				"singled_data_type": "Bio_Class",
				"component": "TutorClassLessons",
				"is_left": 0
			},
			{
				"title": "Article",
				"icon": "",
				"route": "article",
				"singled_data_type": "Bio_Article",
				"component": "TutorLesson",
				"is_left": 0
			},
			{
				"title": "Краефест 2021",
				"icon": "",
				"route": "fest-2",
				"component": "TutorWPFest",
				"is_left": 0,
				"route_data": {
					"blog_id": "77",
					"url": "http://kraefest.wpfest.ru/"
				},
				"extend_params": {}
			},
			{
				"title": "LandingView",
				"icon": "",
				"route": "4",
				"component": "LandingView",
				"id": "newKraeved",
				"is_left": 0,
				"extend_params": {
					"id": "newKraeved"
				}
			},
			{
				"title": "LandingView",
				"icon": "",
				"route": "proba",
				"component": "LandingView",
				"id": "proproba",
				"is_left": 0,
				"extend_params": {
					"is_issue": true,
					"id": "proproba"
				}
			},
			{
				"title": "LandingView",
				"icon": "",
				"route": "proba2",
				"component": "LandingView",
				"id": "main_page",
				"is_left": 0,
				"extend_params": {
					"is_issue": true,
					"id": "dgniisg"
				}
			},
			{
				"title": "Фестиваль Краефест-2021",
				"icon": "",
				"route": "fest-results",
				"component": "TutorWPFest",
				"id": "landing",
				"is_left": 0, 
				"route_data": {
					"url": "http://kraefest.wpfest.ru/",
					"blog_id":77
				}
			}
		],
		"main_menu": [
			{
				"title": "Архив номеров",
				"icon": "",
				"route": "archive",
				"component": "LandingView",
				"id": "landing",
				"is_left": 0,
				"extend_params": {
					"id": "kraeved_archive"
				}
			}
		],
		"personal_menu": [
			{
				"title": "Favorites",
				"target_id": "favorites",
				"is_target": "2"
			},
			{
				"title": "My tests",
				"target_id": "tests-tesult",
				"is_target": "2",
				"data_type": "--"
			},
			{
				"title": "Личные данные",
				"target_id": "profile",
				"is_target": "2"
			}
		], 
		"menu": [
			{
				"title": "Settings",
				"icon": "/assets/img/minimal/106-settings.svg",
				"route": "admin-settings",
				"component": "MainAdminView",
				"description": "Жаль,но это пока не работает. Можно только кнопочки пожамкать...",
				"is_left": 1,
				"capability": [
					"administrator",
					"editor"
				],
				"is_hidden": 1,
				"islogged": 1,
				"children": [
					{
						"title": "Options",
						"icon": "fas fa-tools",
						"route": "options",
						"single_data_type": "Options",
						"data_type": "Options",
						"description": "Main settings of portal",
						"is_left": 1,
						"capability": [
							"administrator"
						],
						"islogged": 1
					},
					{
						"description": "<p>Страница редактирования текущего стека модулей (сторонних расширений функциональности платформы).</p><p>Модули разрабатываются отдельно от ядра ProtopiaEcosystem. </p><p>Каждый модуль включает в себя три типа ресурсов</p><ul><li> <p><b>Страницы</b> Подключаются в карту сайта через «Редактор карты сайта»</p></li><li><p><b>Виждеты</b> Подключаются в любое Гнездо виждетов и предоставляют свой функционал на тех страницах, на которых разработчики функционала страницы зарегистрировали указанные Гнёзда виждетов. Перейли на страницу «Виджеты»</p></li><li><p><b>Расширения</b> Особые виждеты, которые подключаются только в особые типы Гнёзд виждетов.. Перейли на страницу «Виджеты»</p></li></ul><p>Чтобы подключить новый модуль, его надо найти на одном из источников.</p>",
						"title": "Modules",
						"icon": "/assets/img/minimal/061-puzzle.svg",
						"route": "admin-modules",
						"component": "AdminPluginView",
						"is_left": 1,
						"capability": [
							"administrator"
						],
						"islogged": 1
					},
					{
						"title": "Site Map, Views, Menus",
						"icon": "/assets/img/minimal/165-menu.svg",
						"route": "admin-menu",
						"component": "AdminMenuView",
						"description": "Создание и редактирование карты сайта. Редактирование групп меню и создание новых",
						"is_left": 1,
						"capability": [
							"administrator",
							"editor"
						],
						"islogged": 1
					},
					{
						"title": "Widgets",
						"route": "admin-widgets",
						"icon": "/assets/img/minimal/061-puzzle.svg",
						"component": "AdminWidgetView",
						"description": "Установка виджетов в гнёзда и настройка",
						"is_left": 1,
						"capability": [
							"administrator"
						],
						"islogged": 1
					},
					{
						"title": "Remotes",
						"icon": "fas fa-code-branch",
						"route": "remotes",
						"component": "MainAdminView",
						"description": "Удалённые сервисы, которые либо созданы под стандарт Protopia Ecosystem либо имеют модули синхронизации с PE-приложением. Вы можете подключиться к удалённому сервису через свою учётную запись и получать доступ к своему контенту и предоставлять своим пользователям возможности сервиса прямо у себя в приложении.",
						"is_left": 1,
						"capability": [
							"administrator"
						],
						"is_hidden": 1,
						"islogged": 1,
						"children": [
							{
								"title": "WP-Fest",
								"icon": "fas fa-theater-masks",
								"route": "admin-fests",
								"component": "TutorRemoteAccountAdmin",
								"description": "Сервис по созданию и сопровождению онлайн и оффлайн образовательных мероприятий (фестивали, конкурсы, олимпиады). Входит в семейство ProtopiaEcosystem",
								"is_left": 1,
								"capability": [
									"administrator"
								],
								"is_hidden": 0,
								"islogged": 1
							}
						]
					}
				]
			},
			{
				"title": "Education",
				"id": "admin",
				"icon": "/assets/img/oraculi/049-abc.svg",
				"route": "admin",
				"component": "MainAdminView",
				"is_left": 1,
				"capability": [
					"administrator"
				],
				"is_hidden": 1,
				"islogged": 1,
				"children": [
					{
						"title": "Facultets",
						"icon": "/assets/img/oraculi/033-content writing.svg",
						"route": "facultets",
						"data_type": "Bio_Facultet",
						"is_left": 1,
						"capability": [
							"administrator"
						],
						"islogged": 1
					},
					{
						"title": "Courses",
						"icon": "/assets/img/oraculi/023-elearning-1.svg",
						"route": "courses",
						"data_type": "Bio_Course",
						"is_left": 1,
						"capability": [
							"administrator"
						],
						"islogged": 1
					},
					{
						"title": "Themes",
						"icon": "/assets/img/oraculi/presentation.svg",
						"route": "themes",
						"data_type": "Bio_Biology_Theme",
						"is_left": 1,
						"capability": [
							"administrator"
						],
						"islogged": 1
					},
					{
						"title": "Classes",
						"icon": "/assets/img/oraculi/007-seminar.svg",
						"route": "classes",
						"data_type": "Bio_Class",
						"is_left": 1,
						"capability": [
							"administrator"
						],
						"islogged": 1
					},
					{
						"title": "Olimpiad Types",
						"icon": "/assets/img/oraculi/010-idea.svg",
						"route": "olimpiad-types",
						"data_type": "Bio_Olimpiad_Type",
						"is_left": 1,
						"capability": [
							"administrator"
						],
						"islogged": 1
					},
					{
						"title": "Articles",
						"icon": "/assets/img/oraculi/060-writing.svg",
						"route": "articles",
						"data_type": "Bio_Article",
						"is_left": 1,
						"capability": [
							"administrator"
						],
						"islogged": 1
					},
					{
						"title": "Events",
						"icon": "/assets/img/oraculi/009-award.svg",
						"route": "events",
						"data_type": "Bio_Event",
						"is_left": 1,
						"capability": [
							"administrator"
						],
						"islogged": 1
					},
					{
						"title": "Tests",
						"icon": "/assets/img/oraculi/030-done.svg",
						"route": "tests",
						"data_type": "Bio_Test",
						"is_left": 1,
						"capability": [
							"administrator"
						],
						"islogged": 1,
						"children": [
							{
								"title": "Questions",
								"icon": "fas fa-question",
								"route": "questions",
								"data_type": "Bio_TestQuestion",
								"is_left": 1,
								"capability": [
									"administrator"
								]
							},
							{
								"title": "Test Categories",
								"icon": "/assets/img/oraculi/035-microscope.svg",
								"route": "test-categories",
								"data_type": "Bio_Test_Category",
								"is_left": 1,
								"capability": [
									"administrator"
								],
								"islogged": 1
							}
						]
					},
					{
						"title": "Comments",
						"icon": "/assets/img/oraculi/033-bubble-chat.svg",
						"route": "comments",
						"data_type": "Comment",
						"capability": [
							"administrator"
						],
						"islogged": 1,
						"is_left": 1
					}
				]
			},
			{
				"title": "Landing",
				"icon": "/assets/img/minimal/landing.svg",
				"route": "admin-landing",
				"component": "MainAdminView",
				"capability": [
					"administrator",
					"editor"
				],
				"islogged": 1,
				"is_left": 1,
				"children": [
					{
						"title": "Video points",
						"icon": "fas fa-hand-paper",
						"route": "admin-video-point",
						"data_type": "PEVideoPoint",
						"is_left": 1,
						"capability": [
							"administrator",
							"editor"
						],
						"islogged": 1
					}, 
					{
						"title": "Contact Form Messages",
						"icon": "/assets/img/minimal/084-email.svg",
						"route": "contact-forms",
						"data_type": "PE_ContactFormMessage",
						"is_left": 1,
						"capability": [
							"administrator",
							"editor"
						],
						"islogged": 1
					}
				]
			},
			{
				"title": "Users",
				"icon": "/assets/img/minimal/043-management.svg",
				"route": "admin-users",
				"data_type": "User",
				"capability": [
					"administrator"
				],
				"islogged": 1,
				"is_left": 1
			},
			{
				"title": "Профиль",
				"icon": "/assets/img/pe/profile.svg",
				"route": "admin-profile",
				"component": "ProfileView",
				"is_left": 1
			}
		],
		"footer": []
	}
}