<?xml version="1.0" encoding="utf-8"?>
<!-- Generator: Adobe Illustrator 24.0.0, SVG Export Plug-In . SVG Version: 6.00 Build 0)  -->
<svg version="1.1" id="Слой_1" xmlns="http://www.w3.org/2000/svg" xmlns:xlink="http://www.w3.org/1999/xlink" x="0px" y="0px"
	 viewBox="0 0 344 358" style="enable-background:new 0 0 344 358;" xml:space="preserve">
<g>
	<path d="M159.5,179.5c0,32.7,0.1,65.3,0,98c-0.1,19.4-11.1,33.7-29.5,38.1c-3.3,0.8-6.9,0.9-10.4,0.9c-22.5,0.1-45,0.1-67.5,0
		C27.6,316.5,12,300.8,12,276.2c0-65.2,0-130.3,0-195.5c0-23,15.7-39.1,38.7-39.3c23.3-0.2,46.6-0.2,70,0c23,0.1,38.8,16,38.8,39.1
		C159.6,113.5,159.5,146.5,159.5,179.5z M134.5,179.3c0-32.5,0-65,0-97.5c0-10.8-4.4-15.2-15.1-15.3c-22.3,0-44.7,0-67,0
		c-11,0-15.4,4.5-15.4,15.5c0,64.7,0,129.4,0,194.1c0,11,4.4,15.5,15.4,15.5c22,0,44,0,66,0c12,0,16.1-4.1,16.1-16.2
		C134.5,243.3,134.5,211.3,134.5,179.3z"/>
	<path d="M258,166.5c-11.5,0-23,0.1-34.5,0c-23.1-0.2-38.8-15.9-39-38.9c-0.1-15.8-0.1-31.7,0-47.5c0.2-22.7,16-38.5,38.8-38.6
		c23.3-0.2,46.6-0.2,69.9,0c23,0.2,38.7,16.2,38.8,39.1c0,16,0,32,0,48c-0.1,20.5-15.1,36.7-35.5,37.7c-12.8,0.6-25.6,0.1-38.5,0.1
		C258,166.4,258,166.5,258,166.5z M258.4,66.5c-11.5,0-23-0.1-34.5,0c-9.8,0.1-14.3,4.6-14.4,14.5c-0.1,15.3-0.1,30.7,0,46
		c0.1,9.8,4.6,14.4,14.4,14.5c23,0.1,46,0.1,69,0c9.4,0,14.1-4.9,14.1-14.2c0-15.3,0-30.7,0-46c0-10-4.6-14.7-14.6-14.7
		C281.1,66.4,269.7,66.5,258.4,66.5z"/>
	<path d="M258.4,316.6c-11.5,0-23,0.1-34.5,0c-23.6-0.2-39.3-15.9-39.4-39.6c-0.1-15.3-0.1-30.7,0-46c0.1-23.6,15.8-39.4,39.4-39.5
		c22.8-0.1,45.6-0.1,68.4,0c23.9,0.1,39.6,15.9,39.6,39.8c0,15.5,0,31,0,46.5c0,22.1-15.6,38.2-37.7,38.7
		C282.4,316.8,270.4,316.6,258.4,316.6C258.4,316.6,258.4,316.6,258.4,316.6z M257.5,291.6c11.8,0,23.7,0.1,35.5,0
		c9.3-0.1,14-5,14-14.3c0-15.3,0-30.7,0-46c0-9.7-4.7-14.6-14.3-14.6c-23-0.1-46-0.1-69,0c-9.5,0-14.2,4.7-14.2,14.1
		c-0.1,15.5-0.1,31,0,46.5c0.1,9.8,4.6,14.3,14.5,14.4C235.2,291.6,246.3,291.6,257.5,291.6z"/>
</g>
</svg>
