<?xml version="1.0" encoding="utf-8"?>
<!-- Generator: Adobe Illustrator 24.0.0, SVG Export Plug-In . SVG Version: 6.00 Build 0)  -->
<svg version="1.1" xmlns="http://www.w3.org/2000/svg" xmlns:xlink="http://www.w3.org/1999/xlink" x="0px" y="0px"
	 viewBox="0 0 100 100" style="enable-background:new 0 0 100 100;" xml:space="preserve">
<style type="text/css">
	.st0{display:none;}
	.st1{display:inline;fill:#CC1417;}
	.st2{fill:#CC1417;}
	.st3{fill:none;stroke:#8B8C89;stroke-width:3.7147;stroke-miterlimit:10;}
	.st4{fill:#FFFFFF;stroke:#8B8C89;stroke-miterlimit:10;}
</style>
<g id="Слой_2" class="st0">
	<rect x="5.5" y="2.9" class="st1" width="73.3" height="14.1"/>
</g>
<g id="Слой_3" class="st0">
	<rect x="79.5" y="3.3" class="st1" width="18.2" height="14.1"/>
</g>
<g id="Слой_4" class="st0">
	<rect x="3.9" y="15.9" class="st1" width="18.9" height="68.4"/>
</g>
<g id="Слой_5" class="st0">
	<rect x="3.9" y="83.4" class="st1" width="92.5" height="13"/>
</g>
<g id="Слой_6">
	<g>
		<path class="st2" d="M51.2,54.3l-0.1-1.4c-0.3-2.8,0.6-6,3.3-9.2c2.4-2.8,3.7-4.9,3.7-7.3c0-2.7-1.7-4.5-5-4.6
			c-1.9,0-4,0.6-5.4,1.6l-1.3-3.3c1.8-1.3,4.8-2.1,7.6-2.1c6.1,0,8.9,3.8,8.9,7.8c0,3.6-2,6.2-4.6,9.2c-2.3,2.8-3.2,5.1-3,7.8
			l0.1,1.3H51.2z M50.1,61.8c0-2,1.3-3.3,3.1-3.3c1.9,0,3.1,1.4,3.1,3.3c0,1.9-1.2,3.3-3.2,3.3C51.4,65.1,50.1,63.6,50.1,61.8z"/>
	</g>
</g>
<g id="Слой_1">
	<rect x="3.9" y="3.9" class="st3" width="92.5" height="92.5"/>
	<line class="st3" x1="3.9" y1="17" x2="96" y2="17"/>
	<line class="st3" x1="3.9" y1="84.3" x2="96" y2="84.3"/>
	<line class="st3" x1="24.7" y1="17" x2="24.7" y2="84.3"/>
	<line class="st3" x1="78.8" y1="4.5" x2="78.8" y2="17"/>
	<circle class="st4" cx="86.1" cy="10.3" r="2.5"/>
</g>
</svg>
