{
  "app": {
    "title": "Protopia Ecosystems",
    "name": "Protopia Ecosystems",
    "description": "",
    "external_systems": [],
    "scopes": "",
    "adapter": "wp",
    "user_model": "User",
    "help_url": "http://ux.protopia-home.ru/",
    "init_method": "external",
    "roles": [
      {
        "_id": "subscriber",
        "title": "subscriber"
      },
      {
        "_id": "administrator",
        "title": "administrator"
      },
      {
        "_id": "pupil",
        "title": "Pupil"
      },
      {
        "_id": "tutor",
        "title": "Tutor"
      },
      {
        "_id": "courseleader",
        "title": "CourseLeader"
      },
      {
        "_id": "editor",
        "title": "Editor"
      }
    ]
  },
  "template": {
    "menu_left": 1,
    "header": true,
    "icon": "/assets/img/037-talkshow.svg",
    "icon_width": 25,
    "icon_height": 25,
    "avatar": "/assets/img/user1.svg",
    "login": "/login",
    "style": "/assets/css/style.css",
    "styles": [],
    "left_menu": "pictogramm"
  },
  "modules": {},
  "widgets": {},
  "extentions": {},
  "widget-area": {},
  "views": {},
  "schema": {},
  "routing": {
    "profile": [],
    "extended_routes": [],
    "menu": [],
    "main_menu": [],
    "footer": []
  },
  "folders": {
    "max_id": 1,
    "folders": []
  }
}