<?xml version="1.0" encoding="utf-8"?>
<!-- Generator: Adobe Illustrator 24.0.0, SVG Export Plug-In . SVG Version: 6.00 Build 0)  -->
<svg version="1.1" id="Слой_1" xmlns="http://www.w3.org/2000/svg" xmlns:xlink="http://www.w3.org/1999/xlink" x="0px" y="0px"
	 viewBox="0 0 362.8 93.5" style="enable-background:new 0 0 362.8 93.5;" xml:space="preserve">
<style type="text/css">
	.st0{fill-rule:evenodd;clip-rule:evenodd;fill:#020203;}
</style>
<path class="st0" d="M298.4,32.2c0.2-0.1,0.5-0.2,0.8-0.2C299.2,32.3,298.7,32.4,298.4,32.2z M322.8,38.1c1,0.2,2.1-0.2,3.2,0.1
	C325.4,37.7,323.7,38.1,322.8,38.1z M325.1,46.4c0.4,0.2,0.7,0,1.1-0.1c0.3,0.1,0.5,0.2,0.8,0.2c0.4-0.3,2.6,0,2.4-0.4
	C328,46.4,326.2,45.9,325.1,46.4z M338,47.6c0.2,0,0.4,0,0.5,0c0-0.2,0-0.3-0.1-0.3C338.1,47.2,338,47.4,338,47.6z M343.4,44.7
	c1.9-0.2,3.2,0.1,5-0.2c1.4,0,0-0.1-0.7-0.1c-0.3,0-0.3,0.1-0.4,0.2C346.2,44.3,344.2,44.3,343.4,44.7z M345,48.9
	c-0.4,0-0.8,0-1,0.2C344.2,49.1,344.9,49.1,345,48.9z M346.6,37.6c-0.4,0-1.1-0.1-1.2,0.1C345.6,37.9,346.3,37.7,346.6,37.6z
	 M346.6,47.2c-0.4,0.2-1.2,0.1-1.5,0.3C345.6,47.5,347,47.6,346.6,47.2z M345.7,48.8c0.5-0.1,1.3,0,1.7-0.2
	C346.7,48.6,346,48.5,345.7,48.8z M347.6,35.3c-0.4,0.1-0.9,0-1,0.3C347,35.5,347.6,35.6,347.6,35.3z M350,37.6
	c-0.8,0-2.3-0.1-2.8,0.1C348.3,37.8,349,37.8,350,37.6z M347.6,48.6c0.7-0.2,1.7,0.2,2.3,0C349.4,48.5,348.3,48.2,347.6,48.6z
	 M350.6,44.3c-0.4,0.1-0.8,0.1-1.1,0.2C349.9,44.5,350.6,44.7,350.6,44.3z M350.6,45.4c0.3,0,1,0.1,1.1-0.1
	C351.3,45.3,351,45.2,350.6,45.4z M352.5,46.4c0,0.1,0,0.3,0.3,0.3c0.2-0.5-0.8-0.4-1-0.2C352.2,46.5,352.2,46.4,352.5,46.4z
	 M354.7,39.8C352.9,39.7,354.1,40.2,354.7,39.8L354.7,39.8z M358.1,36.6c-0.7-0.1-1.2-0.1-1.8,0.1C356.5,36.7,357.6,36.7,358.1,36.6
	z M357.4,36.2c0.2-0.3-0.9-0.3-0.7,0C356.9,36.2,357.2,36.2,357.4,36.2z M359,31.4c-0.3-0.1-0.8,0-1,0.2
	C358.1,31.7,358.9,31.6,359,31.4z M361.8,32C363.4,32,363,31.6,361.8,32L361.8,32z M331.5,31.5c-0.2,0.2-0.5,0.2-0.7,0.3
	c1-0.2,1.8,0.2,2.5-0.1C332.7,31.5,332,31.8,331.5,31.5z M351.6,39.9c-1.6,0.2-2.5-0.5-3.3-0.1c0-0.1,0.1-0.2,0.2-0.3
	c-0.6,0-1,0.1-1.7,0.1c0-0.1,0.2-0.1,0.1-0.3c-0.4,0.1-0.3-0.1-0.7-0.1c-0.2,0.4,0.6,0.2,0.5,0.4c-0.1,0.4-1.3,0.1-1.5,0.4
	C346.6,40,350,40.4,351.6,39.9z M348.4,47.4c-0.1-0.1-0.6-0.2-0.7,0c0.1,0,0.2,0.1,0,0.1C346.4,47.5,348.2,47.6,348.4,47.4z
	 M357.9,46.8c0-0.1,0-0.2,0-0.3c-1.4,0.6-3.4,0.3-4.6,0.4c-1.3,0.8-3.8-0.4-4.8,0.5c2.5-0.3,5.2,0.2,7.6-0.3
	c0.2,0.1,0.5,0.1,0.7,0.2c0.7-0.5,3,0.1,4-0.2C360.2,46.7,358.8,46.8,357.9,46.8z M353.3,46.8C353.3,46.8,353.3,46.8,353.3,46.8
	L353.3,46.8C353.3,46.8,353.3,46.8,353.3,46.8z M353.5,46.8c0,0-0.1,0.1-0.1,0.1C353.5,46.8,353.7,46.8,353.5,46.8z M357.8,35.1
	c-0.2,0.1-0.6,0.2-0.8,0.3C357.3,35.7,358,35.2,357.8,35.1z M321.4,34.3C321.4,34.4,321.4,34.4,321.4,34.3
	C321.5,34.4,321.5,34.4,321.4,34.3z M328.1,30c-0.3-0.2-0.5-0.2-0.8-0.1C327.6,29.9,327.8,30.2,328.1,30z M327.3,30.6
	c-0.3,0.1-0.5-0.3-0.8-0.1C326.8,30.6,327,30.9,327.3,30.6z M324.8,29.7c0.2-0.1,0.1-0.2,0.3-0.3c-0.3-0.2-0.3,0-0.8,0.1
	C324.5,29.7,324.7,29.7,324.8,29.7z M316.9,23.9c-0.1-0.1-0.2-0.2-0.4-0.3c-0.2,0.2-0.4,0.1-0.6,0.2
	C316.2,24.1,316.6,24.1,316.9,23.9z M325.5,30.6c0-0.1,0.1-0.2,0.2-0.1c0.2-0.2-0.5-0.4-0.6-0.2C325.1,30.5,325.3,30.4,325.5,30.6z
	 M315.6,23.7c-0.4,0-0.4-0.2-0.5-0.4c-0.2,0.2-0.1,0.4,0.1,0.6C315.3,23.9,315.5,23.8,315.6,23.7z M320.2,28.7
	c0.1-0.2-0.5-0.3-0.8,0C319.7,29,320,28.5,320.2,28.7z M310,23.6c0-0.3,0.2-0.2,0.6-0.3c0,0.1,0,0.2,0.2,0.3c0.3-0.1,0.5-0.1,0.8,0
	c0.3-0.1,0.5-0.3,0.5-0.4c-0.1,0-0.4,0.1-0.3-0.1c-0.2-0.1-0.4,0.2-0.6,0.2c-0.1-0.2-0.4-0.3-0.8-0.5c0,0.5-0.7,0.4-1.2,0.6
	C309.5,23.4,309.8,23.4,310,23.6z M319,28.5c-0.1-0.1-0.2-0.2-0.4-0.3c0,0.1-0.1,0.3-0.3,0.2C318.2,28.6,318.8,28.8,319,28.5z
	 M316.9,30.3c0.3,0.1,0.8,0.2,0.9-0.2C317.5,30.1,317.2,30.2,316.9,30.3z M304.3,21.5c-0.3-0.2-0.7-0.2-0.8,0.1
	C303.8,21.6,304,21.7,304.3,21.5z M314,29.9c0.3,0.1,0.6,0.2,0.9,0C314.6,29.9,314.3,29.6,314,29.9z M304.5,26c0.1,0,0.2,0,0.4,0.1
	c0.2-0.4,0.6-0.1,0.5-0.4C305,25.6,305,25.8,304.5,26z M312.4,31.2c0.3-0.3-0.4-0.4-0.7-0.5C311.5,30.9,312.2,30.9,312.4,31.2z
	 M308.4,30.2c-0.3,0-0.6-0.1-0.9,0.1c0.4,0.1,0.7,0.1,1.1,0.3C308.9,30.5,308.1,30.3,308.4,30.2z M298.2,23c0.1-0.4-0.5-0.1-0.7-0.1
	C297.3,23.2,298,23,298.2,23z M298.1,24.5c0.2-0.2,0.2-0.3,0-0.5c-0.3,0.3-0.7,0-0.7,0.3C297.7,24.5,297.9,24.1,298.1,24.5z
	 M292.3,20.5c-0.3-0.2-0.7-0.3-1-0.1C291.6,20.5,291.9,20.6,292.3,20.5z M310,33.5c-0.3,0.2-0.1,0.3,0.2,0.5
	c0.1-0.1,0.3-0.2,0.4-0.2C310.3,33.5,310.1,33.7,310,33.5z M308.1,32.1c-0.2-0.3-0.5-0.2-0.7-0.3C307.2,32.1,307.9,32.4,308.1,32.1z
	 M308.4,33.5c-0.7-0.3-1.5-0.1-2.2-0.3c-0.4,0.2-0.2,0.4-0.4,0.6c0.4,0.2,0.3-0.2,0.7-0.2c0.3,0.2,0.1,0.3,0.4,0.3
	c0-0.3,0.6-0.2,0.9-0.4c0.2,0.2,0.4,0.2,0.6,0.3c0.4-0.1-0.2-0.3,0.2-0.4C308.5,33.4,308.4,33.5,308.4,33.5z M292.5,23.8
	c-0.2,0.3,0.4,0,0.5,0.2c0.4-0.1,0.2-0.3,0.3-0.4c-0.2-0.1-0.5-0.2-0.7-0.3c-0.3,0.2,0.2,0.3,0.4,0.3
	C293.2,23.7,292.6,23.8,292.5,23.8z M291.9,23.7c0.1-0.4-0.7-0.1-1-0.3C290.6,23.8,291.5,23.7,291.9,23.7z M288.3,23.2
	c0,0.2,0.4,0.5,0.7,0.3C289.1,23.3,288.6,23,288.3,23.2z M301.6,33c0-0.3-0.9-0.4-1.3,0c0.2,0.1,0.1,0.2,0,0.2
	C300.7,33.5,301.2,32.8,301.6,33z M284.6,23c0.9,0,1.3,0.7,2,0c-0.1,0-0.3,0-0.2-0.1C285.8,23.1,285.2,22.7,284.6,23z M283.3,23
	c0.2,0.3,0.5-0.2,0.7,0.1c0.1-0.1,0.3-0.2,0.4-0.1c0.2-0.2-0.3-0.1-0.4-0.3C284.2,23.1,283.7,22.8,283.3,23z M282.4,23.1
	c0-0.4,0.6-0.1,0.9-0.3c-0.6-0.1-0.7-0.6-1.2-0.3C282.6,22.7,281.9,22.9,282.4,23.1z M280.1,22.7c-0.4-0.3-0.7-0.1-1.1-0.2
	c-0.2-0.1,0.1-0.3,0.3-0.4c-0.6-0.2-0.6,0.4-1.5,0.3c0.2,0.3,0.2,0.1,0.5,0.4c0.4-0.2-0.1-0.1-0.3-0.3
	C278.7,22.5,279.4,23,280.1,22.7z M289,31.5c-0.4-0.2-0.9,0.1-1.1,0.3C288.4,31.8,288.8,31.8,289,31.5z M258.2,32.4
	c-0.2-0.1-0.5,0-0.8,0.1C257.6,32.7,257.9,32.6,258.2,32.4z M255.3,32.4c-0.3-0.2-0.6-0.2-0.9,0C254.7,32.5,255,32.6,255.3,32.4z
	 M250.5,32.3c0.6,0.2,0.7-0.3,0.3-0.5c-0.9,0.3-1.7,0-2.2,0.5c0.7,0,1.4,0,2.1-0.2C250.7,32.1,250.6,32.2,250.5,32.3z M246.4,32.1
	c-0.1-0.1-0.2-0.2-0.4-0.3c-0.2,0.1-0.1,0.2-0.3,0.3C246,32.1,246.2,32.2,246.4,32.1z M98.4,19.7c-0.7-0.2-1.5,0.4-2.3,0.2
	C96.5,20.3,97.7,19.9,98.4,19.7z M96,20c-0.3-0.2-0.6-0.2-0.9,0.1C95.4,20.2,95.7,20.2,96,20z M329,30.9c0.3,0.4,0.6,0.1,0.8,0.1
	c0.6,0.6,1.5,0.3,1.8,0.5c0.4-0.2-0.4-0.5-0.6-0.4c0.4-0.3,0.7,0.2,1.1-0.1c0.1,0.1-0.3,0.3,0.1,0.4c0.2-0.1,0.3,0,0.5-0.2
	c-0.8-0.1,0.4-1.1-0.4-0.3c-0.8-0.1-1.6,0-2.4-0.3c-0.4,0.3-0.5,0.2-0.7-0.1c-0.1,0.1,0.1,0.2,0,0.2c-0.4,0.1-0.1-0.2-0.4-0.3
	c-0.1,0.3-0.3,0.2-0.8,0.7C328.3,31.3,328.6,31,329,30.9z M324.2,28.5c-0.5-0.2-1-0.1-1.5,0c0.3,0.1,0.1,0.2,0.3,0.4
	C323.2,28.3,323.7,28.7,324.2,28.5z M299.5,21.5c0.3-0.5,1.3,0.1,1.9-0.2c-1.2-0.2-2.3-0.1-3.4-0.2c-0.2,0.2,0.3,0.1,0.4,0.3
	C298.7,21.2,299.1,21.2,299.5,21.5z M294.6,20.9c-0.2,0-0.3,0-0.5,0C294.3,21,294.5,21.1,294.6,20.9z M294,20.9c0,0,0.1,0,0.1,0
	C294.1,20.9,294,20.9,294,20.9z M313,23.4c-0.3-0.2-0.6,0.1-0.9,0.1C312.3,23.5,312.6,23.7,313,23.4z M295.8,24.2
	c0-0.1,0-0.2-0.2-0.3c-0.2,0.2,0.1,0.2,0.3,0.4c0.2-0.1,0.2-0.2,0.3-0.3C296.1,24,295.9,24.1,295.8,24.2z M308.9,33.4
	c-0.2,0.1-0.1,0.3-0.1,0.4c0.4,0.2,0.3-0.2,0.7,0C309.9,33.7,308.9,33.7,308.9,33.4z M303.1,29.7c-0.2,0.2,0.4,0.1,0.5,0.2
	c0.2-0.1,0.2-0.2,0-0.4C303.6,29.7,303.3,29.8,303.1,29.7z M304.6,31.7c0.3-0.1,0.4-0.2,0.4-0.4c-0.2-0.1-0.4,0.1-0.6,0
	c-0.1,0.1,0,0.1,0.1,0.1C304.6,31.5,304.4,31.6,304.6,31.7z M291.6,22.4c-0.3-0.3-0.2,0.1-0.4,0.2c-0.3,0.1,0-0.2-0.4-0.3
	c-0.5,0.3-1,0.2-1.5,0.1c-0.1,0.1-0.1,0.2-0.2,0.4c0.4-0.2,1.3-0.2,2,0C291.3,22.5,291.6,22.6,291.6,22.4z M305.4,32.9
	c-1.1,0.1-1.9-0.1-3,0.3c0.1,0.1,0.4,0.1,0.3,0.2c0.4,0.1,0.3-0.1,0.7-0.2c-0.1,0.3,1.4,0.1,1,0.3C304.5,33.8,305.2,33.2,305.4,32.9
	z M284.8,20.1c0.7,0,1.3,0.1,2,0.1C286.5,19.9,285.4,19.9,284.8,20.1z M302.9,32.8c-0.3,0.1-0.7-0.1-1,0.2
	C302.2,33.3,302.6,32.9,302.9,32.8z M287.2,23.2c-0.2,0.2,0.4-0.1,0.5,0.3c0.3-0.1,0-0.2,0.1-0.3C287.6,23.1,287.4,23.2,287.2,23.2z
	 M276.8,22.6c0.2,0.2,0.5-0.2,0.7,0.1c-0.1-0.3,0.5-0.4,0.1-0.7c-0.3,0.1-0.5,0.2-0.8,0.1c-0.2,0.2,0.4,0.1,0.5,0.2
	C277.3,22.4,276.7,22.3,276.8,22.6z M274.2,21.8c-0.3,0.2,0.2,0.2,0.1,0.3c0.4-0.1,0.8,0,1.2-0.1C275.1,21.7,274.6,22.2,274.2,21.8z
	 M273.1,22.4c0.2,0,0.4-0.1,0.4-0.2c0.2,0.1,0.1,0.2,0.3,0.3c0.5-0.1,1.1-0.1,1.6,0.1c-0.1-0.5-1-0.1-1.4-0.6
	c-0.3,0.3-0.6,0.1-0.9-0.2c-0.6,0.1-0.6,0.2-1.1,0.4c0.2,0.1,0.4,0.1,0.6,0.1c0.3-0.1,0-0.2,0.1-0.3c0.1,0,0.2,0,0.3-0.1
	C273.1,22.1,272.7,22.3,273.1,22.4z M245.6,32.1c0.1-0.1-0.1-0.2,0-0.2c-0.1-0.1-0.1,0-0.1,0.1c-0.3,0.2-0.5-0.3-0.8,0
	C244.9,32.3,245.3,32.1,245.6,32.1z M104.3,19.3c-0.5-0.1-1.1,0-1.6-0.1c-0.2,0.4-0.9,0.2-1.4,0.1c-0.1,0.1,0,0.1-0.1,0.2
	c0.1,0,0,0.1,0,0.1C102.3,19.4,103.3,19.6,104.3,19.3z M15.4,65.6l-0.7,0C14.4,65.8,15.5,65.8,15.4,65.6z M11.3,70.1
	c0.3,0.1,0.8,0.1,1-0.1C12.2,69.9,11.5,69.9,11.3,70.1z M8.6,69.4C7,69.4,7.3,69.8,8.6,69.4L8.6,69.4z M13.8,66.5
	c0.2-0.1,0.4-0.1,0.6-0.2c-0.1,0.1-0.2,0.2-0.2,0.5c0.3-0.3,0.4-0.4,0.6-0.3c-0.1,0-0.1-0.1-0.2-0.2c0,0,0.1,0,0.1,0
	c0,0-0.1-0.1-0.2-0.1c0-0.1-0.1-0.2-0.2-0.2c0,0.1,0,0.2,0,0.3C14.2,66.3,13.7,66.5,13.8,66.5z M138.2,16.7c-0.1,0-0.1-0.5-0.4-0.3
	C137.9,16.6,138.2,16.9,138.2,16.7z M137.7,16.4c0-0.3,0.2-0.6,0-0.9c0,0.9-0.4-0.1-0.5,0C137.1,16.4,137.7,15.8,137.7,16.4z
	 M122.7,16.4c1.1-0.3,2,0.3,3.2-0.1c0.1,0.2,0.7,0.4,0.7,0c-0.2-0.1-0.3-0.5-0.6-0.5c-0.9,0.2-2.4,0-3.4,0.1
	C122.7,16.1,122.8,16.1,122.7,16.4z M122.3,16.5c0.1-0.1,0.2-0.1,0.3-0.3C122.5,15.9,122.3,16,122.3,16.5z M118.4,18.2
	c0,0.4-0.1-0.1-0.2,0C118.1,18.8,118.6,18.4,118.4,18.2z M120.1,75.7c0.1,0.1,0.2,0.3,0.4,0.2c0-0.1,0-0.2,0-0.4
	C120.3,75.4,120.1,75.2,120.1,75.7z M111.6,15.6c-0.3-0.1-1.1-0.4-1.4,0.1C110.7,15.4,111.4,16.1,111.6,15.6z M108.7,16.1
	c0.5-0.1-0.2-0.3-0.2,0C108.6,16.3,108.5,16.1,108.7,16.1z M102.8,81.9c0.4,0.1,0.8,0.1,1,0.2C103.6,81.6,103,81.7,102.8,81.9z
	 M100.9,12.3c0.1,0,0.1-0.1,0.2-0.3c-0.2,0.1-0.1-0.5-0.3-0.3C100.7,12.1,100.9,11.9,100.9,12.3z M99.1,19.8c-0.1,0.2,0,0.5,0.1,0.6
	c0-0.2,0.1-0.2,0-0.4C99.2,20.1,99.2,19.9,99.1,19.8z M94.1,18.3c0.1-0.1,0.3-0.1,0.3-0.5C94.2,17.8,94.1,18,94.1,18.3z M95.1,80.1
	c0,0.5,0.3,0.5,0.4,0.2C95.3,80.4,95.3,80,95.1,80.1z M93.9,79.9c-0.1,0.5,0.5,0.5,0.4,0.1C94.1,80,94,79.9,93.9,79.9z M88.7,10.9
	c-0.1,0.1-0.4-0.1-0.4,0.2C88.5,11.1,88.7,11.3,88.7,10.9z M88.6,18.4c-0.2,0.1-0.4,0.1-0.5,0.3C88.3,18.9,88.6,18.8,88.6,18.4z
	 M88.2,18.8c-0.4-0.5-1-1.1-1.7-0.4c-0.2-0.2,0.2-0.3,0-0.5c-0.3,0.4-0.9,0.1-0.9,0.4C86.3,18.5,87.5,19.4,88.2,18.8z M87.1,20.5
	c-0.1,0-0.2,0-0.3,0C86.7,21,87.1,20.9,87.1,20.5z M85.6,72.3c0.2-0.3,0.5,0.1,0.6-0.3C86,72.1,85.6,71.6,85.6,72.3z M82.6,10.8
	c-0.2,0-0.3,0.1-0.4-0.1C82.2,11.3,82.5,11.1,82.6,10.8z M82.7,72.5c-0.1-0.1-0.3-0.4-0.3,0.2C82.4,72.6,82.7,72.8,82.7,72.5z
	 M82.3,78.7c0.1-0.3,0.3,0,0.4-0.1c0-0.2,0-0.3,0-0.4C82.5,78.4,82.1,78.2,82.3,78.7z M80.1,10.8c-0.2,0-0.4,0.1-0.5,0.3
	C79.9,11,80,11.2,80.1,10.8z M80.8,75.6c-0.2,0-0.2,0.5,0,0.6C80.7,75.9,80.9,75.9,80.8,75.6z M77.7,11c0.2,0.2,0.3-0.1,0.5-0.1
	C78.2,10.7,77.7,10.7,77.7,11z M76.5,13.1c0-0.2,0-0.3,0-0.4c-0.1,0-0.2,0.3-0.3,0C76.2,13.1,76.3,13.2,76.5,13.1z M78.1,71.9
	c0,0.4,0.3,0.6,0.3,0.2C78.2,72.3,78.3,71.8,78.1,71.9z M77.7,85.8c0,0.4-0.3,0.1-0.2,0.5c0.5-0.4,0.6-0.2,1.1,0.1
	c0-0.3,0-0.5,0-0.6C78.3,85.7,78,86.1,77.7,85.8z M75.8,11.9c0-0.2,0-0.3,0-0.4c-0.2,0-0.3,0.1-0.3,0.3
	C75.6,11.7,75.7,11.8,75.8,11.9z M76.9,83.7c0.1-0.1,0.6,0,0.5-0.2C77.2,83.6,76.7,83.6,76.9,83.7z M76.8,74.8c-0.2,0-0.4,0-0.4,0.3
	C76.5,75.3,76.8,75.2,76.8,74.8z M76.3,86c0,0.6,0.4,0.5,0.4,0.1C76.5,86.1,76.4,86.2,76.3,86z M76,75.8c0.1,0,0.1-0.1,0.2-0.1
	c0,0.1,0.1,0.3,0.1,0.3c0-0.2,0-0.4-0.1-0.5C76.1,75.6,75.9,75.4,76,75.8z M75.2,74.9c-0.1,0-0.2,0.1-0.3,0.3
	C75,75.4,75.2,75.3,75.2,74.9z M75.1,74.5c-0.1,0-0.1-0.1-0.2-0.1c0,0.2-0.6,0.5-0.7,0c-0.2,0-0.4,0.5-0.5,0.2
	c-0.1,0.3,0.1,0.4-0.1,0.6c0.2,0.1,0.4,0,0.2-0.4C74.1,74.7,74.8,75.1,75.1,74.5z M72.4,0.6c0-0.3,0-0.5-0.1-0.6
	c-0.2,0-0.3,0.2-0.3,0.5C72.3,0.4,72.3,0.7,72.4,0.6z M75.1,85.5c-0.5,0.8-1.2,0.2-1.8,0.4c0.2,0.4,0.2,0.5,0.5,0.8
	c0-0.5,0.1-0.1,0.2,0c0-0.4,0.2-0.6,0.4-0.5c0.1,0.2,0.1,0.5,0.2,0.6c-0.1-0.8,0.5-0.1,0.6-0.5C74.8,86.2,75.1,85.7,75.1,85.5z
	 M72.8,85.9c-0.1,0.3-0.5,0-0.6,0.3c0.4,0.3,0.7-0.2,1,0.3c0-0.2,0.1-0.1,0.1-0.3C73.2,85.8,72.9,86.6,72.8,85.9z M71.7,86.2
	c0.1,0,0.4,0.3,0.4-0.1C72,86,71.8,85.8,71.7,86.2z M69.6,21.7c-0.1-0.1-0.1-0.3-0.3-0.2C69.3,21.8,69.6,21.9,69.6,21.7z M71.1,86.2
	c0.1-0.1,0.4,0.1,0.5-0.2C71.4,86,71.1,85.6,71.1,86.2z M68.3,19.4c-0.2,0.2-0.4,0-0.5,0.2C67.9,19.9,68.2,19.8,68.3,19.4z
	 M66.2,20.5c0.1-0.3-0.2-0.5-0.2-0.2c0,0,0.1,0,0.1,0.1c0,0-0.1,0-0.1,0.1C66,20.5,66.1,20.5,66.2,20.5z M62.9,10.8
	c-0.2-0.2-0.6,0-0.7-0.4c0,0.2-0.1,0.3,0,0.5C62.5,10.5,62.8,11.4,62.9,10.8z M61.9,86.4c0.3-0.8,1-0.1,1.2-0.4
	c-0.1,0-0.1-0.1-0.1-0.3C62.6,85.8,61.9,85.5,61.9,86.4z M59.8,16.5c0.2-0.1,0.5,0,0.4-0.4c0,0.5-0.2-0.5-0.3,0c0,0,0.1,0.1,0.1,0.2
	C59.9,16.4,59.8,16.4,59.8,16.5z M61.4,86.2c0.1,0.1,0.3,0,0.3-0.2C61.6,85.8,61.4,85.9,61.4,86.2z M59.8,86.4
	c0.1,0.3,0.7,0.5,0.8,0C60.4,86.6,60,86.5,59.8,86.4z M56.6,15.1c0.1,0,0.2,0.2,0.3,0.2c0-0.3,0.1-0.5-0.1-0.6c0,0.1,0,0.2,0,0.2
	C56.7,14.9,56.6,14.9,56.6,15.1z M52.4,12c0.1-0.1,0.4,0.1,0.5-0.2C52.8,11.6,52.5,11.5,52.4,12z M54.5,86c0,0.2,0,0.8,0.1,0.8
	c0-0.1,0-0.2,0-0.4c0.2-0.2,0.3,0.2,0.3-0.3C54.8,85.9,54.6,85.9,54.5,86z M52.8,86.4c0.6,0.2,1,0,1.5,0c0-0.2,0.1-0.2,0-0.4
	C53.7,86.4,53.2,86.2,52.8,86.4z M51.2,85.9c0.1-0.1,0.2-0.2,0.2-0.4c-0.2,0.1-0.7,0.9-0.6,0.3c-0.8,0.7-2.1,0.4-2.9,0.5
	c-0.2,0.7-0.2-0.2-0.4,0.7c0.3,0,0.8,0,1.1,0c-0.1,0-0.2,0-0.2-0.2c0.6-0.1,1.3,0.3,2.1-0.4c0.2,0.2,0.3,0,0.4,0.3
	c0.4-0.3,0.8,0.1,1.2-0.4c0,0.3,0.9,0.3,0.6-0.1C52.2,86,51.6,86.8,51.2,85.9z M43.1,5.9c0-0.3-0.1-0.2,0-0.5
	c-0.1,0-0.2,0.2-0.3,0.2c0,0.3,0.1,0.3,0.2,0.5C42.9,5.9,43,5.9,43.1,5.9z M43.3,88.2c0.1,0,0.2,0,0.2,0c0-0.2,0-0.3,0-0.5
	C43.4,87.7,43.3,87.9,43.3,88.2z M37.4,13.5c0.1-0.6,0.5-0.1,0.7-0.6c-0.2-0.1-0.4,0-0.7,0C37.3,13.1,37.4,13.3,37.4,13.5z
	 M36.9,12.2c0.2,0.1,0.2,0.5,0.4,0.5c-0.1-0.6,0.3-0.2,0.3-0.5c-0.1,0-0.1-0.2-0.2-0.2C37.4,12.7,37,11.7,36.9,12.2z M35.3,17.2
	c-0.3-0.1-0.3-0.5-0.6-0.2C35,16.9,35.2,17.7,35.3,17.2z M33.6,13.3c0,0.3-0.1,0.3-0.2,0.1c0,0.3,0.2,0.4,0.3,0.4
	C33.7,13.7,33.7,13.4,33.6,13.3z M33.7,19.8c-0.1,0-0.1,0-0.2-0.1c-0.1,0.6-0.2-0.1-0.2-0.3c0,0.3-0.2,0.4-0.2,0.6
	C33.2,19.9,33.6,20.4,33.7,19.8z M32.2,17.7c0.1-0.2,0.1-0.9-0.1-0.8C32.1,17.3,32,17.5,32.2,17.7z M30.5,17.3
	c0.1,0.3,0.5-0.4,0.2-0.5C30.7,17.2,30.4,17,30.5,17.3z M28.2,16.1c0,0.4,0.2,0.3,0.4,0.3c0.1-0.5,0.2-0.8,0.1-1.1
	c-0.1,0-0.2-0.2-0.3-0.2c0.1,0.6,0,0.1-0.2,0.4C28.3,15.7,28.5,16,28.2,16.1z M28.2,14.1c0.1,0.4-0.2,0.4-0.2,0.8
	C28.2,15.2,28.3,14.3,28.2,14.1z M26.2,9.6c0.1,0,0.1,0,0.2,0c0-0.4-0.2-0.7-0.3-0.3C26.2,9.2,26.2,9.4,26.2,9.6z M26.2,22.7
	c0.2,0.2,0.6,0.1,0.6-0.1C26.6,22.6,26.3,22.3,26.2,22.7z M25.8,10.5c0,0.4,0.2,0.6,0.4,0.7C26.2,10.7,25.9,10.8,25.8,10.5z
	 M27.4,85.3c0,0,0.1,0,0.1-0.1c-0.1,0-0.2,0.1-0.2,0.4c0.1,0.3,0.7,0,0.4-0.4C27.8,85.5,27.4,85.3,27.4,85.3z M23.5,16.5
	c0,0.6,0.1,0.7,0.4,0.7c0-0.5-0.4-0.2-0.3-0.8c0.3,0.1,0.4,0.7,0.7,1c-0.1-1,0.4-0.3,0.4-0.9c-0.2-0.1-0.4,0.4-0.6,0.1
	c0-0.3,0.2-0.3,0.2-0.5c-0.2-0.2-0.3-0.4-0.6-0.5c-0.2,0.2,0,0.5-0.2,0.6c-0.3,0.1-0.3-0.8-0.5-1c-0.1,0.6,0.1,0.4,0.2,1
	c-0.2,0.4-0.3-0.2-0.5,0.3C22.9,16.6,23.1,16.5,23.5,16.5z M26.7,76.6c0.1,0,0.1-0.3,0.1-0.4c-0.1-0.2-0.3-0.4-0.4,0.1
	C26.6,76.2,26.5,76.7,26.7,76.6z M22.5,20.7c0.3,0,0.1-1,0.3-0.4c0-0.2,0-0.6-0.1-0.6c-0.2,0.7-0.5,0-0.8,0.1
	C22.1,20.4,22.8,19.9,22.5,20.7z M22.5,18.7c0,0-0.1-0.1-0.1-0.2c-0.3,0-0.3,0.9,0,1C22.4,18.7,22.4,19.1,22.5,18.7z M22.1,17.5
	c-0.1,0-0.1,0.1-0.2,0.1c0-0.2-0.1-0.3-0.1-0.1c0.2,0.3,0.1,0.9,0.2,1.1C22.1,18.3,22.1,18,22.1,17.5z M24,79.4c0,0,0.1,0,0.1-0.1
	c-0.1,0-0.1,0-0.2,0c0.2,0.5-0.4,0.3-0.2,0.5C24.1,80,24,79.8,24,79.4z M23.8,79.1c0.2,0,0.3-0.6,0-0.5C23.8,78.8,23.8,79,23.8,79.1
	z M21.4,16.7c0-0.5-0.2-0.3-0.3-0.4C21,16.8,21.3,16.5,21.4,16.7z M23.3,85.3c0.1,0,0.3,0.2,0.3-0.2C23.6,85,23.3,85,23.3,85.3z
	 M23.4,84.8c-0.2,0.2-0.1-0.3-0.3-0.2c-0.1,0.2,0.1,0.6,0.2,0.7C23.3,85.1,23.4,85.1,23.4,84.8z M20.4,22.2c0-0.1,0.1-0.1,0.1,0
	c0-0.3,0.1-0.7,0.2-1.1c-0.2-0.1-0.1,0.4-0.2,0.5c-0.1-0.1,0-0.6-0.2-0.5C20.4,21.7,20.4,21.9,20.4,22.2z M20.2,23.6
	c0.2,0,0.3-0.1,0.2-0.5c-0.1,0-0.2,0.1-0.3,0.3C20.1,23.4,20.2,23.5,20.2,23.6z M21.4,76.4c0-0.5,0.3,0,0.3-0.5
	C21.5,75.8,21.2,76.1,21.4,76.4z M19.1,3.2c0-0.2,0.1-0.2,0-0.5C18.9,2.4,18.9,3.1,19.1,3.2z M19.1,2.5c0-0.2,0-0.4,0-0.6
	c-0.2,0-0.1,0.3-0.2,0.5C19,2.4,19,2.4,19.1,2.5z M18.8,0.4c0,0.1,0,0.2,0,0.4c0.2,0.1,0.1-0.4,0.1-0.6c-0.2,0.2-0.3-0.5-0.3,0
	C18.7,0.4,18.8,0.3,18.8,0.4z M19.5,78.6c0.1,0.4,0.7,0.2,0.7-0.1C19.8,78.6,19.8,78.7,19.5,78.6z M19.1,77.7c0,0.4,0.5,0.5,0.5,0.1
	C19.3,77.9,19.2,77.8,19.1,77.7z M17.7,69c0.1,0.1,0.2,0.1,0.3,0.2c-0.1-0.5,0.2-0.3,0.3-0.6C18,68.6,17.9,68.7,17.7,69z M18.1,88
	c0.1,0.3,0.4-0.1,0.4-0.3C18.4,88,18.1,87.6,18.1,88z M15.5,20.4c-0.2,0.1,0,0.5,0,0.9c-0.1,0.1-0.1,0.3-0.2,0.4
	c-0.1,0.4,0.2,0.1,0.1,0.5c-0.1,0-0.2,0.1-0.2,0.3c0.1,0,0.1,0.4,0.3,0.3c0-0.6,0-0.9,0.2-1.4c-0.1,0.4,0.2,0.5,0.2,0.2
	c-0.1,0-0.3-0.3-0.1-0.5c0.1,0,0.1,0.4,0.3,0.5c0-0.9-0.6-0.9-0.4-2c-0.1,0.4-0.3,0.6-0.4,0.8C15.4,20.3,15.4,20.3,15.5,20.4z
	 M15.6,22.7c0.1,0.2,0.3,0.3,0.3-0.2C15.8,22.7,15.7,22.5,15.6,22.7z M16.8,74.3c0,0.3,0,0.6,0.1,0.7c0.2-0.5,0.8,0.1,0.9-0.7
	C17.4,74.5,17.1,74.2,16.8,74.3z M16.5,41.9c-0.1,0-0.1,0-0.1-0.2c-0.2,0-0.2,0.2-0.2,0.5C16.4,42.1,16.5,42.1,16.5,41.9z
	 M16.8,64.7c0.2,0.1,0.4,0,0.5-0.4c-0.2-0.1-0.2,0.2-0.3,0.3c-0.1-0.2,0-0.2,0-0.5C16.7,64,16.9,64.5,16.8,64.7z M16.9,68.9
	c0.2,0.7,0-0.1,0.4-0.1c0-0.3-0.1-0.2-0.2-0.3C17.1,68.9,16.8,68.6,16.9,68.9z M16.1,69c0.2-0.2,0.1,0.3,0.3,0.2
	c0.1-0.1,0.2-0.6,0.3-0.3C16.7,68.3,16.2,68.6,16.1,69z M15.6,64.8c0,0.1,0,0.2,0,0.2c-0.2,0-0.5,0-0.8,0c0.2-0.1,0.4-0.2,0.3-0.1
	c-0.2-0.1-0.1-0.3,0-0.5c-0.2-0.3-0.6,0.4-0.7-0.1c-0.1,0-0.2,0.1-0.2,0.3c0.1,0.4,0.8-0.4,0.6,0.5c-0.2,0-0.5,0-0.6,0
	c0.5,0.1,1,0.1,1.5,0.1c0,0.1,0.1,0.2,0.2,0.4c0-0.2,0-0.3,0-0.4c0.1,0,0.1,0,0.2,0c0,0-0.1,0-0.2,0c0-0.2,0.2,0,0.2-0.3
	C15.9,64.7,15.7,64.8,15.6,64.8z M14.6,69.2c0.2-0.3,0.5,0.2,0.5-0.3C15,69,14.6,68.8,14.6,69.2z M14.9,75c0.1-0.2,0.2-0.2,0.2-0.5
	C15,74.5,14.7,74.8,14.9,75z M14.6,69.1c-0.1-0.2-0.3-0.1-0.3,0.2c0.1,0,0.1,0.2,0.1,0.2C14.2,69,14.6,69.4,14.6,69.1z M13.7,63.8
	c0.1,0.3,0.2,0.3,0.4,0.2c0-0.2,0-0.3,0-0.5C14,63.6,13.8,63.6,13.7,63.8z M14,64.2c-0.3,0.2-0.4-0.1-0.5-0.3c0,0.2,0.1,0.3,0.1,0.5
	C13.7,64.1,14,64.7,14,64.2z M14.6,84.3c-0.2,0.1-0.2,0.2-0.3-0.1c0.1,0.7-0.2,0.2-0.2,0c0,0.2,0,0.5,0,0.7c0.2,0,0.2,0.3,0.3,0.5
	c0.1-0.3,0.3-0.2,0.3-0.7C14.5,84.8,14.7,84.6,14.6,84.3z M13.8,69.5c0-0.3,0.1-0.3,0.2-0.2c0-0.1,0-0.2,0-0.4
	C13.8,68.8,13.6,69.3,13.8,69.5z M13.6,75.3c0.1,0,0.4,0.3,0.4-0.1C13.9,75.3,13.7,75,13.6,75.3z M13.6,69.2c-0.2,0-0.3,0.1-0.3,0.5
	C13.4,69.7,13.5,69.4,13.6,69.2z M12.8,58.5c0-0.3,0.1-0.5-0.1-0.6c0,0.3-0.1,0.3-0.3,0.3c0,0.2,0,0.5,0.1,0.5
	C12.6,58.2,12.7,58.2,12.8,58.5z M13.4,75.6c0-0.4-0.1-0.4-0.1-0.8C13,74.8,13.2,75.6,13.4,75.6z M12.8,70c0,0,0.1,0,0.1,0.1
	c0,0,0.1,0,0.1,0c0-0.3,0.1-0.9-0.1-1.1C12.8,69.5,12.9,69.5,12.8,70z M12,57.1c-0.2-0.2-0.1-0.8,0-1.1C11.6,55.7,11.9,57.6,12,57.1
	z M12.1,65.2C12,65.1,11.9,65,11.8,65c0,0.2-0.1,0.3,0,0.5C11.9,65.5,12.1,65.4,12.1,65.2z M11.7,71.6c0.1,0.1,0.1,0.5,0.3,0.4
	c0.1-0.2,0.2-0.2,0.2-0.5C12,71.5,11.8,71.4,11.7,71.6z M10.5,31.9c-0.1,0-0.2,0-0.1-0.1c0.1,0,0.1,0.2,0.2,0.2
	c-0.1-0.6,0-0.3,0.1-0.7c-0.2,0.3-0.4-0.1-0.7,0C10,31.7,10.4,32.5,10.5,31.9z M11.4,69.2c0.1-0.1,0.3-0.1,0.3-0.4
	C11.6,68.8,11.4,68.8,11.4,69.2z M11,55.8c-0.2,0.1-0.2-0.4-0.4-0.4C10.6,55.8,11,56.1,11,55.8z M9.7,64.3c0.4,0.5,1,1,1.6,0.5
	C10.6,64.9,10.1,64.2,9.7,64.3z M9.5,23.4c-0.1-0.2-0.2-0.6-0.4-0.4C9,23.3,9.3,23.7,9.5,23.4z M9.5,50.8c0.2-0.2,0.3-0.1,0.5-0.1
	c-0.1-0.5,0.4-0.2,0.3-0.8c-0.3,0.3-0.6,0.7-0.8,0.1C9.4,50.2,9.4,50.6,9.5,50.8z M10,51.3c0-0.1,0-0.2,0-0.2
	c-0.1,0-0.1-0.1-0.1-0.1c0,0.2-0.1,0.3-0.1,0.6c0.2,0.2,0-0.4,0.2-0.4C9.9,51.3,10,51.3,10,51.3z M8.8,23.1c0.1-0.2,0-0.7-0.1-0.8
	c-0.1,0.3-0.3,0.3-0.4-0.1C8.2,22.9,8.5,23,8.8,23.1z M9.1,44.1c0,0.1,0.4,0.3,0.3-0.2C9.4,44,9.1,43.8,9.1,44.1z M9.3,61.8
	c0.1-0.1,0.3-0.1,0.3-0.5C9.5,61.1,9.2,61.3,9.3,61.8z M9.3,62c0-0.1,0-0.2,0-0.4C9,61.7,9,62,8.9,62.1C9,62.3,9,62,9.3,62z
	 M2.2,74.6c-0.1-0.2-0.3,0-0.3,0.2C1.9,74.9,2.2,75,2.2,74.6z M0.6,73.1c0,0.2,0.4,0.5,0.4,0.1c-0.3,0-0.4-0.3-0.7-0.4
	c-0.1,0.3,0,0.6,0.1,0.7C0.5,73.4,0.5,73.2,0.6,73.1z M-2.6,72.6c0-0.3,0-0.5,0.1-0.9c-0.3,0.2-0.6-0.6-0.8-0.3
	C-3.1,72.1-2.9,72.4-2.6,72.6z M5.7,36.8c0.1,0.3,0.1,0.5,0.1,0.8c0.3-0.1,0.4,0.2,0.7,0.3c0.5-0.8,1.1-0.2,1.8-0.5
	c0,0.1-0.1,0.1-0.1,0.3c0.5,0.1,0.9-0.3,1.1,0.1c0.1-0.1,0.2-0.3,0.3-0.4c0.2,0,0.2,0.3,0.3,0.5c0.2-0.5,1,0.2,0.9-0.7
	c0.2,0.3,0.3,0.1,0.5,0c-0.1,0.7-0.3,0.4-0.5,0.8c-0.6,1.1-0.2,2.5,0.3,3.6c0.3,0,0.4,0.2,0.7,0.3c0.1-0.1,0.2-0.4,0.2-0.8
	c-0.5,0.9-0.9-0.7-0.6-1.6c0.1-0.1,0.1,0.2,0.3,0.1c0.1-0.1,0.1-0.2,0.2-0.3c-0.2-0.3-0.1-0.4-0.2-0.9c0.1,0,0.2-0.1,0.2-0.2
	c-0.6-0.7,0.1-1.4,0.2-2.1c0.1,0.2,0.3,0.1,0.3-0.3c-0.1-0.3-0.2,0.2-0.4,0.1c0-0.2,0.1-0.3,0-0.5c0.1,0.2,0.3,0.1,0.5,0.1
	c0-0.4-0.2-0.3-0.1-0.8c0-0.1,0.1-0.1,0.2-0.2c-0.1-0.4-0.1-0.5,0-0.7c-0.1-0.3-0.3-0.3-0.4-0.4c0-1,0.1-1.2-0.1-2.1
	c0.1-0.1,0.2-0.2,0.3-0.3c0-0.2-0.1-0.3-0.2-0.2c0-0.3,0.2-0.1,0.2-0.5c0.2,0.1,0.3,0.1,0.3-0.2c-0.2,0.4-0.4-1.5,0.1-1.2
	c0,0.5-0.2,0.7,0,1.2c0.2-0.5,0.3-0.7,0.4-1.2c-0.3-0.1-0.4-1,0-1.1c0-0.4-0.2-0.5-0.3-0.8c0-0.1,0.1-0.1,0.2-0.1
	c0-0.3-0.1-0.2-0.2-0.2c0-0.3,0.2-0.3,0.2-0.6c-0.2-0.3-0.1,0.3-0.3,0.3c0.2-0.6,0.2-1.7,0.3-2.5c0.1,0,0.2-0.2,0.3-0.2
	c0-0.4-0.1-0.5-0.2-0.6c0.2-0.4,0-1,0.2-1.4c0.2,0.1,0,0.5,0,0.7c0.2,0,0.2-0.2,0.3-0.4c0.2,0.4-0.2,0.8-0.3,1.1
	c0.3,0.2,0.4,1.3,0.3,1.9c0.2,0.2,0.4,0.2,0.6,0.3c0-0.1-0.1-0.1-0.1-0.1c0-0.5,0.2-0.5,0.2-1c0.1,0,0.1,0.1,0.2,0.1
	c0.2-0.2,0-0.6,0-0.9c0.1,0.2,0.3,0.7,0.2,0c0.5-0.3,0.8,0.6,1.1,0c-0.1,0.5,0,0.9,0.3,0.6c-0.1,0.4-0.1,0.4,0,0.7
	c-0.2,0.2-0.4-0.3-0.5,0.2c0,0.3,0.5-0.2,0.4,0.4c0.2,0,0.3-0.4,0.5-0.4c0-0.4-0.2-0.6-0.3-0.8c0-0.2,0.4,0.4,0.5-0.1
	c-0.1-0.4-0.1,0-0.3-0.1c-0.1-0.2,0-0.5-0.1-0.7c0.1-0.5,0.2,0.4,0.3,0.5c0.2,0.1-0.1-0.6,0.1-0.5c-0.2-0.4-0.2-0.3-0.4-0.7
	c0.2-0.1,0.2-0.9,0.3-0.4c0.2-0.1,0-0.2,0-0.6c-0.1,0-0.2,0-0.3,0c0.2-0.8,0.4,0.3,0.7,0.1c0-0.4-0.1-0.5-0.3-0.5
	c0.1-0.2-0.1-0.3,0-0.6c0.1,0,0,0.4,0.1,0.5c0.2,0.1,0.1-0.5,0.3-0.4c0,0.2,0.2,0.4,0.1,0.6c0.4-0.2,0.3,0.7,0.7,0.5
	c-0.1-0.5-0.3-0.8-0.4-1.2c-0.1,0,0,0.3,0,0.5c-0.1-0.1-0.2-0.2-0.2-0.2c0-0.3,0.3-0.1,0.2-0.4c-0.1,0.1-0.1-0.6-0.3-0.7
	c0.1-0.5,0.1-0.5,0-1.1c0.1,0.2,0.3,0.3,0.4,0.4c0,0.3-0.2,0.2-0.2,0.5c0.1,0.1,0.3,0.2,0.1,0.5c0.1,0.2,0.5,0,0.3,0.5
	c0.2-0.1,0.3,0,0.5,0.1c0,0.6,0,1.6,0.3,1.9c-0.2,0.1-0.5,0.1-0.4,0.7c0,0.1,0.1,0.1,0.2,0.1c0,0.3,0,0.5,0,0.6
	c-0.2-0.2-0.3,0.1-0.5-0.1c-0.1-0.3,0.1-0.3,0.1-0.5c-0.2-0.6-0.6,0.3-0.8,0.5c0.2,0.1,0.3,0.5,0.7,0.5c0,0.5-0.1,0-0.2,0.2
	c0,0.4,0.2,0.3,0.3,0.6c0.2-0.1,0-0.3,0.1-0.5c0.3,0.2,0.4,0.7,0.5,1.4c0.2-0.2,0.3-0.1,0.5-0.1c-0.2,0.4,0,0.7,0,1.3
	c0.2-0.1,0.1-0.5,0.3-0.5c-0.1-0.5,0.2-1-0.1-1.1c0-0.2,0.1-0.2,0.2-0.3c0,0.4,0.1,0.7,0.2,1c0.2-0.2,0.4-0.4,0.6-0.2
	c0.1-0.5-0.2-0.3-0.3-0.3c0.1-0.1,0.2-0.6,0-0.6c0.2,0.2,0.6-0.5,0.7,0.1c0.1,0,0-0.7-0.1-0.7c0.1-0.3,0.3-0.4,0.5-0.6
	c0-0.2-0.2-0.1-0.1-0.5c0.2,0.1,0.3-0.1,0.5,0.1c0.3-0.4-0.2-0.6-0.2-1.2c-0.2,0.1-0.2,0.1-0.3,0.3c-0.2-0.3,0.3-0.4,0-0.6
	c0.1-0.2,0.1-0.4,0.3-0.4C21,21.3,21,21,20.8,21.1c-0.1-0.4,0-0.7,0.2-0.8c-0.3-0.5-0.2,0.4-0.5,0.6c0,0-0.2-1,0.1-0.9
	c-0.3,0-0.6-0.1-0.8,0.2c0-0.5-0.1-0.5-0.3-0.8c0.2,0,0.2,0.1,0.4-0.1c0,0.1,0,0.2,0,0.4c0.3-0.1,0.3-0.4,0.5-0.1
	c-0.1-0.5-0.5-0.5-0.8-0.4c-0.1,0-0.1-0.1-0.1-0.2c0-0.1,0-0.2,0-0.2c0.1,0,0.1,0.1,0.2,0.1c0-0.3-0.1-0.3-0.2-0.5
	c0-0.2,0.1-0.3,0.2-0.4c0.2,0.3,0.3,0,0.5,0.3c0,0.4-0.3,0.1-0.3,0.4c0.2,0.3,0.4-0.2,0.6-0.2c0-0.2,0-0.4,0-0.6
	c0-0.1-0.4-0.4-0.1-0.5c-0.1-0.5-0.1,0.1-0.3,0c-0.1-0.1,0-0.5,0-0.6c-0.2-0.6-0.6,0.3-0.5,0.9c-0.1-0.3-0.1-0.2-0.3-0.3
	c-0.1-0.4,0.2-0.2,0.3-0.3c-0.1-0.2,0-0.7-0.2-0.6c0.2-0.6,0.2-1.3,0-2c0.1,0.2,0.2,0.5,0.3,0.7c0.3-0.2,0.1-0.4,0-0.7
	c0.2,0,0.3,0.2,0.4,0.3c0.1,0.4-0.2,0.2-0.3,0.4c0,0.2,0.1,0.2,0.1,0.3c0.2-0.1,0.2-0.5,0.3-0.8c0.2,0.2-0.1,0.6,0,1
	c0.2,0.1,0.1-0.4,0.3-0.3c-0.1,0.6,0.3,1,0.6,1.3c0,0.2-0.2,0.1-0.2,0.5c0,0.5,0.3,0.5,0.4,0.8c0,0.5-0.2-0.1-0.3,0.3
	c0-0.2-0.1-0.5-0.4-0.4c0.3,0.4,0.6,1,0.8,1.6c0,0.6-0.3,0.7-0.6,0.7c-0.1,0,0,0.2-0.1,0.3c0,0.3,0.3,0.1,0.3-0.2
	c0.1,0.5,0.3,0.5,0.4,0.5c0,0.2-0.1,0.3-0.2,0.3c0,0.1,0.1,0.2,0.2,0.2c0.2-0.1-0.1-0.3,0-0.5c0.3,0.5,0.6,0.1,0.9-0.1
	c-0.1,0.3,0,0.7,0.1,0.7c0.3,0,0.6-1,0.7-0.1c-0.1,0.5-1.1,0.2-0.9,1c-0.1,0.2-0.4-0.2-0.5,0.4c0,0.2,0.2,0.1,0.2,0.5
	c0.2,0,0.3-0.5,0.5-0.4c-0.2,0.3-0.1,0.9,0.3,0.7c0,0.1-0.1,0.2-0.2,0.3c0.1,0.2,0.2,0.5,0.3,0.7c0.2-0.4,0.5-0.7,0.5-1.4
	c0.1,0,0,0.4,0.1,0.5c0.5,0,0.4-0.9,0.8-1.1c0-0.1-0.1-0.1-0.2-0.1c0.2-0.5,0.4-1.2,0.2-1.6c0.3-0.1,0.1,1,0.4,0.9
	c0,0.2-0.1,0.1-0.2,0.2c0,0.4,0.1,0.6,0.2,0.7c0,0.2-0.1,0.1-0.2,0.2c0.2,0.6,0.2,0.1,0.1,1c0.2,0.1,0.4,0.2,0.3,0.8
	c0.3,0.3,0.5,0,0.9,0.1c0-0.4-0.1-0.3-0.1-0.6c0.3,0.2,0.1,0.7,0.3,1.1c0.1,0,0-0.4,0.1-0.5c0.1,0.1,0.1,0.3,0.1,0.6
	c0.1,0,0-0.5,0.1-0.6c0.2,0,0.2,0,0.4,0.1c0.4-0.5,0.5-1.7,0.6-2.5c0.1,0,0.3,0.3,0.2-0.3c0.2,0,0.5-0.2,0.3,0.2
	c0.2-0.1,0-0.3,0.1-0.5c0.1,0.2,0.1,0.6,0.3,0.6c0.1,0,0-0.4-0.1-0.4c0.1-0.1,0.2-0.1,0.5-0.1c-0.2-0.3,0-0.3,0.1,0
	c0.1-0.1,0.1-0.4,0.3-0.3c-0.1-0.4-0.2-0.1-0.5-0.1c0.1-0.3-0.1-0.4-0.2-0.5c0-0.3,0.2-0.2,0.2-0.4c0.1,0.6,0.1-0.1,0.3,0.3
	c0.1-0.6,0.1-0.1,0.2-0.8c0-0.1-0.1-0.1-0.1-0.2c-0.3,0.6-0.6,0.5-0.9,0.6c0-0.1,0.1-0.1,0.1-0.3c-0.4,0-0.5,0.4-0.8,0.6
	c0-0.4-0.2-0.4-0.4-0.4c-0.1-0.4,0.2-0.1,0.1-0.5c0.2-0.1,0.2,0.2,0.3,0c-0.1-0.3-0.3,0-0.4,0.1c0-0.2,0-0.3-0.1-0.4
	c0.3,0.1,0.3-0.8,0.3-1.6c0.2-0.2,0.3-0.4,0.2-0.8c0.2-0.1,0.3-0.2,0.5,0.1c0.1-0.5,0.7-0.3,0.4-1.3c0.1-0.2,0.2-0.2,0.3-0.2
	c0,0.1-0.1,0.1-0.2,0.1c0,0.3,0.1,0.4,0.2,0.3c0,0.3-0.3,0.2-0.3,0.7c0.2,0.2,0.6,0.5,0.7,0.1c0.1,0.3,0.2,0.4,0.4,0.2
	c0,0.2,0.1,0.3,0.1,0.3c-0.1,0.5-0.1-0.3-0.2-0.1c-0.1,0.1,0.2,0.7,0.4,0.6c0,0.1-0.1,0.3,0,0.5c0.3-0.2,0.5,0.5,1,0.5
	c0.2-0.1-0.2-0.4,0.1-0.4c0.1,0.1,0,0.6,0.4,0.4c0,0.5,0.1,0.4,0.1,0.8c0.2,0,0.3-0.2,0.2-0.6c0.2-0.2,0.3-0.1,0.4,0.4
	c-0.2,0-0.1-0.5-0.3-0.3c0,0.4,0.4,0.6,0.4,0.3c0-0.2,0.1,0.3-0.2,0.4c0.3,0.8,0.9-0.1,1.1,1.1c0.1-0.5,0.2-0.1,0.3-0.3
	c0-0.1-0.1-0.2-0.1-0.2c0.1-0.2,0.4,0,0.8-0.2c0-0.2,0-0.3,0-0.5c-0.1,0-0.1,0.2-0.1,0.4c-0.2,0.1-0.2-0.7-0.4-0.2c0,0,0-1,0-1
	c-0.2-0.4-0.8,0.5-1,0.4c0.3-0.4,0.8-0.9,1.2-0.9c0.1-0.1-0.1-0.4-0.1-0.5c0-0.2,0.3-0.2,0.1-0.4c0-0.4,0.2,0,0.3,0
	c-0.2-0.4-0.5-0.4-0.5-0.9c-0.2,0.1-0.3-0.2-0.5-0.2c-0.1,0.6,0.6,0.5,0.6,1.1c-0.2,0-0.1-0.3-0.3-0.3c-0.1,0.2,0.1,0.5,0.1,0.8
	c-0.3-0.1-0.4-0.6-0.5-1.1c-0.1,0.2-0.1,0-0.3,0.2c0.1-0.2,0-0.6-0.1-0.5c0.1-0.1,0-0.6,0.1-0.6c-0.2,0.1-0.1-0.8-0.3-1.1
	c-0.3,0.5-0.5,0.3-0.8,0.2c-0.1,0.3,0.1,0.2,0.1,0.6c-0.1-0.2-0.3-0.2-0.3-0.7c0.2-0.3,0.5-0.8,0.7-0.7c0-0.3-0.2-0.2-0.3-0.2
	c0.1-0.4,0.4,0,0.4,0.4c0.3-0.4,0.4-0.1,0.6-0.3c-0.1-0.3-0.1-0.1-0.2-0.1c0-0.3,0.2-0.3,0.2-0.5c0.1,0.2,0.1,0.6,0.1,0.7
	c0,0,0.1,0,0.1,0c0.2,0-0.2-0.3,0-0.4c0-0.2,0,0.3,0.1,0.5c0.1-0.2,0.3-0.7,0.5-0.1c-0.2,0-0.4,0-0.5,0.2c0.3-0.1,0.7,0.7,1,0.6
	c-0.1-0.3-0.2-0.3-0.3-0.6c0.1-0.6,0.7-0.3,1-0.8c0-0.1-0.1-0.3-0.1-0.5c0.3-0.1,0.3-0.1,0.5-0.1c-0.1-0.3-0.3-0.2-0.3-0.6
	c0.2,0,0.5,0.6,0.6,0c-0.1-0.4-0.1,0.1-0.2,0c0.2-0.6,0.2-0.5,0.5-0.6c-0.2,0.3-0.1,0.5,0,0.9c0.2,0.1,0.1-0.4,0.3-0.3
	c0.1,0.4,0.5,0.3,0.6,0.8c-0.4-0.5-1.2-0.4-1.6,0.2c0.1-0.1,0.5,0.1,0.8-0.2c0,0.3,0.2,0.1,0.2,0.5c0.6-0.2,0.9,0.1,1.2-0.4
	c0.1,0,0.1,0.2,0.1,0.4c0.3-0.4,0.5,0.1,0.7-0.5c0.1-0.5-0.3,0-0.2-0.5c0.1-0.4,0.2,0.1,0.4,0.1c0.2-0.1-0.1-0.3,0-0.6
	c0.2-0.2,0.3,0,0.5,0.3c0.7-0.4,0.9-0.7,0.5-1.5c-0.2,0.1-0.2,0.4-0.3,0.7c0.1,0.3,0.2-0.1,0.3,0c-0.1,0.4-0.2,0.2-0.3,0.4
	c0-0.2-0.1-0.2-0.2-0.3c0-0.2,0.1-0.1,0.2-0.2c0-0.1,0-0.2,0.1-0.3c-0.1-0.3-0.4-0.3-0.4,0.2c-0.1-0.3-0.4-0.3-0.4,0.2
	c-0.1-0.6-0.3-0.7-0.6-0.4c0,0.2,0.2,0.1,0.2,0.5c-0.3,0.3-0.6,0.1-0.8-0.1c0.1-1.6-1.4-1.1-2-1.3c0.1-0.2,0.2-0.3,0.3-0.7
	c-0.2,0.4-0.4,0.5-0.7,0.6c0-0.2,0-0.3,0-0.5c0.2,0.4,0.5,0.1,0.6-0.5c-0.2-0.1-0.3,0.1-0.2-0.6C34.9,8.8,35,9.3,35,9.7
	c-0.2-0.2-0.3-0.2-0.5,0.2c-0.2-0.1-0.1-0.8-0.2-1.1c0-0.4,0.1-0.7,0.4-0.7c0-0.2,0-0.5,0-0.7c0.2-0.1,0.2,0.1,0.3,0.1
	c-0.3-0.4,0-1,0.3-1.1c0.1,0.3-0.1,0.3-0.1,0.5c1.1-0.5,2.1,0.3,2.8,0.7c0.1-0.2,0.2-0.5,0.5-0.4c0,0.2,0.1,0.3,0.1,0.3
	c0,0.1-0.1,0.1-0.2,0.1C38.8,8.4,39,8.1,39.6,8c0-0.4-0.2-0.1-0.2-0.6c0.1,0.2,0.1,0.2,0.3,0.1c0,0.2,0,0.2,0,0.4
	c0.3-0.4,0.4,0.5,0.7,0c0.2,0.1-0.2,0.5,0,0.5c0,0.3-0.3,0.1-0.4,0.2c0,0.7,0.4,0.1,0.5,0.3c-0.3,0.3,0.2,0.4,0,0.7
	c0.4,0,0.4-0.5,0.6,0c0.1,0,0.2-0.2,0.2-0.4C41.3,9,41,8.9,41,9.2c0.2-0.9,0.6,0.5,1.1,0.6c-0.2,0.9-0.8-0.1-1.3,0.6
	c-0.3-0.6-0.3,0.4-0.6,0.1c0-0.3,0.2-0.3,0.3-0.4C40.3,9.5,40,10,39.7,9.8c0.2,0.4,0.5,0.8,0.7,1.1c0.2,0.1,0.1-0.4,0.3-0.3
	c0,0.1,0,0.2,0,0.4c0.2,0.1,0.2-0.4,0.5-0.3c-0.2,0.3,0,0.4,0,0.9c0.3,0,0.1-0.3,0.2-0.6c0.4-0.2,0.8,0.1,1.1,0.1c0.1,0,0-0.3,0-0.5
	c-0.2,0.2-0.4,0.5-0.6,0.1c0.1,0.1,0.7-0.4,0.3-0.7c0.2-0.2,0.2-0.2,0.4-0.7c0,0.2-0.1,0.3,0,0.5c0.1,0,0.1-0.1,0.2-0.1
	c0-0.7-0.1-0.6-0.2-1.1c0.1,0.3,0.2-0.3,0.3,0.1c0.4-1.1,0.8-2.1,1.6-2.1c0.3-0.9,0.9-1.1,1.2-2c0.2-0.1,0.5,0.1,0.5-0.4
	c0.1,0,0.2,0.1,0.2,0.2c0.2-0.1-0.2-0.3,0-0.5c0.3-0.1,0,0.2,0.1,0.2c0.1-0.3,0.1-0.5,0.2-0.8C47.2,3,48,3.1,48.4,2.7
	c0.1,0.1,0.1,0.2,0.2,0.3c1.1-1,1.9,0.2,2.9-0.2c0.2,0.5,0.3,0.2,0.7,0.3c0,0.2,0.1,0.2,0.1,0.5c0.6-0.4,1.1,0.5,1.7,0.4
	c0,0.1,0,0.2,0,0.4c0.4-0.5,0.4,0.3,0.7-0.2c0.1,0.4,0.3,0.4,0.5,0.2c0,0.4,0.1,0.3,0.1,0.6c0.2,0.1,0.1-0.4,0.3-0.3
	c0.4,0.7,1.2,1.3,1.8,1.1c0.2,0.7,0.5,1,0.9,1.2c-0.1,0.2-0.1,0.6-0.1,0.9c0.5,0.8,1.4-0.3,1.8,0.6c-0.9-0.2-2,0.1-2.8,0.2
	c-1.2,1.4-2.6,0.7-4,1.1c-1.2-0.8-2.3-0.3-3.6,0.7c0,0.6,0.4,0.4,0.3,1.1c-0.8,0-1.1-0.1-1.9,0.4c0,0.2,0.1,0.3,0.2,0.3
	c0.1-0.8,0.7,0.3,0.7-0.2c0.6,0.7,1.3-0.2,1.9,0.8c0.1-0.1-0.1-0.5,0.1-0.6c0,0.7,0.5,0.4,0.7,0c-0.3,0.9,0.6,0.5,0.9,0.7
	c0,0.1-0.1,0.1-0.1,0.3c0.2,0.2,0.4,0.1,0.5-0.3c0.1,0,0,0.4,0.1,0.6c0.5-0.2,1,0.7,1.5,0.3c0,0.4,0.1,0.3,0.1,0.7
	c0.2,0,0.3-0.1,0.4,0.2c0.1,0,0.2-0.4,0-0.4c0-0.3,0.1,0.3,0.3,0.1c0.1,0.2,0,0.2,0.1,0.5c0.2-0.4,0.6,0.1,0.7-0.5
	c0.1,0.8,0.3,0.6,0.6,0.8c0,0.3-0.3,0.1-0.5,0.2c-0.1,0.4,0.2,0.6,0.3,0.6c-0.1,0.6-0.4-0.3-0.6,0.2c0.1,0.2,0.5,0,0.4,0.5
	c0.2,0,0.2-0.4,0.4-0.3c0.2-0.1-0.1-0.2-0.1-0.5c0.2,0.3,0.3,0.4,0.5,0.9c-0.1,0-0.2,0.1-0.2,0.3c0,0.2,0.1,0.2,0.1,0.4
	c0.2-0.4,0.3,0.1,0.5-0.2c-0.2,0.3-0.1,0.8,0.2,0.6c0.2,0.2-0.3,0.1-0.4,0.2c0.3,0.4,0.6,0.2,1,0.2c0,0.4,0.2,0.6-0.1,0.6
	c0.3,0.1,0.6-0.1,0.7-0.8c0.2,0,0.5,0.5,0.5,0c0.1-0.4-0.2,0-0.2-0.3c0.2-0.5,0.3,0.7,0.5,0.8c0.1,0,0.2-0.4,0-0.4
	c0.1-0.2,0.3,0.3,0.1,0.5c0.1,0.4,0.4-0.5,0.4,0.4c0.2-0.2,0.1-0.6,0.2-0.8c0.1,0,0.5,0.1,0.7,0.1c-0.1,0.4-0.3-0.1-0.5,0.1
	c0,0.2,0,0.4,0.1,0.3c-0.1,0.5-0.2,0.1-0.2-0.1c-0.2,0-0.1,0.3-0.2,0.5c1-0.1,2.6,1,3.7,0.4c-0.1,0.9,1,0.8,1.1,0.3
	c0.1,0.1,0.1,0.4,0.2,0.5c0.1-0.5,0.2,0.1,0.4-0.2c0.2,0.2-0.2,0-0.1,0.4c0.2,0.6,0.3-0.5,0.5-0.1c0,0.1-0.1,0.1-0.1,0.3
	c0.2,0.3,0.7,0.3,0.6-0.3c0.2,0.7,0.1,1.2,0.5,1.4c0.2,0.1,0.1-0.3,0.3-0.3c0.1,0.4,0.4,0.4,0.5,0.3c0.1,1.3,0.8,0.3,1.1,0.8
	c0.3-0.5,1.4-0.2,1.5,0.1c-0.1,0.4-0.2,0.2-0.3-0.1c-0.1,0.1,0.1,0.5-0.2,0.5c0.1-0.2,0.1-0.5,0-0.6c0,0.4-0.3,0.1-0.5,0.1
	c-0.1,0.1-0.1,0.1-0.1,0.3c0.1,0.7,0.7,0.5,0.8,0.2c0.1,0.1,0.4,0.4,0.5,0.1c0.2,0.3-0.2,0.3-0.3,0.3c0,0.2,0,0.3,0,0.5
	c0,0,0,0,0.1-0.1c0,0,0,0,0,0c0.1-0.1,0.1-0.3,0.2-0.3c0,0.1-0.1,0.2-0.1,0.2c0.5-0.3,1.5-0.2,1.1-0.8c0.4,0.1,0.8,0.2,1.1,0.3
	c0.1,0,0.1,0,0.2,0c0-0.3-0.3,0-0.3-0.4c0.7,0.2,0.5,0.3,1.3,0.1c0,0.2-0.1,0.3-0.1,0.4c0.1,0,0.1,0,0.2,0c0-0.2,0.1-0.3,0.1-0.4
	c0.1,0.2,0.1,0.3,0.2,0.4c0,0,0.1,0,0.1,0c0-0.4,0-0.3,0.3-0.3c0,0.1,0,0.2,0,0.2c1.6-0.2,3.2-0.7,4.3-0.6c0.6-0.4,1.9-0.7,2.8-0.6
	c1.5-0.6,2.9-0.6,4.4-0.6c1.2-0.4,1.9-0.4,3-0.8c0.2,0.1,0.1,0.4,0.4,0.3c0-0.5,1.2-0.5,1.8-0.6c-0.1,0.1-0.4,0.2-0.3,0.3
	c0.5-0.2,1.1-0.4,1.7-0.5c-0.2-0.2-0.4-0.4-0.6-0.3c0.2-0.3,0.1-0.1,0-0.5c0.4,0.5,1,0,1.5-0.1c0.1,0.1,0,0.5,0.1,0.5
	c-0.1-0.6,0.5,0.1,0.6-0.5c0,0.5,0.2,0.3,0.2,0.9c0,0,0.1,0,0.1,0c0,0,0-0.1,0.1-0.1c0.1,0,0,0.1,0,0.2c0.1,0,0.1,0,0.2,0
	c0,0-0.1,0-0.2,0.1c0,0.1,0,0.2,0,0.4c-0.2,0-0.4-0.1-0.7-0.2c-0.5,0.1-0.9,0.2-0.9-0.2c-0.5,0.1-1.1,0.5-1.6,0.6
	c0.1,0.1,0.3,0.1,0.5,0.2c-0.3,0.2-1.1-0.1-1.2,0.3c0.6-0.1,1.6,0,1.9-0.6c1.4,0.7,3.3-0.6,4.9-0.1c0.4-0.3,0.8-0.1,0.7-0.4
	c0.2,0.3,0.4,0.1,0.6,0.1c-0.1,0.1-0.3,0.2-0.2,0.2c0.7-0.4,1.3-0.1,2-0.4c-0.1-0.1-0.8,0-0.4-0.3c0.6,0.4,0.6-0.1,0.9,0
	c-0.4,0.2,0.2,0.1,0.3,0.4c0.7-0.2,1.2-0.1,1.7-0.4c-0.4-0.1-0.1-0.5-0.2-0.3c0.2,0.1,0.3,0.2,0.4,0.3c1.1-0.2,2.3-0.3,3.4-0.6
	c-0.3,0.2-0.8,0-0.6,0.3c0.6,0,1.2-0.2,1.5-0.3c-0.1,0.1-0.2,0.2,0,0.2c0.3-0.3,0.6,0,0.9-0.2c0-0.1-0.2-0.1-0.1-0.2
	c0.5,0.3,0.6-0.2,0.9-0.2c-0.1,0.1-0.1,0.2,0.1,0.3c1.2,0,2.3,0.1,3.2-0.3c0.3,0.1,0.6,0.4,0.8,0c0.2,0.1,0.1,0.2,0.3,0.3
	c0.3-0.3,1.3-0.4,1.9-0.1c0.1-0.1,0.3-0.2,0.4-0.2c3.4,0.6,7-0.2,10.4,0.1c0.7-0.2,1.5-0.1,2.2-0.1c0.1-0.1,0.3-0.2,0.4-0.2
	c0.5,0.2,1.4,0.1,1.7-0.1c0.1,0.4,0.4,0,0.8-0.1c2,0.4,4.2-0.2,6.2,0c0.1-0.1,0.2-0.1,0.3-0.2c15.2-0.3,30.1-1.5,45.4-1.3
	c0-0.2,0.4-0.2,0.7-0.2c-0.1,0.1-0.4,0.1-0.3,0.2c0.6,0.2,0.4-0.2,0.8-0.2c0.1,0.1,0.2,0.2,0.4,0.3c2.1-0.2,3.6-0.1,5.7-0.3
	c-0.1,0.1-0.1,0.2,0.1,0.2c0.1-0.1,0.3-0.2,0.4-0.2c3.9,0.2,7.8-0.2,11.7,0c1.8-0.1,3.5-0.2,5.3,0c0.6-0.3,1.2,0.2,1.9-0.2
	c1,0.4,2.1-0.2,3.2,0.2c2.4-0.4,4.8,0.2,7.3-0.2c0.1,0.1,0.2,0.2,0.4,0.3c1.9-0.3,4.2,0.3,5.8-0.1c0.6,0.4,1.5-0.2,1.9,0.3
	c0.1-0.1,0.3-0.2,0.4-0.2c0.6,0.3,1.2,0.1,2,0.1c1.4,0,3.7,0.4,4.2,0.1c3.3,0.3,6.6,0.1,9.9,0.4c0.1-0.1,0-0.1,0.1-0.2
	c1.9,0.2,3.8,0.5,5.7,0.2c0.2,0.1,0.4,0.3,0.5,0.4c0.8-0.3,1.5-0.1,2.1,0.1c0.1-0.1-0.1-0.2,0-0.2c0.4,0,0.8,0.4,1.3,0.3
	c1.8-0.2,3.6,0,5.4,0.3c-0.4,0-0.1-0.2-0.1-0.3c2.2,0.5,4.4,0.4,6.6,0.5c0.3,0.1,0,0.2,0.3,0.4c0.4-0.4,0.8-0.1,1.3-0.4
	c0.6,0.5,1.2,0.1,1.8,0.5c0.9-0.3,2.5,0.1,3.7,0.1c0.1,0.6,1.8,0,2.5,0.4c0.3-0.1,0-0.2,0.2-0.4c0.3,0.1,0.6,0.4,1.1,0
	c1,0.4,2,0.3,3,0.3c0.4,0.2-0.5,0.4,0.1,0.6c1.1-0.3,1.9-0.5,3-0.4c0,0.3-0.4,0.1-0.7,0.3c0.3,0.2-0.1,0.3,0.3,0.4
	c0.5-0.2,1.2-0.4,1.6-0.1c-0.2,0-0.8-0.1-0.7,0.2c0.6,0,1.2,0.1,1.8-0.1c0.3,0.1,0,0.2,0.3,0.4c0.5-0.1,0.8,0.1,1.2-0.3
	c0.8,0.4,1.6,0.1,2.3,0.1c0.3-0.1-0.6-0.3-0.1-0.4c0.6,0.1,0,0.6,0.5,0.5c0-0.2,0.3-0.6,0.7-0.3c-0.1,0.1-0.4,0.2-0.3,0.3
	c1.1,0.2,2.2,0.2,3.3,0.2c0,0,0,0,0,0.1c0.8,0.1,2.4,0.4,2.5,0c0.1,0.1,0.3,0,0.5,0.1c-0.1,0.1-0.4,0.2-0.1,0.3
	c0.3-0.3,0.5,0.1,0.8-0.2c-0.2-0.1-0.4-0.1-0.6-0.1c0.6-0.3,0.6,0.5,1.2,0.2c0.3,0.3,0.6,0,0.8,0.2c-0.1,0.2-0.6,0.1-0.4,0.2
	c0.8,0.1,1.6,0.2,2.5,0c-0.1,0.1-0.1,0.2-0.1,0.3c0.2-0.1,0.4,0.1,0.7,0c0.1-0.1,0-0.2,0.1-0.3c0.3,0.2,0.7,0.2,1,0.2
	c-0.1-0.1,0-0.4,0.2-0.2c-0.3,0.5,0.7,0.1,1,0.3c0.1,0.1-0.5,0.3-0.3,0.4c0.4-0.3,0.8-0.1,1.2-0.1c-0.4-0.3,0.6-0.3,0.8-0.2
	c-0.4,0.1-0.6,0.3-0.3,0.5c0.2,0,0.4-0.4,0.6-0.2c-0.4,0.6,1.4,0.5,2,0.6c-0.1-0.1-0.2-0.2,0-0.2c0.4,0.3,0.2,0,0.6,0
	c0.1,0.1,0.3,0.2,0.4,0.3c-0.5,0.1-0.1,0.3-0.2,0.5c-0.6-0.2-0.7-0.3-1.3,0c-0.4-0.5-0.5-0.1-1.1-0.5c0.2,0.2-0.4,0.4-0.7,0.3
	c0.1-0.1,0.4-0.2,0.3-0.3c-0.2,0.1-0.2-0.4-0.6-0.1c-0.1,0.2,0,0.5-0.3,0.7c-0.3-0.2,0.5-0.4,0-0.7c-0.5,0.4-1-0.4-1.5,0.1
	c0.2,0.2,0.5,0.4,0.2,0.6c-0.3-0.3-0.4-0.3-0.3-0.6c-1,0.5-1.9,0.1-2.8,0c0,0.1,0,0.1-0.1,0.2c0.2,0.1,0.4-0.1,0.6,0.1
	c-0.6,0.3-0.6-0.4-1-0.3c0,0.2-0.1,0.4-0.5,0.3c0.6-0.3-0.1-0.2-0.3-0.5c-0.7,0.3-2.6-0.2-3,0.4c-0.4-0.1-0.1-0.2-0.2-0.4
	c-0.7,0-1.3-0.2-2,0c0.2-0.1,0.3-0.2,0.2-0.4c-0.3,0-0.5,0-0.8,0.2c0.1,0.1,0.4,0.2,0.3,0.3c-0.2-0.1-0.5,0.1-0.7-0.1
	c0.3-0.2,0.4-0.3,0-0.5c-0.8,0.5-1.7-0.5-2.3,0.2c-0.2,0-0.3-0.1-0.4-0.3c-0.2,0.3-0.7,0-0.6,0.2c0.1,0.1,0.4,0,0.3,0.2
	c-0.6,0-1.1-0.3-1.7-0.4c0.1,0.1-0.1,0.2,0,0.2c0.1,0.1,0.3,0.1,0.5,0.2c-1.3,0.3-2.5-0.5-3.8,0c-0.5-0.2,0.3-0.1,0-0.2
	c-0.8-0.2-1.6-0.1-2.3-0.3c-0.8,0.5-2-0.6-2.6,0.1c-0.2-0.5-1,0.1-1.5-0.4c-0.4,0.3-0.8,0.1-1.2,0.1c0-0.5-1.4-0.4-1.9,0.1
	c-0.4-0.1-0.1-0.2-0.2-0.4c-0.3,0.2-0.5-0.3-0.8-0.1c0.1,0.2-0.2,0.5-0.5,0.3c0.1-0.1,0.6-0.2,0.4-0.4c-0.4-0.2-0.8,0.3-1.2,0.3
	c0.1-0.2-0.1-0.2-0.3-0.4c-0.5,0.3-1,0.2-1.5,0.5c0.2,0,0.3,0.1,0.2,0.2c-0.1,0-0.2-0.1-0.3-0.1c-0.1,0.1,0.3,0.3,0.2,0.4
	c-0.8-0.3-0.8,0.2-1.7-0.3c0.2-0.1,1.1,0.1,0.5-0.3c0.2-0.2,0.9,0.1,0.9-0.2c-0.3-0.1-0.6,0.1-0.9-0.3c-0.3,0.3-0.6,0-1,0.2
	c0.2,0.2,0.4,0,0.6,0.1c-0.3,0.1,0,0.2,0,0.4c-0.3,0.2-0.6,0.2-0.8,0c0.1-0.1,0.4-0.2,0.3-0.3c-0.1,0.1-0.2-0.1-0.4,0
	c-0.4,0.1,0.1,0.3-0.3,0.4c-0.9-0.3-2.2,0.1-2.8-0.7c-0.1,0.1-0.7,0-0.6,0.2c0.1,0.2,0.7-0.1,0.5,0.3c-0.5-0.2-2.1,0.1-1.7-0.5
	c-0.1-0.1-0.2,0-0.4,0c-0.4,0.1,0.1,0.3-0.3,0.4c-1.5-0.1-3.5-0.4-4.7-0.1c-1.7-0.4-3.4-0.2-5.1-0.4c0,0.1,0.2,0.1,0.1,0.2
	c-1.1-0.6-3.2-0.2-4.8-0.5c-0.1,0.1,0,0.2-0.1,0.3c-1-0.2-2.1-0.1-3.2-0.3c0.1,0.1,0.2,0.2,0,0.2c-0.5-0.4-1.3-0.5-1.6-0.1
	c-1.2-0.5-2.4,0.1-3.6-0.4c0.1,0.3-0.9,0.1-0.6-0.1c0.1,0.3,0.8,0,0.7-0.2c-0.5-0.1-0.3-0.3-0.5-0.5c-0.8,0.1-0.7,0.7-0.6,0.8
	c-0.9-0.2-1.8,0-2.6,0c-0.2-0.1-0.1-0.2-0.3-0.3c-2.3,0.6-5-0.2-7,0.1c-0.4-0.2-0.5-0.1-0.8-0.3c-0.1,0.1,0,0.2-0.2,0.2
	c-3.7-0.3-6.9,0-10.4-0.3c-0.2,0.3-1.2,0.1-1.7-0.2c-0.6,0.4-1.1,0-1.7,0.1c-0.3,0.3-2.9,0.1-4,0.2c0.1-0.1,0.1-0.2-0.1-0.3
	c-0.9,0.5-1.8-0.2-2.3,0.3c-0.2-0.1-0.3-0.2-0.3-0.3c-0.2,0-0.5,0.1-0.5,0.3c-0.5-0.2-0.5,0.2-0.5-0.3c-0.7,0.2-1.3-0.1-2,0.2
	c0.1-0.1,0.2-0.2,0-0.2c-0.5,0.2-1-0.1-1.5,0.2c0.2,0-0.3-0.4-0.4-0.3c-0.4,0.1,0.2,0.3-0.2,0.4c-0.7-0.3-1.5-0.3-2.3-0.1
	c-0.4-0.3-1,0.1-1.9,0.1c-0.5,0-1.6-0.4-1.8,0c-2.2-0.5-3.9,0.2-6-0.2c0.1,0.1,0.3,0.2,0.2,0.3c-0.3,0-0.1-0.1-0.4-0.3
	c-1.1,0.5-3.4,0-5.1,0.3c0.1-0.1,0-0.1-0.1-0.2c-1.1,0.3-2.1,0.1-3.2,0c-1.3,0.3-3,0.5-3.9-0.1c-0.3,0.2,0.1,0.3-0.2,0.5
	c-0.4-0.3-0.8,0.1-1.1,0c0.1-0.1,0.4-0.1,0.3-0.2c-0.4,0.1-0.5,0-0.7,0.3c-2.4-0.4-4.8,0.3-7.1-0.1c-0.2,0.1-0.4,0.3-0.1,0.4
	c31.8-0.4,63.6-0.7,95.2,1.7c1.2,0.1,2.9,0,3.6,0.3c0.7-0.3,1.3,0,2-0.2c0.2,0.1,0.3,0.4,0.5,0.3c0.1-0.4,1.1,0,1.4,0.1
	c0.7,0.2,1.7-0.3,1.9,0.1c-0.3,0-0.6,0.1-0.8,0c0.6,0.7,2.2-0.4,3,0.3c1.1-0.5,3,0.5,3.5-0.2c0.2,0.2,0.4,0,0.5,0.3
	c0.2-0.3,1.3-0.2,1.2,0.2c0.9,0,1.8-0.4,2.6,0c0.1,0.1-0.5,0.3-0.3,0.4c0.2-0.1,0.7-0.2,0.4-0.4c1.1-0.2,2,0.4,3.1,0
	c-0.1,0.3,0.6,0.3,0.7,0c0.2,0.1,0,0.2,0.1,0.3c0.5-0.1,1.1,0.3,1.3-0.2c0.4,0.1,0.7,0.1,1.1,0.2c0.5,0.7,2.8,0.1,3.9,0.7
	c1.3-0.5,2.4,0.6,3.7-0.1c0.2,0.3,0.4,0,0.6,0.2c-0.8,0.3-1.7,0-2.6,0.2c0,0.1-0.2,0.3-0.1,0.4c0.3,0.1,0.6,0.1,0.9-0.2
	c0.5,0.2-0.6,0.3,0.1,0.6c0-0.3,1,0,0.8-0.5c0.5,0.3,0.9-0.1,1.1,0.2c-0.2-0.3,0.2-0.3,0.2-0.6c0.6,0.4,1,0.2,1.4,0
	c0.3,0.1,0,0.2,0.2,0.4c0.6-0.1,1.7,0,2,0.2c-0.5-0.1-0.9,0.1-1.4,0c0.3,0.2-0.1,0.4,0.4,0.6c0-0.3,0.3-0.1,0.6-0.3
	c-0.2,0.5,2,0.8,2.4,0.4c0.4,0.1-0.3,0.2,0.2,0.4c0.1-0.1,0.2,0,0.3-0.1c0.1-0.3,0.4-0.4,0-0.7c0.3,0.1,0.6,0.1,0.8,0.1
	c-0.1-0.3-0.7-0.2-0.5-0.4c0.3,0.3,0.7-0.1,1,0.2c-0.2,0.3-0.6,0.2-0.6,0.5c0.3,0.2,0.7-0.1,1,0.1c-0.2,0.2,0.2,0.3,0,0.5
	c-0.3,0-1,0.2-0.7,0.4c0.2,0.1,0.5-0.3,0.8-0.2c-0.4,0.3,0.6,0.3,0.2,0.5c0.4,0.1,1-0.1,0.5-0.4c-0.2,0.4-0.2-0.1-0.4-0.3
	c-0.1,0-0.2,0.1-0.3,0.1c0.2-0.1,0.1-0.2,0.3-0.3c0.4,0,0.1,0.3,0.5,0.5c0.2-0.1,0.3,0,0.5-0.2c-0.1-0.2-0.6,0-0.4-0.3
	c0.6,0.2,1.3-0.1,2,0.2c-0.8,0.1-1.1,0.3-1.9,0.4c0.1,0.1,0,0.1,0.1,0.2c0.8,0,1.6-0.3,2.4-0.2c0.2,0.1,0,0.2,0.1,0.3
	c0.1-0.1,0.2,0,0.3-0.1c0.1-0.1-0.1-0.2,0-0.2c0.3,0,1-0.1,1,0.2c0.6-0.1,1.7-0.7,2-0.2c-0.2,0-0.8,0.3-1.6,0.5c0.7,0.1,1.3-0.3,2,0
	c-0.4-0.2,0.2-0.4,0-0.6c0.1,0.1,0.3-0.1,0.5,0.1c-0.4,0.1-0.6,0.4-0.3,0.7c0.5-0.4,0.7-0.1,0.9,0.2c1.2-0.4,1.8,0,2.8-0.2
	c-0.1,0.4-1.1,0.1-1.2,0.6c0.7,0.2,1.4-0.3,2,0.3c0.6-0.2,1.1-0.1,1.7-0.1c0.2-0.1,0.1-0.3,0.5-0.4c0.1,0.1,0.2,0.2,0.4,0.1
	c-0.3-0.2-0.2-0.3,0.1-0.3c0.4,0.3-0.2,0.4-0.5,0.5c0.6,0-0.3,0.2,0.2,0.4c0.2-0.3,0.7-0.4,0.7,0c-0.5,0.1-0.7,0.3-1.1,0.2
	c0.1,0.1,0,0.1,0.1,0.2c0.3,0.2,0.8-0.2,0.7,0.1c-0.7,0.1-1.3-0.2-2,0c-0.1,0.1,0.3,0.3,0.2,0.4c-0.2-0.2-0.5,0-0.7-0.3
	c0.1-0.1,0.3-0.2,0.2-0.2c-0.4,0-1.2,0.1-1.1,0.4c-0.2-0.2-0.4-0.1-0.6-0.3c0.3-0.3,0.6,0.2,0.9-0.1c-0.6-0.2-0.7-0.1-1.2-0.6
	c-0.1,0.1-0.3,0.1-0.4,0.1c0,0.2,0.1,0.1,0.4,0.3c-0.2,0.1-0.2,0.2-0.1,0.3c-0.3,0.2-0.6,0-1,0.2c0.1,0.3,0.9,0,0.4,0.3
	c-0.5,0-1.5-0.1-1.7-0.3c0.2,0.1,0.4,0,0.7-0.2c-0.6-0.4-1.7,0-2-0.3c-0.2,0.1-0.1,0.2,0.1,0.3c-0.3,0.3-0.6,0.2-1,0.2
	c-0.7-0.5-1.7-0.3-2.7-0.1c0.1-0.1,0.7-0.1,0.5-0.3c-0.4-0.3-0.8,0.2-1.1,0.1c0-0.1,0.3-0.2,0-0.4c-0.1,0.1-0.3,0.2-0.4,0.2
	c-0.6-0.4-1.3,0.4-1.9,0.3c-0.5-0.4-1.6-0.2-1.5,0.2c0.1,0,0.8-0.3,0.6,0c-0.4-0.1,0.2,0.2-0.1,0.3c-0.3-0.1-0.6-0.2-0.9-0.4
	c0.4-0.3,0.4-0.3,0.9-0.4c-0.8-0.3-1.9-0.2-2.3,0.1c0.2-0.1-0.5-0.3-0.6-0.3c-0.1,0.5-0.8-0.1-1.2,0c0,0.1-0.4,0.5-0.7,0.4
	c0.1-0.2,0.2-0.4-0.1-0.6c-0.6,0.3-0.6-0.4-1.3,0.1c0.4,0,0.1,0.2,0.1,0.3c-0.5-0.1-1.4,0-0.8-0.3c-0.6,0.2-1.6,0.4-2.4,0.1
	c-0.1,0.1-0.3,0.2-0.4,0.2c-0.5-0.2,0.4-0.3,0.1-0.4c-0.8,0.1-1.1,0.3-2,0.2c0.2,0.2,0.4,0,0.6,0.2c-0.5-0.1-1.5,0.2-1.6-0.1
	c0.1,0.1,0.7,0,0.6-0.1c-0.4,0-0.9-0.2-1.3,0.1c0.2,0.1,0.6,0,0.4,0.3c-0.3-0.1-0.7,0.1-0.5-0.3c-0.2,0.4-0.5,0.1-0.9,0.3
	c0.2,0.1,0.5,0.1,0.7,0.4c0.2-0.2,0.4,0,0.6-0.2c0.6,0.8,2.1-0.1,3.1,0.5c0.6-0.3,1.1,0.3,1.7-0.1c1,0.2,2,0.3,3,0.2
	c0,0.1,0.2,0.3,0.1,0.4c0.3,0,0.5,0.2,0.8,0c0.4,0.2,0.2,0.4,0.3,0.6c0.3-0.2,0.6-0.3,0.6-0.5c0.5,0,0.8,0.3,0.9,0.4
	c0.2-0.2,0.2-0.3,0.6-0.2c-0.1,0.3-0.7,0.3-0.5,0.5c0.3-0.1,0.9-0.3,0.9,0.2c0.2-0.2,0.4-0.1,0.7-0.2c-0.1-0.2-0.1-0.4,0.3-0.5
	c0.3,0.2-0.3,0.1,0.1,0.4c0.6-0.2,0.9,0.2,1.6,0.1c-0.5,0.2-0.6,0.2-0.5,0.5c-0.2-0.2-0.4,0.2-0.6,0.2c-0.3-0.1-0.7-0.1-1-0.1
	c0.1-0.2,0.7-0.1,0.5-0.3c-0.4,0.3-0.8-0.4-1,0.2c-0.6-0.3-1-0.4-1.8-0.5c-0.2,0.1-0.3,0.2-0.3,0.3c-0.1-0.1-0.2-0.1-0.4,0
	c-0.5-0.1,0.3-0.2,0-0.4c-0.4-0.2-0.7,0-0.7,0.3c-0.3-0.1-0.1-0.2-0.3-0.4c-0.6,0-0.8,0.3-1.5-0.2c-0.2,0.1,0.1,0.2-0.2,0.4
	c-0.6-0.1-0.6-0.2-0.4,0.1c-0.3,0-0.5-0.2-0.8-0.2c-1.1,0.4-1.9-0.2-2.7-0.3c-0.4,0.2-1,0.5-0.6,0.7c0.2-0.2,0.1-0.3,0.5-0.3
	c0.4,0.1-0.2,0.2,0.2,0.4c1.4,0.1,2.9,0.2,4.3,0.5c-0.3,0.3-0.6,0.1-0.9,0.2c-0.1,0.3,0.4,0.2,0.1,0.4c-0.1-0.1-0.1-0.2-0.2-0.3
	c-0.6,0.2-0.7,0.4-1.2,0.3c0.6-0.1,0.1-0.2,0.4-0.5c0.2,0.1,0.3,0.3,0.5,0.2c0-0.2,0.3-0.3,0-0.5c0,0.5-0.5,0-1,0.2
	c0.3,0.2-0.4,0.4-0.5,0.4c-0.8-0.2-3,0.2-3.6-0.2c-0.1,0.1,0.1,0.3,0,0.4c0.5,0,1,0,1.5,0.1c0.7,0,0,0.3,0.5,0.4
	c2.3,0,5.7,0.2,8.5,0.1c1.1,0,2.4,0.1,3.6,0.1c0.3,0,0.2-0.2,0.4-0.2c0.4,0,0.1,0.2,0.4,0.3c0,0,0.7,0,1,0c2.9,0.2,5.8-0.1,8.7,0.1
	c0.5,0.2,0.5,0.2,1.4,0.3c0.7,0,0.5,0,1.1-0.2c0.1,0,0.7,0,0.9-0.1c0.1,0,0,0.2,0.1,0.2c0.5,0.2,2.3-0.1,3.3,0
	c1.2,0.1,2.6,0.4,4.1,0.3c-1.5,0.2-2.6,0.7-3,1.7c1.4,0.6,4.1-0.1,5.5,0.5c3.3-0.3,7.5-0.3,11.3-0.2c0.3,0,0.4-0.1,0.4-0.3
	c3.8,0.4,7.8-0.2,12.1,0c-7.7,0.5-15.2,0.2-22.8,0.8c-1.7-0.1-6.1-0.2-8.7-0.1c-1.6,0.1-2.3,0.8-1.6,1.8c2,0.5,3.7-0.1,5.6,0.2
	c0.3,0.4,0.7,0.7,0.2,1.1c-3.9,0.4-8.4-0.1-11.6,0.7c-0.5-0.2-1.2,0-1.8,0c-0.3,0.2-0.6,0.5-0.9,0.7c0.1,0.2,0.4,0.3,0.4,0.5
	c3.8,0,6.6,1.5,10.6,1.2c0.5,0.4,1.1,0.8,1.6,1.2c1.2-0.1,3.1,0,4.7-0.3c0.4-0.1,0.3,0.2,0.4,0.3c3.7-0.2,7.1-0.5,10.3,0
	c-2.8,0.2-5.8,0-8.4,0.2c-0.4,0.1-0.6,0.3-0.8,0.5c-2.3-0.2-5.8,0.1-8.7-0.1c-0.4,0.3-0.5,1,0.7,1c-0.3,0.2-0.5,0.1-1,0.1
	c0,0.1,0.1,0.2,0.3,0.3c-1.5,0-1.8,0.1-3.3,0c-0.3,0.1-0.4,0.4-0.2,0.6c1.3-0.1,2.4,0.2,3.6,0.2c0.7,0,1.2-0.3,1.8-0.3
	c0.3,0,0.3,0.2,0.7,0.2c0.3,0,0.8-0.2,1.1-0.2c0.4,0,0.5,0.2,1,0.2c1.5,0.1,3.1-0.4,4.6-0.4c1.2,0.1,2.2,0.7,3.6,0.5
	c-0.5,0.5-1.5,0.2-2.4,0.2c-3,0.1-6.4,0.7-8.9,0.7c-0.3,0.4,0.3,0.6,0.5,1c0.8-0.1,1.4-0.1,2.1-0.1c0.4-0.1-0.2-0.2,0.2-0.3
	c1.9,0,3.5-0.2,5.7-0.3c0.2,0.3,0.7,0.3,0.4,0.8c0.3,0,0.4,0.1,0.5,0.1c0.6,0,0-0.1,0.2-0.3c0.4,0.5,1.1-0.1,1.5,0.3
	c2.5-0.6,4.6,0.1,7.5-0.6c-1.9,0.5-4.4,0.6-6.9,0.7c-0.5,0,0.1,0.3-0.3,0.3c-0.7,0-1.3-0.3-1.9-0.3c-0.8,0-1.1,0.3-1.8,0.4
	c-0.8,0.1-1.8,0-2.6,0.1c-0.8,0.1-1.5,0.6-2.4,0.4c-0.3,0.2-0.2,0.5-0.9,0.6c-0.1,0.3,0.7,0.5,0.2,0.7c-0.5,0.1-0.1-0.3-0.4-0.3
	c-0.5,0.1-0.7,0.3-1,0.5c-0.5-0.1-0.9-0.1-1.4-0.1c0.1,0.1,0.2,0.1,0.2,0.2c0.7,0.5,1.7,1.1,2.2,1.6c0.9,0.9,0.8,2.1,1.9,3
	c-0.1,1.7,0.7,3.5,0.9,5.6c0.1,0.2,0.4,0.2,0.3,0.5c-1.3,0.8-0.5,2.2-1.1,3.3c-0.2,0.3-0.8,0.5-1.1,0.8c-0.6,0.6-0.7,1.4-1,1.9
	c-3.7,1-5.4,3.3-8.5,4.7c-0.1,0-0.5,0-0.7,0.1c-1.2,0.6-3,0.9-4.4,1.5c-0.8,0.9-2.5,0.8-4.6,1.1c-0.7,0.1-1,0.3-2.1,0.3
	c-1.4,0.1-2.7,0.6-4.1,0.8c-1.6,0.2-3-0.1-4.5-0.1c-0.7,0-1.3,0.3-2,0.3c-1.4,0-2.2-0.9-3.3-1.1c-0.9,0.2-1.7,0.4-2.7,0.1
	c-0.5-0.7-0.4-1.3-1.5-1.7c-2-0.4-3.4,2.5-4.4,0.6c-1.9-0.9-4.9-0.5-7.4-0.7c-1.7-0.1-3.4-0.4-5.1-0.4c-1.7,0-3.3,0.2-4.7-0.2
	c-1.3,0.4-2.5,0-3.8-0.1c-3.9-0.3-7.7,0.5-11.4-0.2c-2.2,0.4-5.1,0-7-0.3c-2.5,0.5-4.8-0.3-7-0.2c-1.5,0.1-2.8,0.3-4.1,0.3
	c-0.4,0-0.8-0.2-1.3-0.2c-1.3,0-2.6,0.3-4,0.2c-1.3-0.1-2.4-0.6-3.8-0.2c-3.6-0.5-8.7,0.4-13.1-0.1c-0.3,0-0.5-0.2-0.8-0.2
	c-3-0.2-5.7,0.5-8.3-0.2c-3.2,0.1-7.3,0.1-10.7-0.2c-3.1,0.4-6.2,0-9.2-0.2c-2.2-0.1-4.7,0.2-7.1,0.2c-0.9,0-1.7-0.3-2.5-0.2
	c-1.2,0-2.5,0.3-3.7,0.2c-2.2-0.1-4.4-0.2-6.6-0.2c-2-0.1-4.1,0.3-6.1,0.2c-0.7,0-1.5-0.3-2.2-0.3c-0.5,0-1,0.2-1.5,0.2
	c-2.5,0.2-5.7-0.1-8.6-0.1c-4.1,0-7.8-0.1-12.2,0.1c-3.2-0.3-6.7,0-10.3-0.1c-4.6,0-9.4-0.2-14.3-0.2c-5.2,0-10.5,0.2-15.4-0.3
	c-0.1-0.2-0.4-0.3-0.7-0.5c-0.5,0-0.5,0.4-1.1,0.3c-0.5,0-0.1-0.3-0.5-0.4c-0.8,0-1.5-0.1-2.3-0.1c-0.1,0.3-0.4,0.2-0.6,0.3
	c0.1-0.4,0.3-0.3,0.4-0.4c-0.4,0-0.9-0.1-1.3-0.1c0,0,0,0.1,0,0.1c0,0,0-0.1-0.1-0.1c-0.5,0-0.9-0.1-1.4-0.1c0,0,0,0,0,0
	c0,0,0,0,0,0c-0.1,0-0.2,0-0.2,0c0,0,0,0,0,0.1c0,0,0,0,0-0.1c-0.4,0-0.9-0.1-1.3-0.1c0,0.2,0.1,0.3,0,0.5c-0.1,0-0.1-0.3-0.2-0.2
	c0-0.1,0.1-0.2,0.1-0.3c0,0-0.1,0-0.1,0c0,0.2,0,0.4-0.2,0.6c0.1-0.8-0.3-0.5-0.4-0.3c-0.1,0,0-0.2,0-0.3c-0.1,0-0.1,0-0.2,0
	c-0.1,0.5,0.3,0.9,0.6,0.5c-0.2,0.6-0.4,0.1-0.6,0.3c0-0.1,0-0.6-0.1-0.9c-0.1,0-0.2,0-0.3,0c-0.1,0.1-0.1,0.3-0.1,0.6
	c0.2-0.1,0.1-0.4,0.2-0.4c0.3,0.5-0.3,0.6,0,0.7c-0.1,0.3-0.4,0.1-0.5,0.2c0-0.2,0.4-0.3,0.1-0.9c-0.2,0-0.3,0.1-0.3,0.4
	c0-0.3-0.5-0.2-0.4,0.3c-0.3,0-0.7-0.1-0.6,0.6c-0.1,0,0-0.4-0.1-0.3c0.3-0.4,0.1-0.9,0-1.3c0,0-0.1,0-0.1,0c-0.1,0.2,0,0.4-0.1,0.9
	c-0.2-0.2-0.4-0.2-0.6-0.5c-0.5,0.5-0.9,0-1.3,0.6c0,0.3,0.2,0.1,0.2,0.5c-0.1-0.1-0.2-0.2-0.2,0c-0.1,0-0.1-0.2-0.1-0.4
	c-0.3,0.1-0.3,0.5-0.6,0.6c0-0.2,0.1-0.2,0.1-0.4c-1,0.2-1.5,0-2.6,0c0.2,0.2,0.4,0.3,0.5,0.3c-0.3,1-1-0.3-1.3,0.4
	c0.1,0.2,0.2,0.2,0.1,0.6c-0.6-0.1-1-0.6-1.2,0.4c0.4,0.1,0.8-0.2,0.7,1c-0.1,0-0.2,0-0.2,0c0,0.6,0.2,0.8,0.3,0.9
	c0.2,0-0.2-0.3,0-0.4c0.2,1.1,1.1,1.4,1.4,0c0.2,0.5-0.2,0.7-0.4,0.9c0.1,0.5,0.4,0.5,0.5,0.9c0.1-0.4,0.3-0.2,0.3-0.5
	c0.1,0,0,0.6,0.1,0.7c0.1-0.1,0.1-0.4,0.3-0.4c0.1,0.7,0.4,0.1,0.6-0.1c0.4,0.6,1,0.1,1.2,0.7c0.2-0.1,0.2-0.5,0.5-0.6
	c0,0.3,0.2,0.2,0.2,0.6c0.5-0.1,0.6-0.2,1.2-0.3c0,0.3-0.2,0.3-0.3,0.3c0.2,0.2,0.4,0.6,0.6,0.8c0.1-0.1,0.1-0.2,0.1-0.4
	c0.1,0.1,0.2,0.2,0.3,0.6c-0.1,0.4-0.3-0.2-0.3,0.3c-0.3-0.2-0.9,0-0.9,0.9c-0.1,0.4-0.1-0.3,0-0.4c-0.2,0.3-0.3-0.3-0.6,0
	c-0.1,0.1,0,0.5-0.2,0.4c0,0.2,0.1,0.2,0.1,0.5c-0.3,0-0.8-0.1-0.9,0.5c-0.3-0.3-0.8,0.2-1.1-0.5c-0.2,0.9-0.8-0.2-1,0.6
	c-0.1-0.1-0.1-0.5-0.1-0.7c0,0.4-0.1,0.5-0.2,0c-0.5,0.3-1.4-0.4-1.7,0.4c-0.2-0.5-0.7-0.5-0.9-0.1c0,0.1,0.1,0.2,0.1,0.4
	c-0.7,0.6-1.3-0.1-1.6,1.2c0.2,0.4,0.2-0.5,0.5-0.3c-0.5,1.4-1.8,0.2-2.4,1.2c-0.4-0.9-0.8,0.9-1-0.1c-0.1,0-0.2,0.1-0.2,0.3
	c-0.1-0.1-0.2-0.3-0.3-0.4c-0.1,0.1-0.1,0.2,0,0.3c-0.2,0.2-0.3,0.1-0.4-0.2c-0.7,0.2-1.2,0.6-1.9,0.3c-0.4,0.7-1.3,0.2-1.8,0.1
	C62,84,60.8,83.2,59.9,84c0-0.3-0.1-0.2-0.1-0.6c-0.2,0-0.2,0.3-0.2,0.6c-0.2-0.1-0.1-0.3-0.2-0.6c-0.1,0.5-0.1,0.3-0.3,0.2
	c-0.1,0.5,0.3,0.1,0.3,0.6c-0.2-0.2-0.7-0.3-0.7-0.8c-0.2-0.1-0.2,0.2-0.2,0.5c-0.7,0-0.9-0.8-1.6-0.1c0.1-0.2,0-0.2,0-0.4
	c-0.2,0-0.3,0.1-0.3,0.4c-0.2,0.1-0.2-0.3-0.3-0.3c-0.3,0-0.2,0.7-0.6,0.7c0.2-0.7-0.4-0.2-0.6-0.5c-0.2,0.1-0.2,0.5-0.4,0.5
	c0-0.3,0.2-0.2,0.2-0.4c-0.6-0.1-0.8,0.2-1.4,0.1c-0.3-0.1-0.7,0.2-0.8,0.1c-0.2-0.1-0.3-0.5-0.4-0.5c-0.3-0.1-0.8,0.5-0.9-0.1
	c-0.6,0.4-1.1,0.2-1.9,0.3c0,0.5-0.7,0.1-0.8,0c-0.2,0.1-0.1,0.2,0,0.5c-0.2-0.1-0.3-0.4-0.5-0.3c-0.2,0.1-0.1,0.3,0,0.6
	c-0.1,0.1-0.1-0.2-0.1-0.3c-0.6-0.3-1.2,0.9-1.7,0.1c-0.2,0.4-0.8-0.3-1,0.6c-0.1-0.1-0.3-0.1-0.3-0.5c-0.2,0-0.1,0.4-0.2,0.5
	c0-0.8-0.7,0-0.9,0c-0.2,0-0.5-0.6-0.7,0.1c-0.3-0.8-0.7-0.1-1.2,0.1c-0.1,0,0,0.2,0,0.4c-0.7-0.3-1.1,0.2-1.6,0.5
	c-0.2,0-0.3-0.2-0.4-0.6c-0.3-0.1-0.3,0.4-0.5,0.4c0-0.6-0.5,0.1-0.5-0.4c-0.2,0.5-0.6,0.3-0.8,0.2c0.2,0-0.3-0.3-0.4-0.3
	c-0.2,0-0.3,0.3-0.5,0.3c-0.2,0-0.4-0.4-0.6-0.4c-0.3-0.1-0.9-0.2-1.4,0.1c-0.1-0.3-0.1-0.2-0.1-0.6c-0.4,1-0.7,0-1.2,0.2
	c0,0.3,0.3,0.3,0.3,0.7c-0.2-0.9-1.1-0.1-1.5-0.3c0,0.6,0.5,0,0.5,0.8c0.2-0.7,0.6-0.1,0.9-0.4c-0.9,0.9-2.2,1-2.9,1.3
	c0.3,1,1.4-0.5,1.7,0.7c0.4-0.4,0.4-0.3,0.7-0.6c-0.1,0.3,0,0.6,0.1,0.7c0.3-1,1.2,0.1,1.3-0.9c0.2,0.6,0.4,0,0.6,0.2
	c0,0.2-0.2,0.1-0.2,0.3c0.1,0.7,0.8,0.1,0.8-0.2c0.3,0.6,0.7,0,1.1-0.3c0.3,0.4,1.3,0.7,1.6-0.1c0.1,0,0.1,0.2,0.1,0.5
	c0.6-0.2,1-0.4,1.7,0c-0.5,0.4-1-0.1-1.3,0.7c0,0.1,0.1,0.1,0.1,0.3c0.2-0.1,0.2-0.1,0.4,0.1c0.2-0.3,0.6-0.6,0.8-0.2
	c0.2-0.6,0.5-0.4,0.7-1c-0.2,0.5,0.1,0.4,0.3,0.4c-0.9,0.9-2,0.7-2.7,1.3c-0.1-0.1-0.4-0.7-0.5-0.1c-0.2-0.1-0.2-0.5-0.4-0.6
	c0.1,0.2-0.1,0.2-0.2,0.5c-0.1,0-0.1-0.4-0.2-0.3c-0.2-0.1-0.1,0.6-0.3,0.5c0-0.2-0.1-0.2-0.1-0.2c-0.5,0.9-1.6,0.1-2,0.5
	c-0.5-0.6-1,0.4-1.7,0c-0.3,0.3-0.7,0.6-0.8,0.1c-0.1,0.1-0.2,0.3-0.3,0.4c0,0.1,0.1,0.1,0.1,0.3c-0.1-0.5-0.3-0.1-0.4-0.1
	c-0.7,0-1.7,0-2.5,0c0-0.5,0.1-0.3,0.2-0.3c0-0.1,0-0.2,0.1-0.3c0-0.2-0.1-0.1-0.1,0c-0.2-0.1,0.1-0.3-0.1-0.5
	c-0.3,1.2-1,0.2-1.5,0.2c0,0.1,0.1,0.1,0.1,0.1c-0.6,0.7-1.4,0.9-1.8,0.4c-0.2,0,0,0.6-0.2,0.5c0.2-0.4-0.2-0.2-0.2-0.7
	c-0.2,0.3-0.4,0.2-0.5-0.3c0.1,0,0.1,0.1,0.1,0.2c0.2-0.3-0.1-0.5-0.2-0.6c-0.1,0.5-0.3,0.5-0.6,0.6c0-0.3,0.1-0.3,0.2-0.2
	c0-0.4,0.1-0.5,0-1c-0.1,0.5-0.2-0.2-0.4,0.2c0-0.1,0-0.2-0.1-0.2c0.1-0.5,0.1-1,0.3-1.1c0-0.1-0.1-0.3-0.1-0.5
	c-0.1,0-0.1,0.2-0.2,0.2c0-0.3-0.1-0.4-0.2-0.3c0.2-0.3,0.1-0.7,0-1c0.1,0.1,0.2,0.1,0.2,0c-0.1-0.3,0-0.8,0.1-1
	c-0.1-0.4-0.1,0.2-0.3,0c0-0.3,0-0.6,0-0.9c0.2,0.2,0.2-0.3,0.5-0.1c0.1-0.3,0.1-0.5,0.2-0.8c0.1,0.2,0.1,0,0.3,0
	c0,0.4,0.4,0.3,0.5,0.2c-0.1-0.2-0.1-0.4-0.2-0.3c0.2-0.6,0-0.8-0.3-0.9c-0.1,0.1-0.1,0.3-0.2,0.5c-0.1-0.9-0.6-0.3-0.8-0.9
	c-0.1,0.3-0.4,1.1-0.1,1.1c0,0.4-0.4,0.2-0.5,0.1c-0.1-0.4,0.2-0.2,0.2-0.4c0-0.3-0.3-0.4-0.1-0.6c-0.1-0.1-0.2-0.3-0.3-0.3
	c0-0.1,0.1-0.2,0-0.2c0.1-0.2,0.4-0.5,0.3-0.7c0.3-0.3,0.5,0,0.8-0.2c0-0.4-0.2-0.1-0.4-0.1c0-0.5-0.2-0.3-0.1-0.8
	c0-0.1,0.5,0,0.3-0.4c0.2,0.1,0.3,0.2,0.7,0.1c0.1-1,0.6-0.7,0.8-1.2C26,77.6,26,78.2,25.7,78c0-0.4,0.2,0,0.2-0.5
	c0.1,0.3,0.1,0.2,0-0.4c0.1,0.1,0.2,0.2,0.1,0.5c0.2-0.1,0.3-0.1,0.4-0.7c0.3,0.3,0.5-0.4,0.7-0.5c-0.2-0.4-0.7-1.1-0.9-0.7
	c-0.2-0.2,0.1-0.5,0.1-0.9c-0.1-0.3-0.2-0.8-0.4-0.9c-0.1,0,0,0.1,0,0.1c0,0.4-0.2-0.1-0.3,0c-0.1,0,0,0.3,0.1,0.4
	c-0.1,0.2-0.4,0-0.5-0.3c-0.3,0.5-1.3,0.6-1.4,1.2c-0.1,0.3-0.2-0.3-0.3-0.4c0,0-0.1,0.1-0.1,0.1c-0.1,0.3,0.3,0.2,0.1,0.4
	c0,0.1-0.1,0.1-0.2,0.1c0-1-1.1-0.1-1.4,0.2c-0.2-0.3-0.6-0.6-0.7,0c-0.2,0.1,0-0.1-0.1-0.4c-0.2,0.3-0.1,0.2-0.4,0.3
	c0.3,0.3,0.2,0.7,0.4,1.2c0.1-0.3,0.2,0,0.4-0.1c-0.2,0.4-0.6,0.5-1,0.5c0-0.3-0.2-0.6-0.1-0.8c-0.2,0-0.2,0.6,0,0.6
	c0,0.4-0.5-0.3-0.2-0.2c-0.1-0.3-0.2,0.2-0.4,0.1c-0.1-0.7-0.3-1.2-0.7-1.4c0.1-0.5,0.9,0.2,1,0.1c-0.2-0.3-0.3-0.7-0.6-0.6
	c0-0.4,0.3-0.5,0.5-0.4C20,74,19.7,74.3,19.5,74c0.1-0.3,0.6-0.3,0.5,0.2c0.3-0.1,0.1-0.9,0.5-0.6c-0.2-0.2-0.3-0.6-0.5-0.7
	c0-0.1,0.1-0.2,0-0.2c0-0.3,0.3-0.1,0.2-0.4c-0.1-0.4-0.2-0.6-0.3-0.9c-0.5,0.2-0.9,0-1.5,0.1c0.1-0.3-0.1-0.4-0.2-0.6
	c0.2,0.4,0,0.2,0,0.9c-0.1-0.5-0.3-0.4-0.4-0.4c-0.1-0.3,0.2-0.5,0-0.6c0-0.2,0.2-0.1,0.2-0.3c0.1-0.5-0.3,0-0.2-0.3
	c0-0.4,0.2-0.2,0.3-0.2c0.2-0.1-0.1-1.2,0.3-1.1c0,0.2,0,0.3,0,0.5c0.3-0.1,0-0.7,0.2-0.9c-0.1-0.4-0.1,0.3-0.2,0.2
	c0-0.6,0.4-0.3,0.4-0.8c-0.1-0.2-0.2-0.4-0.4-0.4c0-0.5-0.2-2.2-0.7-1.4c0.1,0.1,0.2,0.3,0.3,0.3c-0.1,0.3-0.4,0-0.6,0
	c0.2-0.2,0-0.7,0-1.1c-0.1,0-0.3,0-0.4,0c0.1,0,0.3,0,0.4,0c0-0.1,0-0.2,0-0.3c0.1,0.1,0.2,0.2,0.3,0.3c0.1,0,0.1,0,0.2,0
	c0.1-0.1,0.2-0.2,0.2-0.4c-0.2-0.2-0.5-0.1-0.7,0c0.2-0.7,0.4-0.1,0.8-0.2c0-0.1,0-0.2-0.1-0.2c-0.1-0.3,0.3,0.5,0.4,0.5
	c0.2-0.3,0.1-0.9,0.3-0.9c-0.1-0.2-0.2-0.5-0.5-0.4c0.1-0.4,0.3,0.1,0.4-0.1c0.1-0.2,0.1-0.6,0.2-0.8c0-0.1-0.1-0.1-0.1-0.2
	c-0.2,0.2-1,0.9-0.8,0.7c0-0.2-0.1-0.2-0.1-0.4c-0.2,0.1-0.2,0.4-0.5,0.3c-0.1-0.4,0.1-0.4,0-0.7c-0.1-0.1-0.1,0.3-0.1,0.3
	c-0.1,0.1-0.6-0.2-0.7,0.1c0.1,0.2,0.1,0.5,0.3,0.5c0.2-0.1-0.1-0.2,0-0.5c0.3-0.1,0.1,0.4,0.1,0.7c-0.1,0-0.2,0-0.2,0.1
	c-0.1,0-0.1-0.4-0.2-0.3c-0.1,0.2-0.1,0.4-0.1,0.9c-0.1,0-0.1-0.3-0.1-0.5c-0.1,0-0.2,0-0.3,0c-0.2,0.1-0.1,1-0.4,0.5
	c0-0.2,0.2-0.1,0.2-0.3c-0.2-0.1-0.2-0.4-0.4-0.4c0.2-0.2,0.1-0.2,0.4-0.4c0,0.3,0.1,0.2,0,0.5c0,0,0.1,0,0.1,0c0,0,0.1,0,0.1-0.1
	c0,0-0.1,0-0.1-0.1c0.1,0,0.1-0.1,0.2-0.3c-0.1,0-0.2-0.2-0.3,0c0-0.6-0.1-0.7-0.4-0.6c0.1,0.5-0.1,0.4-0.1,0
	c-0.3,0.1-0.3,0.5-0.6,0.5c0-0.3,0.1-0.2,0.2-0.3c0-0.2-0.1-0.2-0.1-0.3c-0.4,0.5-0.9,0.3-1.2,0.9c-0.1-0.2-0.1-0.5-0.4-0.3
	c0-0.3,0.2-0.6,0.3-0.4c0-0.3,0-0.4-0.2-0.3c-0.2-0.1,0.2-0.2,0.2-0.2c-0.2-0.9-1.1,0.1-0.7,1c-0.1,0-0.1,0-0.2,0
	c0,0.1,0.1,0.2,0.2,0.2c-0.1,0.7-0.4,0.4-0.6,0.6c0.2-0.4-0.2-0.5-0.3-0.6c-0.2,0-0.1,0.5-0.2,0.6c-0.2-0.2-0.3-0.2-0.4,0.1
	c-0.1-0.6-0.1-0.9-0.3-0.8c0-0.3,0-0.8,0.3-0.8c-0.5,0-1-0.6-1.1-1.8c-0.2-0.3-0.3-0.2-0.5,0.1c0.1-0.9,0.7-0.2,0.5-1.5
	c-0.2,0,0,0.5-0.2,0.4c0.1-0.9-0.3,0.3,0.1,0.2c-0.1,0.7-0.5-0.5-0.3-0.8c-0.1-0.4-0.2-0.1-0.3-0.1c0-0.3,0.3-0.5,0.4-0.3
	c-0.1-0.1,0-0.3-0.1-0.3c0.2-0.4,0.3,0.2,0.6,0.2c-0.1-0.1-0.1-0.2-0.2-0.3c0.1-0.4,0.4,0.1,0.3,0.3c0.1-0.1,0.2-0.2,0.3-0.3
	c0-0.2-0.1-0.2-0.1-0.5c0.2,0.2,0.1,0.3,0.3,0.3c0,0.5,0,0.7,0.3,0.7c0,0.3-0.1,0.2-0.1,0.4c0,0.2,0.2,0.1,0.2,0.1
	c0.2,0-0.1-0.7,0.2-0.5c-0.1,0.3,0,0.4,0,0.7c-0.2,0-0.3-0.1-0.4,0.2c0.1,0.4,0.3-0.3,0.4,0.2c0.2,0,0.4-0.6,0.2-0.6
	c0.4,0,0.8-0.3,1.4-0.2c0.1-0.1,0-0.2,0-0.5c0.2,0,0.4,0.2,0.5-0.1c-0.2-0.3,0.1-1-0.2-0.7c-0.1-0.3,0.2-0.1,0.3-0.3
	c0-0.4-0.3-0.1-0.4-0.1c0-0.2,0-0.4-0.1-0.3c0.2-0.1,0.3-0.2,0.4-0.7c0-0.1-0.1-0.1-0.1-0.2c-0.2,0.2-0.3,0.4-0.5,0.6
	c-0.1-0.6-0.8-1.1-0.8-0.1c-0.2-0.2-0.3-0.6-0.4-0.9c-0.2,0.6-0.5,0.1-0.7,0.4c0.2-0.6-0.2-1.5,0.3-1.8c-0.1-0.4,0-0.7,0-1.3
	c0.3-0.1,0.5,0,0.6,0.3c0.1,0,0-0.2,0-0.4c0.3,0.1,0.6,0.1,0.7,0.6c0.1-0.3,0.2-0.6,0.5-0.6c0.1-0.3-0.2-0.5,0-0.6
	c-0.1-0.2-0.2-0.3-0.5-0.4c0.3-0.3,0-0.5,0-1.2c-0.3,0.5-0.4,0.2-0.8,0.2c0.2-0.5,0.6,0.1,0.7-0.6c0.1,0.2,0.3,0,0.5,0
	c0.6-1.5-0.7-1.5-1-2.4c0,0.1-0.1,0.2-0.2,0.2c0-0.1,0-0.2-0.1-0.2c-0.1-0.4,0.2-0.1,0.1-0.5c-0.2,0-0.1-0.2-0.2-0.6
	c-0.5,0.3-0.9,0.4-1.1-0.5c0,0.1-0.1,0.2-0.2,0.2c0-0.5-0.3-0.4-0.3-0.8c0-1.3,0.4-1.7,0.6-2.8c-0.6-0.4-0.7,0.4-1.3,0.4
	c0.1,0.5,0.2,0.7,0.3,0.9c-0.1,0.1-0.2-0.3-0.2,0c-0.2-0.5-0.4-0.8-0.8-0.6c-0.1-0.3,0-0.4-0.1-0.7c-0.8,0.2-1.6-0.2-2.2-1.1
	C5.4,41.6,4.9,38.3,5.7,36.8z M18.7,70.8c0-0.3,0-0.5-0.1-0.5c0,0.2-0.2,0.1-0.2,0.4C18.4,70.8,18.5,70.9,18.7,70.8z M25.3,79.7
	c0,0.3-0.3,0-0.3,0.4c0.1,0.1,0.1,0.5,0.3,0.4C25.2,80.3,25.4,79.7,25.3,79.7z M38.7,87.8c0.1,0.3,0,0.4,0.1,0.5
	c0.1-0.4,0.1,0.2,0.1,0.1c0.2,0.1,0.8-0.2,0.4-0.8C39.2,88.1,39,87.8,38.7,87.8z M36.9,88.4c0.3,0.2,0.8-0.3,1.1-0.4
	C37.8,87.5,37.1,87.8,36.9,88.4z M36.1,88.9c0.1,0.2,0.3,0.1,0.3-0.2C36.3,88.6,36.2,88.7,36.1,88.9z M295.1,33.1
	c0.1,0.2,0.7-0.1,0.6-0.2C295.5,32.6,295.1,33.1,295.1,33.1z M318.6,29.2c0,0.2,0.8,0.4,1.1,0c-0.3-0.4-0.6,0.2-0.8-0.2
	C318.7,29.1,318.8,29.3,318.6,29.2z M305.4,27.3c0.1,0,0.3,0.3,0.8,0C306,27.1,305.7,27.3,305.4,27.3z M294,29
	c-0.1,0.3,0.7,0.2,0.9,0C294.7,28.8,294.3,29,294,29z M292.6,24.9c0.3,0.1,0.6,0.3,0.9,0C293.3,24.7,292.7,24.7,292.6,24.9z
	 M281.9,20.3c0.3,0.2,0.7,0.3,1,0C282.7,20.1,282,20.1,281.9,20.3z M272.5,19.6c0.2,0.3,0.4-0.1,0.7-0.2
	C273,19.2,272.4,19.4,272.5,19.6z M268.1,21.5c0.2,0.1,0.5,0.1,0.8-0.1C268.6,21.2,268.4,21.4,268.1,21.5z M264.1,21.1
	c0.2,0.3,0.7,0.2,0.7,0C264.5,20.8,264.3,21,264.1,21.1z M260,21.2c0.1,0.1,0.3,0.1,0.5,0.2c0.2-0.2,0-0.4,0.5-0.5
	c0.4,0.2-0.2,0.3-0.1,0.4c0.7,0.1,1.2-0.2,1.6-0.4c-0.7-0.2-0.8-0.2-1.5-0.7C260.7,20.7,260.3,20.8,260,21.2z M257.7,21.1
	c0.3,0.4,0.7,0.1,1,0.2c0.1-0.1-0.1-0.2,0-0.2c0.2-0.1,0.3,0.1,0.5,0.2c0.3-0.4,0.3-0.2,0.6-0.5c-0.5-0.2-1-0.3-1.6-0.1
	C258.6,21.1,258,20.8,257.7,21.1z M254.5,20.8c0.2,0.2,0.5,0.2,0.8,0C255,20.8,254.8,20.6,254.5,20.8z M249.7,20.3
	c0.1,0.3,0.8,0.2,1.2,0.1C250.6,20.2,250.2,20.2,249.7,20.3z M241.6,20.2c0,0.2,0.2,0.1,0.5,0.2C242.3,20.3,241.8,20,241.6,20.2z
	 M210.6,19.9c0.2,0,0.6-0.2,0.6-0.3c-0.1,0-0.2,0-0.4-0.1C210.5,19.6,210.3,19.8,210.6,19.9z M204.5,19.8c-0.1,0.3,0.7,0.1,0.9,0
	C205.1,19.5,204.8,19.9,204.5,19.8z M179.3,20c-0.1,0.3,0.6,0.2,0.8,0.1c0-0.1-0.1-0.2-0.3-0.3C179.9,20,179.6,20.2,179.3,20z
	 M177,20c0.2,0.5,1.2,0.3,1.7,0.2c0-0.3-0.5-0.3-0.9,0c0-0.2,0.1-0.4-0.2-0.7C177.3,19.7,177.6,20.2,177,20z M176.5,20.2
	c-0.2-0.1-0.5,0-0.8,0C175.4,20.5,176.5,20.6,176.5,20.2z M34.9,8.8c-0.1-0.2-0.3,0.1-0.2-0.3c-0.1,0-0.2,0-0.2,0
	c0,0.3,0.1,0.3,0.1,0.7C34.8,9.3,34.7,8.8,34.9,8.8z M35.5,8.3c-0.1,0.1-0.3,0.1-0.3,0.5C35.3,8.7,35.5,8.6,35.5,8.3z M39.9,8.6
	c-0.2,0.2-0.4-0.2-0.3,0.5C39.7,9,39.9,9,39.9,8.6z M29.1,19.8c-0.1-0.2-0.3-0.3-0.3,0.2C28.9,19.9,29.1,20.1,29.1,19.8z M29.3,18.8
	c0-0.3-0.1-0.3-0.1-0.7c-0.1,0-0.2-0.2-0.4-0.1c0.1,0.5-0.1,0.4-0.3,0.4C28.7,19.4,29.1,18.7,29.3,18.8z M20.9,16.5
	c-0.2,0.1-0.4-0.3-0.4,0.3C20.7,16.7,20.9,17.1,20.9,16.5z M21.4,20.1c0-0.3,0.1-0.6,0-1c-0.2,0.1-0.5,0.2-0.5,0.6
	C21.1,19.7,21.1,20,21.4,20.1z M12.5,60.6c-0.2-0.3-0.3-0.1-0.5,0.2C12.2,60.7,12.3,61.1,12.5,60.6z M14.1,60.1
	c-0.2,0.5-0.6,0.3-0.8,0c0.1-0.2,0.3-0.1,0.3-0.4c-0.1,0.5,0.2,0.3,0.3,0.3c0-0.4-0.2-0.2-0.3-0.3c-0.3-0.7-0.7-0.4-1.1-0.3
	c0,0.9,0.4,0.3,0.7,0.5c-0.2,0.4,0,0.3,0.1,0.7c-0.1-0.1-0.5-0.5-0.5,0.1c0.1,0.1,0.4,0.5,0.5,0.2c-0.1,0,0-0.4,0-0.4
	C13.5,60.9,14.2,60.8,14.1,60.1z M14.4,61.9c-0.1-0.1-0.2-0.1-0.3-0.1C14.1,62.2,14.4,62.3,14.4,61.9z M35.9,19.5
	c0.1,0,0.2-0.1,0.3-0.3C36,19.3,36,19,35.8,19.1C35.8,19.2,35.8,19.3,35.9,19.5z M268.5,32.6c0.2,0,0.5,0,0.7,0
	c-0.5-0.3-0.4,0-0.8-0.1C268.4,32.5,268.4,32.6,268.5,32.6z M20.9,65.1c0,0-0.1,0-0.1,0c0.3,0,0.6,0,0.9,0c0,0,0,0,0,0
	c-0.1-0.4,0.2-0.3,0.1-0.6c-0.1,0-0.1-0.1-0.2-0.1c0,0.2,0.1,0.3,0,0.4c-0.1-0.1-0.1-0.3-0.1-0.6c0.1,0,0.1-0.2,0.2-0.2
	c0.2,0.1,0.3,0.5,0.4,0.7c0-0.5-0.3-0.2-0.1-0.7c-0.2,0-0.3-0.3-0.5-0.1c0-0.2,0-0.5,0-0.7c-0.3-0.3-0.6,0.3-1.2-0.1
	c0.1,0,0.1-0.2,0.1-0.3c-0.2,0.1-0.2,0.4-0.2,0.8c0.1,0.3,0.3-0.1,0.2,0.3c0.3,0.1,0.5-0.7,0.7-0.3c-0.3,0.5-0.5,0.4-0.7,1
	c-0.2,0-0.1-0.5,0-0.6c-0.2,0.1-0.5,0-0.5,0.4c0.2,0,0.2-0.2,0.4,0c0.1,0.4-0.1,0.4-0.1,0.7C20.4,64.8,20.8,64.7,20.9,65.1z
	 M21.6,62.5c0.1,0.1,0.3,0,0.3-0.3C21.8,62.2,21.6,62,21.6,62.5z M21.9,65.1c0,0,0.1,0,0.1,0C22,65.1,21.9,65.1,21.9,65.1z
	 M275.8,32.4c0,0,0-0.1,0-0.1c-0.1,0-0.2,0.1-0.3,0.1C275.6,32.4,275.7,32.4,275.8,32.4z M268.3,32.6c-0.1,0-0.2-0.1-0.3,0
	c0,0,0,0,0,0C268,32.6,268.1,32.6,268.3,32.6z M35.8,19c-0.1,0.5-0.4,0.1-0.4,0.7c0.1,0,0.2,0,0.3,0C35.7,19.4,35.7,19.1,35.8,19z
	 M19.3,62.5c-0.1-0.1-0.2,0.6-0.1,0.6c0-0.1,0-0.1,0.1-0.1C19.3,62.8,19.3,62.7,19.3,62.5z M16.7,62.5c-0.2,0.1-0.2-0.1-0.3-0.1
	C16.3,62.9,16.7,62.9,16.7,62.5z M16.7,63C16.3,63.1,16.7,64,16.7,63L16.7,63z M20.3,65.3c0,0.1-0.1,0.1-0.1,0.2
	c0.1,0.2,0.3,0,0.2,0.5c0.2,0.1,0.4,0,0.5,0.4c-0.4-0.1-0.6-0.5-1-0.6c0,0.3,0.1,0.9,0.2,1.1c0.2,0-0.2-0.4,0-0.5
	c0.2,0.4,0.5,0.5,0.8,0.4c-0.1,0,0-0.3,0.1-0.4c0.1,0.1,0.3,0.1,0.5,0.1c0-0.2,0-0.3,0-0.5c-0.1,0-0.3,0.2-0.2-0.2
	c0.1,0,0.2,0.2,0.4,0.1c-0.1-0.5,0.2-0.3,0.3-0.5C21.4,65.3,20.9,65.3,20.3,65.3z M19.7,66.3c0,0.2,0,0.3,0,0.5c0.1,0,0.2,0,0.2,0
	C19.9,66.3,19.9,66.2,19.7,66.3z M19.2,70.2c-0.1,0-0.2-0.2-0.3-0.2C18.9,70.4,19.1,70.7,19.2,70.2z M20.4,71.8
	c0.1-0.4-0.3-0.5-0.3-0.2C20.2,71.6,20.2,71.9,20.4,71.8z M20.3,76.2c-0.1-0.2-0.2-0.4-0.4-0.4C19.8,76,20.2,76.8,20.3,76.2z
	 M20.6,75.1c0-0.2-0.2-0.6-0.2-0.3c0.2,0.2-0.4-0.2-0.4,0.3c0.1,0,0.2,0.2,0.3,0.2c0-0.1,0-0.3,0-0.4C20.3,75.2,20.5,75.2,20.6,75.1
	z M20.6,75.4c-0.1-0.2-0.3-0.1-0.3,0.2c0.1,0,0.1,0.1,0.2,0.2c-0.1,0-0.1,0.1-0.1,0.3C20.6,76.1,20.6,75.6,20.6,75.4z M20.7,76.7
	c-0.1,0.4,0.3,0.5,0.4,0.2C20.9,76.8,20.9,76.6,20.7,76.7z M21.1,68c-0.1-0.7-0.8,0-1-0.2c0.2-0.3,0.4-0.5,0.7-0.7
	c-0.4-0.3-0.7,0-0.9,0.4c0-0.2,0.2-0.3,0.2-0.5c-0.3,0.2-0.2,0.1-0.4-0.1c0,0.2-0.1,0.4-0.2,0.8c0.3-0.1,0.5-0.1,0.6,0.4
	c-0.1,0-0.3-0.1-0.2,0.3c0.1-0.1,0.4,0,0.6-0.2c0.1,0.2-0.1,0.4,0.1,0.3C20.7,67.8,20.9,68.3,21.1,68z M21.8,67.3
	c0-0.7-0.5,0.5-0.4-0.5c-0.2,0.1-0.3,0.3-0.5,0.4c0.1,0.1,0.1,0.5,0.3,0.4c0.1-0.5,0.2,0,0.4,0.1C21.4,67.1,21.5,67.2,21.8,67.3z
	 M26.9,74.4c-0.2,0.1,0-0.2,0-0.4c-0.2-0.1-0.2-0.5-0.4-0.6c0,0.1,0,0.2,0,0.2c0,0-0.1,0-0.1,0.1C26.5,73.7,26.4,75.3,26.9,74.4z
	 M27.2,76c-0.1-0.3,0.2-0.4,0-0.5c0,0.3-0.1-0.3-0.3-0.1C27,75.8,27.1,75.9,27.2,76z M26.2,86.7c0.4,0,0-0.7,0.3-1
	C26.1,85.7,26.2,86.2,26.2,86.7z M25.9,83.9c0,0.2,0,0.3,0,0.5c0.1,0,0.2-0.1,0.2-0.3C26,84.3,26.1,83.8,25.9,83.9z M25.2,88.4
	c0-0.3-0.1-0.4,0-0.6c-0.1,0-0.2,0-0.2,0.2c0.2-0.1,0,0.2,0.1,0.5C25.1,88.5,25.2,88.4,25.2,88.4z M25.6,87.7c0-0.2,0.2-0.8,0-0.9
	c0,0.4-0.3,0.5-0.4,0.8C25.3,87.6,25.4,87.8,25.6,87.7z M25.9,88.5c-0.1,0.1-0.2,0.3-0.3,0.4c0.2-0.1,0.1,0.2,0.2,0.2
	C25.7,88.6,25.9,88.8,25.9,88.5z M26,85.9c-0.2-0.3-0.3-1-0.6-1.3c-0.2,0.5-0.1,0.9-0.2,1.6c0.1,0.1,0.4,0.3,0.2,0.1
	c-0.1,0,0-0.2,0.1-0.3C25.7,86.3,25.7,86.1,26,85.9z M26.6,88.7c-0.2,0-0.6,0.3-0.6,0.9c0.1-0.2,0.4-0.6,0.5-0.4
	C26.3,88.9,26.6,89,26.6,88.7z M26.7,77.6c-0.2-0.2-0.1-0.2-0.4-0.1C26.3,78,26.8,77.9,26.7,77.6z M27.2,87.3
	c-0.2-0.1-0.6,0.3-0.4,0.5C26.8,87.5,27.2,87.8,27.2,87.3z M27.9,87.4c-0.2,0-0.3,0-0.3,0.3C27.7,87.8,27.8,87.8,27.9,87.4z
	 M27.9,88.4c0,0,0.1,0,0.1,0c-0.1,0.3,0,0.2,0,0.5C28.5,88.8,27.8,88,27.9,88.4z M28.4,85.5c-0.2-0.3-0.5,0.4-0.6-0.4
	c0.2-0.3,0.3,0.2,0.3-0.4c-0.3,0.2-0.3-0.2-0.5-0.2c-0.2,0.1-0.5,0.9-0.8,0.5c-0.1,0.6-0.2,0.9-0.2,1.5c0.2-0.2,0.1,0.4,0.2,0.2
	C27.2,85.7,27.9,86.4,28.4,85.5z M29,88.5c-0.2,0.1-0.2-0.4-0.3-0.1C28.6,88.9,29,88.9,29,88.5z M31.1,87.8c0-0.5-0.3-0.4-0.2,0
	C30.9,87.8,31,87.8,31.1,87.8z M31.2,87.9c0.1,0.1,0.5,0.4,0.4-0.2C31.5,87.7,31.2,87.5,31.2,87.9z M32,86.6
	c0.4-0.4,0.9,0.1,1.1-0.5C32.8,85.9,32.1,85.8,32,86.6z M80.1,71c-0.1,0-0.1,0-0.2,0c0,0,0,0,0,0.1c0.2,0,0.1,0.5,0.3,0.5
	C80.3,71.4,80.2,71.1,80.1,71z M81,71.1c-0.1,0-0.1,0-0.2,0c-0.1,0.1-0.1,0.1-0.3,0.1c0,0.4,0.4,0.2,0.5,0.3
	C81,71.2,81,71.1,81,71.1z M322.8,50.6c0.2,0.2,0.4,0.3,0.6,0.5c0.6,0,1-0.2,2,0c0.3-0.3,0.6-0.3,1.3-0.2c0.1-0.6,1.7-0.2,1.7-0.9
	c-0.8,0-1.4-0.2-1.9-0.4c-0.4,0.1,0.1,0.6-0.2,0.6c-0.8-0.3-2.4,0.1-3.6,0.1C322.7,50.4,322.8,50.5,322.8,50.6z M294.5,32.6
	c-0.2-0.1-0.4,0-0.6,0.1c0.1,0.1,0.2,0.2,0.4,0.3C294.7,32.8,294.1,32.7,294.5,32.6z M293.8,32.1c0.2,0,0.4,0,0.6-0.1
	c-0.3-0.2,0.4-0.2,0.2-0.5C294,31.3,294.2,31.9,293.8,32.1z M289.6,31.9c0.3,0.2,1,0.2,1-0.2c0.3,0.6,1.1,0,1.7,0.3
	c0-0.3,0.6-0.2,0.9-0.4c0.2,0.2,0.5,0.4,0.7,0.1c-0.3-0.2-0.6-0.2-0.9-0.2c-0.2-0.1,0.3-0.2,0.4-0.1c-0.1-0.3-1.1-0.1-1.6,0
	c-0.2-0.4-0.2,0.1-0.5-0.4C290.3,31.4,290.5,31.8,289.6,31.9z M289.9,24.8c0.4,0.3,0.7,0.1,1.1,0.3C291,24.7,290.2,24.6,289.9,24.8z
	 M286.5,30.8c-0.3,0.2-0.1,0.4-0.9,0.4c0.4,0.3,0.9,0.1,1.4-0.3c0.3,0,0.6,0.2,0.9,0.3c-0.1,0-0.3,0-0.2,0.1
	c-0.5-0.1-1.3-0.1-1.5,0.3c0.4,0.3,0.8-0.1,1.1-0.1c0.1,0.1,0.3,0.2,0.4,0.3c0.6-0.2,1.7,0.1,1.8-0.6c0.2,0.1,0.1,0.2,0,0.2
	c0.5,0.2,0.5-0.3,0.2-0.5c-0.5,0.3-0.2,0-0.5-0.2c-0.7,0.3-1.3-0.2-2,0.1c0-0.2-0.1-0.2-0.4-0.3C286.9,31,286.5,31.2,286.5,30.8z
	 M285.8,32.4c0,0.3,0.7,0.2,1,0.2C286.9,32.4,286.1,32.5,285.8,32.4z M285.2,24.1c0.3,0.1,0.7,0.3,1,0.1
	C285.9,24.1,285.6,23.9,285.2,24.1z M284.1,31.4c0.5,0,0.9,0.2,1.4,0c-0.1-0.1-0.2-0.1-0.3-0.2c-0.3,0.2-0.5,0.2-0.8,0
	C284.4,31.3,284.3,31.4,284.1,31.4z M282.5,24.3c0.3,0.1,0.8,0.1,0.9-0.2C283.1,24.1,282.5,24,282.5,24.3z M282.6,31.1
	c0.3,0.1,0.6,0.3,0.9,0.2C283.2,31,282.9,30.9,282.6,31.1z M280.4,31.3c0.7-0.2,0.9,0.1,1.5-0.2c0.1,0.1,0.3,0.2,0.4,0.3
	c0.2-0.1,0.3-0.1,0.5,0c0-0.3-0.8-0.1-0.9-0.4c0.3-0.3,0.6-0.1,0.9-0.3c-0.3-0.2-0.5-0.2-0.8-0.3c-0.4,0.2-0.4,0.4-0.2,0.6
	c-0.4,0.1-0.8,0.2-1.1,0C280.3,31.1,280.6,31.2,280.4,31.3z M280.2,32.6c0.2,0.2,0.4,0.3,0.7,0.4c0.5,0,0.4-0.4,1-0.3
	c0.5-0.1,0.2,0.3,0.5,0.4c3.7,0.1,7.4,0.2,10.9,0.4c-0.5-0.4-0.6-0.4-1.2-0.5c0.5,0,0.4-0.4,0.8-0.2c-0.1,0.1-0.2,0.2,0,0.2
	c0.2-0.1,0.6-0.2,0.7-0.4c-0.4,0.1-1.6-0.3-1.8,0.5c-0.3-0.1-0.7,0-1-0.1c0.3-0.3,0.9-0.2,0.6-0.5c-0.3-0.2-0.7,0.3-1,0.2
	c0.2,0.6-1.3,0.1-1.5,0.5c-0.1-0.2,0.1-0.2,0.1-0.3c-0.3-0.1-0.7-0.2-0.8,0.1c-0.3-0.3-0.5,0-0.6-0.3c-0.4,0.1-0.8,0.2-0.8,0.5
	c-0.5,0.1,0-0.4-0.4-0.3c0,0.2-0.2,0.4-0.8,0.2c-0.1-0.1,0.2-0.2,0.1-0.3c-0.4,0-0.2,0.1-0.3,0.3c-0.1-0.1-0.3-0.1-0.5-0.2
	c-0.1-0.3,0.6,0,0.5-0.3c-0.5-0.2-1.1,0.1-1,0.5c-0.3-0.3-0.9-0.6-0.9-0.2c-0.4,0-0.1-0.2-0.3-0.3C282,32.6,281.4,32.3,280.2,32.6z
	 M280.2,31c-0.5-0.2-0.5,0.2-0.9,0C279.2,31.3,280,31.2,280.2,31z M277.7,32.4c0.8,0,1.6,0,2.4,0.1c-0.1-0.1,0-0.2-0.1-0.4
	c-0.7,0.1-1.1,0.5-1.3,0.1C278.2,32.5,277.9,32.3,277.7,32.4z M277.5,32.2c-0.1,0.1-0.3,0.1-0.5,0.2c0.2,0,0.4,0,0.7,0
	C277.7,32.4,277.6,32.3,277.5,32.2z M276.7,23.8c0.3,0.2,0.6,0,0.8,0.1C277.9,24,276.9,23.4,276.7,23.8z M276,30.8
	c0.4,0.1,0.9,0.2,1.3,0.2C277.5,30.5,276.4,30.5,276,30.8z M275,30.9c0.3,0,0.6,0,0.9-0.2C275.5,30.5,275.2,30.6,275,30.9z
	 M273.9,32.2c0,0.1,0.1,0.2,0.2,0.2c0.1,0,0.2,0,0.3,0c0.2,0,0.3-0.1,0.5-0.2C274.5,32,274.2,32.4,273.9,32.2z M274.3,30.7
	c0.1-0.1,0.2-0.1,0.3-0.2c-0.2-0.2-0.4,0-0.6-0.1C273.8,30.6,274.1,30.6,274.3,30.7z M273.2,31c0.2,0.1,0.3,0.1,0.5,0
	c0.1,0,0,0.1,0,0.1c0.2,0.1,0.3-0.1,0.5-0.2C273.9,30.7,273.6,30.8,273.2,31z M272,23.3c0.5,0.2,1.3,0.4,1.5,0
	C273,23.4,272.5,23.1,272,23.3z M271.8,32.5c0.1,0,0.3,0,0.4,0c0,0,0-0.1,0.1-0.1C272,32.3,271.9,32.4,271.8,32.5z M270.6,32.4
	c0.2-0.1,0.6,0,0.7,0.1c0.1,0,0.2,0,0.3,0c0,0-0.1,0-0.1-0.1c-0.3-0.2,0.7,0.1,0.4-0.2C271.4,32,270.5,31.9,270.6,32.4z M269.4,32.2
	c-0.4,0.1,0.2,0.2-0.2,0.4c0.5,0,1,0,1.5-0.1C270.2,32.5,269.6,32.4,269.4,32.2z M267.7,31.9c0.6,0.2,1.3,0.3,2,0.1
	C268.9,31.9,268.6,31.9,267.7,31.9z M266.6,30c0.3,0,0.1-0.1,0.4-0.2C266.8,29.4,266.2,29.8,266.6,30z M263.6,32
	c0.3-0.2,0.5,0.1,0.8-0.2c-0.5,0-0.5-0.3-0.8-0.3C263.1,31.6,263.2,31.8,263.6,32z M255.5,31.6c0.4,0.2,0.7,0.2,1.1,0
	C256.3,31.5,255.9,31.5,255.5,31.6z M253.6,29.5c0.4,0.2,0.9,0,1.1-0.3c-0.1-0.1-0.1,0-0.2,0c-0.1,0-0.1-0.1-0.2-0.1
	C254.3,29.4,253.9,29.2,253.6,29.5z M237.2,31.8c0.3-0.1,0.6,0,0.8,0.1c-0.2,0.4-0.3,0-0.7,0.3c0.5,0.1,0.9,0,1.4,0.1
	c-0.1,0.1-0.3,0.2-0.2,0.2c0.3,0,0.6,0,0.5-0.3c0.5,0.2,1,0.2,1.3,0c-0.2,0.2,0.3,0.2,0.4,0c0.1,0.1,0.1,0.2,0.2,0.3
	c0.2,0,0.4-0.1,0.6-0.2c0.4,0.4,0.9,0.2,1.4,0.1c-0.2,0.1,0.2,0.3,0.2,0.4c0.8-0.4,1.9,0.4,2.4-0.2c0.3,0.3,0.6,0,0.9,0
	c0.3,0.2,0.2,0.3,0.4,0.4c0.2-0.4,0.8-0.1,1.4,0.1c0.2,0,0.4,0,0.6,0c0-0.1,0-0.1,0.1-0.2c0.5,0.1,0.6,0.1,1.2,0.1c0,0,0,0,0,0.1
	c0.3,0,0.5,0,0.8,0c0.1,0,0.1,0,0.2,0c0,0,0.1,0,0.1,0c0.6,0,1.2,0,1.8,0c0-0.1,0.1-0.1,0.2-0.2c0.3,0.2,0.7,0,1,0.1c0,0,0,0-0.1,0
	c3.6,0,7.3-0.1,11-0.2c0.9,0,1.7-0.1,2.6-0.1c0.1-0.1,0.1-0.1,0.1-0.2c-0.6,0.1-0.2-0.2-0.2-0.4c-0.5-0.1-0.5,0.2-1,0.3
	c-0.6-0.3-1.8-0.3-1.8,0.2c-0.4-0.3,0.3-0.5,0.1-0.7c-0.1,0.2-0.5,0.4-0.6,0.6c-0.4-0.2-0.8-0.2-1.2,0c-0.4-0.2,0.5-0.4-0.1-0.6
	c-0.2,0.1-0.5,0.3-0.7,0.4c0-0.4-0.5-0.2-1-0.5c-0.1,0.1,0,0.2-0.2,0.2c-0.6-0.2-1.5-0.3-1.8,0.3c-0.1-0.3-0.9-0.3-0.9,0
	c-0.5-0.6-1.1,0-1.6-0.2c0,0.3-0.1,0-0.4,0.1c0.1,0.1,0.2,0.2,0.2,0.3c-0.3,0.1-0.6,0.3-0.9,0.1c0.3-0.2,0.8,0,0.6-0.3
	c-0.7,0.2-1.4-0.5-2.1-0.4c-0.4,0.1-0.5,0.2-0.4,0.5c0.7,0.3,0.4-0.4,1-0.2c-0.4,0.2-0.1,0.5-0.2,0.7c-0.1-0.4-0.7-0.3-1.1-0.4
	c0.2-0.2,0.4-0.4,0-0.6c-0.2,0.1-0.1,0.4-0.5,0.3c0.1-0.1,0.1-0.2,0.1-0.3c-0.4,0-0.8,0.1-1.2,0.1c-0.3-0.5-1.6-0.1-2.2-0.3
	c0.1,0.1-0.1,0.2-0.1,0.3c-0.2,0-0.4-0.2-0.7,0c-0.4-0.6-0.9-0.1-1.5,0c0.2-0.2-0.4-0.1-0.3-0.3c0.3-0.2,0.5-0.3,0.8-0.2
	c-0.2-0.5-1.1-0.4-1.7-0.2c0.3,0.1,0.6-0.1,0.8,0.2c-0.9,0.2-1.8,0-2.7,0.3c-0.1,0.1,0,0.2,0.2,0.3c-0.2,0.1-0.3,0.2-0.5,0.3
	c-0.4-0.2,0.1-0.4-0.2-0.6c-0.7-0.3-0.7,0.3-1.2-0.1c-0.3,0.3,0.5,0.5,0.8,0.5c-0.3,0.3-0.9-0.2-1,0.2c-0.4-0.3,0.3-0.6-0.4-0.9
	c-0.5,0.2-2-0.1-1.8,0.7c0.5-0.2,0.9-0.2,1.3-0.2c0,0.3-0.6,0-0.4,0.4c-0.7-0.2-2,0.1-2.3-0.1c0.1,0.1,0.2,0,0.4,0
	c-0.2-0.2-0.7-0.1-0.2-0.4c0.4-0.2-0.1,0.4,0.3,0.2c0.6-0.2-0.2-0.1,0-0.4c0.5,0.1,0.4-0.4,1.1-0.3c-0.3-0.2-0.6-0.1-0.9-0.2
	c-0.2,0.2-0.3,0.5-0.7,0.3c0-0.1,0.3-0.3,0.1-0.4c-0.3,0.1-0.7,0.1-0.6,0.3c0.4-0.1,0.2,0.4,0.6,0.3c-0.4,0.3-0.7-0.1-1-0.1
	C237.4,31.6,237.1,31.7,237.2,31.8z M239.5,31.9c0.4-0.1,0.1-0.2,0.4-0.4C239.6,31.3,239,31.7,239.5,31.9z M233.2,31.9
	c1.3,0.3,2.6,0.3,3.9,0.2c-0.2-0.1-0.4-0.2-0.6-0.2c-0.1-0.2,0.3-0.4,0.3-0.5c-0.2-0.1-0.4-0.2-0.6-0.1c-0.4,0.1,0.2,0.3-0.1,0.4
	c-0.5,0.1,0-0.3-0.3-0.4c-0.2,0.2-0.4,0.1-0.6,0.2c0.2,0.3,0.5,0.2,0.7,0.3c-0.4,0.3-0.8-0.2-1.2,0.1c-0.4-0.2-0.2-0.4-0.6-0.4
	c-0.2,0.2,0,0.2,0.3,0.3C233.9,32.1,233.6,31.4,233.2,31.9z M232.1,31.6c0.3,0.2,1-0.2,0.5-0.4C232.7,31.6,232.2,31.4,232.1,31.6z
	 M231.1,31.7c0.3,0.2,0.7-0.1,1.1-0.3c-0.1-0.1-0.2-0.1-0.3-0.2C231.6,31.5,231.1,31.4,231.1,31.7z M225.9,31.6
	c0.3,0.2,0.6,0.3,0.9,0.2c-0.6-0.1-0.3-0.3-0.1-0.6C226.3,30.9,226.2,31.4,225.9,31.6z M219.6,31.6c0.2-0.2,0.4-0.2,0.6,0
	c0.1-0.3,0-0.4,0.6-0.6C220.3,30.8,219.3,31.2,219.6,31.6z M168.1,20.9c0.1,0.5,1-0.1,1.4,0.1C169.4,20.5,168.5,20.9,168.1,20.9z
	 M164.8,20.9c0.3,0.2,0.6,0.1,0.9-0.1c-0.2-0.1-0.4,0-0.6-0.2C164.8,20.7,164.9,20.8,164.8,20.9z M163.5,20.6
	c-0.1-0.1-0.2-0.2-0.4-0.3C162.7,20.6,163.2,20.9,163.5,20.6z M158.3,21c0.2,0.2,0.4,0.1,0.6,0.2c0.5-0.2,0-0.4,0.5-0.5
	c-0.2-0.2-0.4,0-0.6-0.1c-0.1,0.1-0.1,0.2,0,0.4c-0.3,0.1-0.5,0-0.3-0.2C158.2,20.6,158.4,21,158.3,21z M157,21.2
	c0.4,0.2,0.5-0.2,0.3-0.4C157.1,20.9,157.2,21,157,21.2z M156.2,20.8c0.2,0.2,0.4,0.1,0.7,0C156.7,20.6,156.4,20.7,156.2,20.8z
	 M153.8,21.2c0.4,0.1,0.9-0.2,1.3,0c0.3-0.2-0.5-0.1,0-0.5c-0.3-0.1-0.6,0.1-0.8-0.1C154.4,20.9,154.2,21,153.8,21.2z M89.5,21.8
	c0.5,0,0.5-0.5,1-0.6c-0.2-0.2,0-0.3-0.1-0.4c-0.4-0.1-0.3,0.4-0.4,0.5c-0.1,0.1-0.2-0.1-0.4-0.1C89.2,21.3,89.4,21.6,89.5,21.8z
	 M88.6,21.8c0.4,0.2,0.6-0.2,0.7-0.4c-0.4,0-0.3-0.1-0.6-0.3C87.7,21.7,89.5,21.4,88.6,21.8z M87.1,21.2c0.1,0.2-0.1,0.4,0.1,0.6
	c0,0,0,0,0,0c0,0,0,0,0,0c0,0,0,0,0,0c0.3-0.3,0.3-0.3,0.6-0.6C87.6,21,87.3,21.4,87.1,21.2z M86.4,21.8c0.2,0.1,0.4,0.2,0.6,0
	c-0.1-0.1-0.3-0.2-0.2-0.2C86.6,21.5,86.5,21.6,86.4,21.8z M69.6,23.9c0.2,0.3,0.1-0.2,0.3-0.2c0,0.1,0,0.3,0.1,0.2
	C70,23.5,69.7,23.6,69.6,23.9z M68.5,22.7c0,0.3,0.4,0.5,0.3,0.1C68.6,22.9,68.6,22.6,68.5,22.7z M68.2,24.1c0-0.5-0.2-0.6-0.4-0.6
	C67.8,24.1,68.1,24,68.2,24.1z M64.8,23.9c0.1,0,0.2-0.1,0.3-0.3C65.1,23.4,64.7,23.4,64.8,23.9z M59.1,19c0.4-0.1,0.5,0.2,0.8,0.2
	c-0.1-0.6-0.4-0.7-0.7-0.6c0.1,0,0.2,0,0.2,0.2C59.4,18.6,59.1,18.6,59.1,19z M55.5,15.7c0.1-0.1,0.3-0.1,0.2-0.4
	C55.6,15.1,55.4,15.3,55.5,15.7z M46.4,11.8c0,0.5,0.5,0.2,0.3-0.2C46.5,11.7,46.6,12,46.4,11.8z M45.5,6c0.2,0,0.2-0.5,0.2-0.8
	C45.5,5.3,45.5,5.8,45.5,6z M36.7,16.8c-0.1,0.2-0.5,0.3-0.3,0.5C36.5,17.1,36.9,17,36.7,16.8z M35,15.4c0.2,0,0.3-0.1,0.4-0.3
	c-0.2,0.2-0.2-0.4-0.4-0.4C35.1,15,35,15.1,35,15.4z M34.8,14.7c0-0.2,0-0.3,0-0.4c-0.1-0.1-0.3,0.1-0.5,0.2
	C34.5,14.6,34.6,14.8,34.8,14.7z M34.2,18.6c0.1,0.1,0.3-0.2,0.3,0.1c-0.2,0.4,0.2,0.1,0.1,1c0.2-0.2,0.5-0.2,0.5-0.7
	c0.1,0.3-0.1,0.3,0,0.6c0.2-0.1,0,0.3,0.2,0.3c0-0.3,0.1-0.5,0.1-0.9c-0.3,0-0.1-0.3-0.3-0.4c-0.1,0.2-0.2,0.3-0.3,0.4
	c-0.2-0.6,0.2-0.6,0-1.1c0.6-0.4,0.9,0,1.6-0.4c0-0.3-0.1-0.2-0.1-0.5c0.3,0,0.4-0.4,0.4-0.9c-0.2-0.1-0.5,0-0.4-0.6
	c-0.2,0.1-0.2-0.3-0.4-0.3c0,0.4,0.1,0.4,0.1,0.6c-0.4-0.1-0.8,0.6-1.1,0.2c0-0.2,0.1-0.2,0-0.4c-0.1-0.2-0.2,0.1-0.3,0.2
	c0.1-0.2,0.1-0.3-0.1-0.4c0,0.1,0,0.3,0,0.4c-0.1-0.2-0.1-0.5-0.2-0.3c0.2,0.5-0.1,0.2-0.2,0.6c0.2,0.1,0.3,0.1,0.5-0.1
	c-0.1,0.2,0,0.2,0,0.6c-0.1,0-0.3-0.1-0.2,0.3c0.3-0.1,0.3,0.4,0.5,0.7c-0.2,0-0.4-0.1-0.5,0.1c0,0.3,0.2,0.1,0.3,0.3
	c-0.1,0.3-0.2,0.1-0.4,0.1C34.3,18.3,34.2,18.4,34.2,18.6z M34.4,18.8c-0.1,0-0.1,0-0.2-0.1c0,0.2,0,0.6,0.1,0.6
	C34.2,19.1,34.4,19.1,34.4,18.8z M22.4,24.7c0.2,0,0.5,0.2,0.5-0.3C22.9,24.3,22.6,24.5,22.4,24.7z M20.7,24.3
	c0.1,0.6,0.1,0.5,0.2,1.2c0.1,0,0.2,0,0.2,0c-0.1-0.6-0.3-0.6-0.2-1.2C20.8,24.2,20.7,24.3,20.7,24.3z M19.1,26.7
	c0,0.2,0.1,0.3,0.1,0.5c0.1,0,0.2,0,0.4-0.1c0.1,0.3,0.1,0.7,0.3,0.7c0.2-0.1,0-0.5,0-0.9C19.4,27.1,19.3,26.8,19.1,26.7z M19,28.4
	c0,0.2,0,0.5,0,0.7c0.1,0,0.1,0,0.2,0C19.2,28.8,19.2,28.5,19,28.4z M15.5,33.5c0,0.5,0.3,0.4,0.2,0C15.6,33.5,15.6,33.5,15.5,33.5z
	 M15,32.4c0.2,0,0.2,0.4,0.4,0.2c0-0.3,0-0.5-0.1-0.6C15.2,32.1,15.1,32.2,15,32.4z M14.6,41.3c0,0.6,0.4,0.5,0.2,1.2
	c0.1,0,0.1-0.2,0.2-0.3c0,0.4,0.1,0.7,0.2,1c0.7-0.6,1,0.5,1.4-0.7c-0.1,0-0.2,0-0.2-0.1c0.4,0.2,0.6-0.1,1.2-0.1
	c-0.1-0.4-0.3-0.6-0.5-0.8c0,0.2,0.2,0.4,0,0.5c-0.1-0.2-0.2-0.2-0.4-0.1C16.3,40.8,15.3,41.6,14.6,41.3z M13.3,33.6
	c0,0.5,0.3,0.3,0.3,0.8c0.1-0.1,0.5,0.2,0.4-0.3c-0.1-0.3-0.2,0.5-0.2-0.1c0.1-0.2,0.3-0.4,0.3-0.8c-0.1,0-0.2-0.2-0.4-0.1
	C13.8,33.6,13.5,33.5,13.3,33.6z M13.2,41.6c0,0.5,0.1,0.7,0,1.1c0.2-0.1,0.2,0.3,0.3,0.7c0.5,0.6,0.9-0.1,1.4,0.2
	c0.1-0.5-0.4-0.5-0.2-0.8c0,0.3,0.2,0.3,0.2,0.1c-0.1-0.6-0.2-0.6-0.4-0.3c-0.1-0.4-0.1-0.7-0.3-0.8c-0.1,0.3-0.4,0-0.6,0.5
	C13.4,42.1,13.3,41.7,13.2,41.6z M12.3,40.3c0.3,0.8,0.1,1.3,0.4,2c0.2-0.1,0.3-0.4,0.3-0.8c-0.1-0.2-0.3,0-0.3-0.3
	c0.1-0.2,0.4,0.1,0.4-0.4c-0.2-0.3-0.2-0.1-0.4,0.1c-0.1-0.3-0.1-0.6,0-1C12.4,39.8,12.6,40.4,12.3,40.3z M11.5,55.9
	c-0.1,0-0.1,0.1-0.1,0.2C11.4,56,11.5,56,11.5,55.9z M30.4,18.2c0.1,0,0.3,0,0.2,0.3c0.2-0.1,0.4,0.3,0.3-0.3
	c-0.3,0.3-0.6-0.6-0.6-1.1c-0.1,0.1-0.3,0.1-0.3,0.3C30.1,17.8,30.5,17.6,30.4,18.2z M12.9,26.4c-0.1,0.1-0.3,0.1-0.2,0.4
	c0.1-0.2,0.2,0.3,0.2,0C12.8,26.7,12.9,26.6,12.9,26.4z M23.9,80.6c0-0.1,0-0.3-0.1-0.2c0,0.7,0.3,0.3,0.4,0.2
	C24,80.4,24,80.4,23.9,80.6z M101.5,12.2c0.2,0.1,0.1-0.4,0.3-0.3c0.1,0.6,0.3,0.2,0.4,0.5c-0.1-0.5,0.2,0.1,0.4-0.1
	c-0.3-0.8-1-0.4-1.4-0.7C101.2,12.4,101.4,11.7,101.5,12.2z M99.1,11.5c-0.5,0.1-0.2,0.2,0.1,0.6C99.2,11.8,99.1,11.8,99.1,11.5z
	 M92.5,82.4c0.3,0.5,0.9,0.6,1.2,0.2C93.2,83,92.9,82.1,92.5,82.4z M93.1,79.9c-0.1,0-0.1-0.1-0.2-0.2c-0.1,0-0.3,0-0.4,0.1
	C92.4,79.8,93.2,80,93.1,79.9z M86.8,75.2C87.4,75.4,87.2,74.8,86.8,75.2L86.8,75.2z M82.9,72c-0.1,0.3-0.3-0.1-0.3,0.2
	c0.2,0,0.4,0.7,0.6,0.3C83,72.5,82.8,72.3,82.9,72z M83.1,74.9c-0.1,0.5-0.1,1.2-0.2,1.5C83.2,76.5,83.1,74.7,83.1,74.9z M81.9,75.5
	c0-0.5,0.3-0.4,0.4-0.8C82.1,74.9,81.8,75.2,81.9,75.5z M78.2,10.4c-0.4-0.2-0.8-0.3-1.3-0.3c0,0.4-0.3,0.1-0.3,0.7
	C77,9.9,77.8,10.8,78.2,10.4z M75.9,76.7c0.1-0.2,0-0.5-0.1-0.6c0,0.1,0,0.3,0,0.4c-0.1-0.2-0.2-0.4-0.3-0.6c0,0.3-0.2,0.1-0.2,0.4
	C75.5,76.3,75.7,76.5,75.9,76.7z M74.8,73.4c-0.2-0.2-0.5,0.2-0.8,0.2c0,0.2,0,0.3,0.1,0.4c0,0,0.1,0,0.1,0
	c-0.1-0.7,0.4-0.1,0.5-0.3c0,0-0.1,0-0.1-0.1C74.7,73.5,74.8,73.6,74.8,73.4z M70.6,86c0-0.1-0.1-0.3-0.1-0.3
	c-0.1,0.3-0.3,0-0.5,0.3c-0.9,0.1,0.6,0.4,0.4-0.1c0.2,0.2,0.4,0.4,0.7,0C70.8,85.6,70.7,85.8,70.6,86z M67.3,21
	c-0.3-0.1-0.3,0-0.4-0.3c0.2,0,0-0.7,0.2-0.8c-0.1,0-0.1,0-0.2-0.1c0,0.4-0.1,0.9,0.1,1.5C67.1,21.2,67.3,21.3,67.3,21z M60.6,16.8
	c0.1,0,0.2-0.1,0.2-0.3c-0.2,0.2-0.3-0.7-0.4-0.2c0.1,0.1,0.2,0.1,0.2,0.3C60.7,16.7,60.6,16.7,60.6,16.8z M57.4,10
	c0.1-0.6,0.2-0.2,0.5-0.1c0-0.3,0.2-0.5,0.3-0.2c0.2-0.8-0.3-0.2-0.7-0.3c0.1-0.3,0-0.1-0.1-0.4c-0.5,0.2-1.1,0.4-1.4,0.5
	c0.4,0.4,1.2-0.7,1.4,0.3C57.4,9.9,57.3,10,57.4,10z M60.8,84.9c-0.5,0.4-1.1,0.4-1.6,0.6c0,0,0.1,0,0.1,0.1
	c-0.4,0.1-0.9,0.1-1.2,0.2c0,0,0.1,0.1,0.1,0.2c-0.5,0.3-1-0.6-1.3,0.1c0.3,0.3,0.7-0.3,0.8,0.4c0.6,0.1,1.3-0.5,1.9,0.1
	c0.3-0.7,1-0.3,1.3-0.1C60.7,86.2,60.4,85.5,60.8,84.9z M56.8,86c-0.1-0.2-0.3,0-0.4-0.2c0.1,0.9-0.5-0.3-0.5,0.4
	c0.4-0.1,0.7,0.2,0.9,0.2c0,0.1,0,0.1,0.1,0.1C56.8,86.3,56.7,86.2,56.8,86z M45.9,1.7c-0.2,0.2-0.2,0.1-0.4-0.1
	c0,0.3,0.2,0.4,0.3,0.4C45.8,1.9,45.9,1.8,45.9,1.7z M45.4,2.1c-0.2-0.1,0-0.3,0-0.5c-0.2,0-0.1,0.3-0.2,0.5
	C45.3,2.2,45.6,2.3,45.4,2.1z M47.2,86.7c-0.2,0-0.3,0.3-0.5,0.4c0,0.3,0.3,0.5,0.3,0.3c-0.1-0.1-0.2-0.4,0-0.5
	c0.1,0.1,0.5,0.8,0.5,0.1C47.3,87,47.1,87.2,47.2,86.7z M43.6,4.7c0,1,0.2,0.4,0.2,1.1C44.1,5.7,43.7,5,43.6,4.7z M45.5,87.5
	c0-0.2-0.2-0.1-0.2-0.3c0.1,0,0.2,0,0.2-0.2c-0.2,0.1-0.2-0.1-0.3-0.1c0.2,0.7,0.2,0.6,0.2,1.2c0.1-1.1,0.9-0.9,1.2-0.8
	c-0.3-0.2,0-0.6,0-1C46.2,86.7,45.7,86.7,45.5,87.5z M42.4,87.7c0.2,0.1,0.2,0.5,0.4,0.6C42.8,87.8,42.4,87.6,42.4,87.7z M36.1,11.1
	c-0.1,0.5,0.2,0.2,0.2,0.5c-0.1-0.1-0.3,0.4-0.1,0.4c0.1-0.2,0.1-0.5,0.3-0.5c0.3,0,0.6,0.6,0.8,0.1C36.9,11.3,36.5,11.1,36.1,11.1z
	 M35.6,12.2c0.3-0.2,0.2-0.4,0.3-0.9C35.7,11.5,35.6,11.7,35.6,12.2z M33.2,18.1c0.1,0.1,0.1,0.3,0.3,0.2
	C33.5,17.8,33.2,18.1,33.2,18.1z M30.5,13.2c-0.2-0.2-0.4,0-0.3-0.6c-0.2-0.3-0.6-0.3-0.6,0.3C30,13.1,30.1,13.2,30.5,13.2z
	 M27.1,12.1c-0.1,0,0-0.3,0-0.4c-0.1,0-0.2-0.2-0.2-0.2C26.9,11.9,27.1,12.3,27.1,12.1z M25.7,22.8c-0.2-0.3-0.4,0-0.4,0.2
	C25.5,22.7,25.6,23.1,25.7,22.8z M25.7,76.8c0.1-0.6,0.1,0.2,0.1,0.2c-0.1-0.3,0.3,0,0.2-0.3c-0.2,0-0.3-0.2-0.2-0.6
	C25.6,76.2,25.4,76.7,25.7,76.8z M25,77.9c0.1,0.3-0.2,0.5,0,0.6c0.2-0.3,0.6-0.2,0.6-0.7C25.4,78,25.2,78.5,25,77.9z M23.7,23.1
	c-0.5,0,0.1-0.9-0.3-1.2c-0.3,0.3,0.2,0.7-0.1,0.9c0,0.4,0,0.7,0.1,0.8C23.3,22.6,23.7,23.7,23.7,23.1z M25.5,90.1
	C25.5,90,25.5,90,25.5,90.1c0,0,0,0,0,0.1c0,0-0.1,0-0.1,0.1c0.2-0.1,0.2,0.2,0.4,0.1c0-0.3,0-0.5,0-0.6
	C25.6,89.8,25.7,90.2,25.5,90.1z M24.3,78.3c-0.3-0.2-0.7-0.7-1-0.6c0.3,0,0.2,0.9,0.4,0.3C23.9,78.3,24.3,79.1,24.3,78.3z
	 M22.8,78.3c-0.1,0.4-0.3-0.4-0.4-0.4c0.1-0.1,0.2-0.4,0-0.5c0.1-0.2,0.2-0.3,0.4-0.3c0-0.1-0.1-0.2-0.1-0.4c-0.1,0-0.3,0.2-0.2-0.2
	c-0.1,0-0.2,0-0.2,0.2C22.1,76.4,22,76.2,22,76c0.1-0.3,0.2-0.1,0.4-0.1c-0.1,0.6,0,0.1,0.2,0.5c0-0.4-0.1-0.3-0.1-0.6
	c0.2-0.1,0.2,0.2,0.3,0.3c0,0.2-0.1,0.3-0.2,0.3c0.1,0.4,0.2,0.6,0.4,0.7c0.1-0.2,0.2-0.5,0.3-0.3c0,0.4-0.4,0.3-0.2,0.8
	c-0.1,0-0.1-0.1-0.2-0.1c-0.1,0.2-0.1,0.3,0,0.6c0.1-0.4,0.5,0,0.4-0.5c0.1,0.1,0.1,0.2,0.1,0.5c-0.1,0-0.2,0-0.2,0.1
	c0,0.2,0.2,0,0.2,0.2c-0.1,0.2-0.1,0.5-0.2,0.5c0.2-0.7-0.3-0.6-0.6-0.8C22.6,78.1,22.7,78.3,22.8,78.3z M22.8,77.1
	c0,0.2-0.2,0.1-0.2,0.5C22.8,77.7,22.9,77.2,22.8,77.1z M24,89.1c0.1,0.1-0.1,0.5,0.1,0.6c0-0.6,0.4,0.1,0.4-0.2
	c-0.2-0.2-0.4-0.3-0.4-0.8C24.1,89,23.9,88.8,24,89.1z M21.8,20.3c0,0,0.1,0,0.1,0c0-0.1,0-0.2,0.1-0.3c-0.1,0-0.1-0.1-0.1-0.2
	c0,0,0.1,0,0.1-0.1c0,0-0.1,0-0.1,0c0,0-0.1,0-0.1,0.1C21.9,19.9,21.8,20,21.8,20.3z M21.2,64.4c0-0.4-0.2,0.3-0.2-0.1
	c0.1-0.2,0.1-0.4,0.3-0.4c0,0.1,0,0.2,0.1,0.2c-0.1-0.3,0-0.4-0.1-0.5c-0.2,0.3-0.4,0.3-0.6,0.7C20.9,64.3,21.2,65,21.2,64.4z
	 M19.3,23.2c0.2,0,0.6,0.4,0.5,0.2c-0.3-0.1-0.1-0.4-0.2-0.8c0.2,0.1-0.1-0.3,0.3-0.3c-0.1-0.5-0.2-0.3-0.4-0.5c0,0.2,0,0.4-0.1,0.5
	c-0.1,0-0.1-0.2-0.1,0C19.5,22.3,19.6,23,19.3,23.2z M18.4,72.4c-0.3,0.2-0.7,0-0.6,0.5c0.1-0.2,0.4,0,0.5-0.3
	c0.1,0.3,0.1,0.9,0,1.2c0.2-0.1,0.5,0,0.8-0.4C18.4,73.9,18.3,73.3,18.4,72.4z M17.3,65.5c-0.1-0.4-0.4-0.4-0.4-0.1
	C17.1,65.3,17.1,65.4,17.3,65.5z M16.1,64.8c0,0.1,0,0.1-0.1,0.1c0,0-0.1,0-0.1,0.1c0.1,0.3,0.2,0.3,0.2,0.3c0,0.2-0.1,0.1-0.1,0.3
	c0.1,0,0.1,0.3,0.1,0.6c0.3,0.1,0.6,0.1,1,0.3c0-0.4-0.3-0.2-0.3-0.7c0.2-0.1,0.1,0.2,0.2,0.2c0-0.2,0-0.3,0-0.5
	c-0.2,0-0.2,0.3-0.5,0.2c-0.1-0.1,0-0.6-0.1-0.6c0,0.2-0.1,0-0.1-0.1c0.1,0,0.2-0.1,0.3-0.3C16.6,64.9,16.2,65.5,16.1,64.8z
	 M16.6,74.7c-0.1,0-0.2,0-0.2-0.1c-0.1,0.5-0.7,0.4,0,0.4C16.4,74.9,16.8,74.5,16.6,74.7z M9.8,44.4c0,0.2-0.2,0.1-0.2,0.3
	c0.1,0.2,0.5,0.2,0.4-0.1c-0.1,0-0.1,0.2-0.2,0.1C9.9,44.5,9.9,44.4,9.8,44.4z M9.5,67.1c-0.1,0.1,0,0.5-0.2,0.4
	c0-0.1-0.1-0.1-0.1,0c0.2,0.1,0.1,0.2,0.1,0.5c0.2,0.2,0-0.4,0.2-0.4c0,0.2,0.2-0.2,0.2,0.3c0,0.3-0.2,0.2-0.2,0.5
	c0.1,0.2,0.3,0,0.4,0.2c-0.1-0.6,0.8-0.4,0.9-1.2C10.3,67.2,9.9,67.4,9.5,67.1z M9,66.4c0,0-0.1-0.6-0.1-0.2c0,0.2,0.1,0.2,0.1,0.4
	c0.2,0,0.1-0.2,0.2,0c0-0.2,0.1-0.3,0.1-0.4C9.2,65.8,9.2,66.3,9,66.4z M-1.8,73.1c0.1,0.4,0.4,0.7,0.6,1c0,0.3-0.1,0.4-0.1,0.7
	c0.6,0.6,2,1.8,2.3-0.1c-0.5-1.5-1.7-1.3-2.4-2.2c0,0.3,0.1,0.2,0.1,0.5C-1.4,73.3-1.6,73-1.8,73.1z M-1.6,72.6
	c0-0.3-0.1-0.4-0.3-0.5c-0.1,0.1-0.1,0.5-0.3,0.4c-0.1-0.5,0-0.6,0.2-0.8c-0.2,0.1-0.2-0.2-0.4-0.1c0,0.6,0.2,0.8,0.3,1.2
	C-1.9,72.7-1.7,72.7-1.6,72.6z M97.3,13.4c0,0.5,0.3,1.1,0.4,0.5c0.3,0.8,1,1.4,1.6,1c0.3,0.3,0.8,1,1.2,0.4
	c0.1,0.4,0.5,0.1,0.6,0.3c0-0.1,0-0.3,0.1-0.3c0.8,0.7,1.6,0.2,2.5,0.7c0-0.6,0.4-0.1,0.5-0.4c-0.2-0.1-0.3-0.4-0.6-0.5
	c0,0.1,0,0.3,0,0.4c-0.1-0.1-0.2-0.2-0.2-0.5c0-0.4,0.3-0.1,0.2-0.5c-1,1.1-1.8-1.6-2.7-0.6c0-0.2-0.1-0.3-0.1-0.3
	c-0.2,0.7-0.6-0.4-0.8,0.2c0-0.6-0.5-0.3-0.6-0.2c-0.4-0.8-1-0.1-1.5-0.6c-0.1,0.2-0.2,0.2-0.2,0.4c0-0.5-0.2-0.4-0.1,0
	c-0.1,0-0.2,0.1-0.2,0.2c0-0.4,0.1-0.4,0-0.6c-0.2-0.1-0.1,0.6-0.2,0c-0.2,0.1-0.3,0.4-0.2,0.6C97.3,13.7,97.3,13.5,97.3,13.4z
	 M43.5,5c-0.1-0.1-0.2-0.2-0.2-0.3c0.2-0.7,0.4,0,0.7-0.6c0,0.3-0.2,0.4,0.1,0.4c0.1-0.2,0-0.3,0-0.6c0.2,0.3,0.2-0.4,0-0.3
	c0.2-0.4,0.5-0.3,0.7-0.8c-0.3-0.3-0.2-0.5-0.6-0.6c0-0.3,0.4-0.4,0.2-0.8c-0.1,0.4-0.7,0.6-0.2,0.8c-0.7-0.1-0.6,0.5-1,1
	c0.2-0.1,0.4,0,0.5,0.2c0,0.7-0.5,0-0.6,0.3c0.1,0.1,0.2,0.7-0.2,0.6C43.1,4.5,43,5.5,43.5,5z M38.4,12c-0.1,0.2-0.3,0.3-0.3,0.7
	c0.1,0,0.2,0,0.4-0.1C38.4,12.4,38.4,12.2,38.4,12z M10,50.6c0.1,0.7,0.8,0.4,0.8-0.2c0.1,0,0.4,0.5,0.5,0.2
	c-0.1-0.3,0.3-0.6,0.6-0.7c0,0.2,0,0.5,0.1,0.5c0-1,0.8-0.5,0.9-1c-1,0.1-1.7,1-2.6,0.8c-0.1,0.4,0.2,0,0.2,0.3
	C10,50.3,10.3,50.8,10,50.6z M4.5,61.4c0,0.2,0,0.4,0,0.6c0.4,0.7,0.9-0.4,1,0.2c0-0.8,0.5-0.4,0.6-0.9c0.1,0.3-0.1,0.6,0.1,0.7
	c0.3-0.2,0.2-0.9,0.6-0.9c0,0.2,0.2,0.1,0.1,0.5c0.3-0.2,0.3-0.1,0.5,0.1c0.1-0.8,1-0.1,1.2-1c-0.5,0.3-1.6,0.9-1.8-0.1
	C6.9,60.3,6.9,60,6.8,60c0,0.2,0,0.5-0.2,0.4c-0.3-1.5-1.5-0.2-1.9,0.3c0-0.1,0-0.3-0.1-0.4c-0.1,0.5-0.3,0.6-0.4,1
	C4.3,61.6,4.4,61.5,4.5,61.4z M3,76.2c-0.2-0.1-0.3,0.2-0.3,0.4c0.2-0.1,0.4-0.1,0.4,0.3c0.5,0,0.7-0.2,1-0.5c0-0.2-0.3,0-0.3-0.2
	C3.9,75.9,4,76,4,75.7c-0.2,0.1-0.1-0.2-0.2-0.3c-0.3,0.3-0.4,0-0.6-0.3c-0.1,0.1-0.1,0.3-0.2,0.4c-0.2-0.3-0.4-0.8-0.7-0.9
	c0,0.7,0.2,0.6,0.2,1.3C2.7,75.9,2.9,75.9,3,76.2z"/>
<g>
</g>
<g>
</g>
<g>
</g>
<g>
</g>
<g>
</g>
<g>
</g>
</svg>
